{"text_format":"2","workbook":"xlsx","n_sheets":7,"sheets":["ORÇAMENTO","CPU-SERV","AUX.-VEIC.","CPU-FORNEC","BDI SERV","BDI FORN","CRONOGRAMA"],"not_rendered":{"charts":0,"images":3,"macros":0,"external_links":1,"defined_names":10,"comments":2,"pivot_tables":0},"unopened":[],"bounds":{"document_bytes":16777216,"sheet_cells":100000,"run_cost":"one","rows_first":2000,"rows_last":500,"rows_between":2000,"halvings":0,"cell_chars":16384,"cell_head_chars":4096},"cells_cut":0,"cells_raw":0,"read":"whole","date_system":"1900"}

{"sheet":"ORÇAMENTO","index":0,"n_rows":66,"n_cols":12,"rows_kept":66,"cut":false,"hidden":false,"merged":[[31,15,31,16],[58,15,58,16],[6,8,6,10],[7,1,7,11],[16,15,16,16],[25,15,25,16],[28,15,28,16],[9,15,9,16],[7,13,9,13],[65,1,65,4],[0,0,8,0],[0,4,0,11],[1,4,1,11],[2,4,2,11],[6,1,6,4],[4,2,4,7],[5,2,5,7],[4,8,4,10],[5,8,5,10]]}
["<---- NUMERAR SERVIÇOS PARA CPU",null,null,null,"Ministério do Desenvolvimento Regional"]
[{"$nulls":4},"Companhia de Desenvolvimento dos Vales do São Francisco e do Parnaíba"]
[{"$nulls":4},"1ª Superintendência Regional"]
[]
[null,"OBRA: "," PAVIMENTAÇÃO ASFÁLTICA EM CBUQ - ESTRADA PARA SANTO ANTÔNIO DA BOA VISTA (SÃO JOÃO DA PONTE / MG)",{"$nulls":5},"BDI Serviços (%):",null,null,{"$f":"'BDI SERV'!E28","v":22}]
[null,"DATA:"," AGOSTO / 2025",{"$nulls":5},"BDI Diferenciado Serviços (%):",null,null,{"$f":"'BDI FORN'!D31","v":15}]
[null," PRAZO DE EXECUÇÃO:     240 DIAS",{"$nulls":6},"BDI Fornecimentos (%):",null,null,{"$f":"'BDI FORN'!D31","v":15}]
[null,"PLANILHA DE ORÇAMENTAÇÃO"]
[null,"ITEM","CÓDIGO","FONTE","DISCRIMINAÇÃO","TIPO","UNID.","QUANT.","VR.UNIT.S/BDI","PR. UNIT.C/BDI","C. TOT.S/BDI","P. TOT.C/BDI"]
["A",1,null,null,"SERVIÇOS PRELIMINARES ",{"$nulls":5},{"$f":"SUM(K11:K16)","v":355728.34},{"$f":"SUM(L11:L16)","v":433708.52999999997}]
[1,"1.1","CPU.1","CODEVASF","MOBILIZAÇÃO E DESMOBILIZAÇÃO","SERV","GL",1,{"$f":"VLOOKUP(A11,'CPU-SERV'!A:K,11,0)","v":13978.63},{"$f":"TRUNC(_xlfn.IFS(F11=\"SERV\",I11*(1+$L$5/100),F11=\"SERV DIF\",I11*(1+$L$6/100),F11=\"FORN\",I11*(1+$L$7/100)),2)","v":17053.919999999998},{"$f":"TRUNC(H11*I11,2)","v":13978.63},{"$f":"TRUNC(H11*J11,2)","v":17053.919999999998}]
[2,"1.2","CPU.2","CODEVASF","ADMINISTRAÇÃO LOCAL ","SERV","GL",1,{"$f":"VLOOKUP(A12,'CPU-SERV'!A:K,11,0)","v":264441.435},{"$f":"TRUNC(_xlfn.IFS(F12=\"SERV\",I12*(1+$L$5/100),F12=\"SERV DIF\",I12*(1+$L$6/100),F12=\"FORN\",I12*(1+$L$7/100)),2)","v":322618.55},{"$f":"TRUNC(H12*I12,2)","v":264441.43},{"$f":"TRUNC(H12*J12,2)","v":322618.55}]
[3,"1.3","CPU.3","CODEVASF","CANTEIRO DE OBRAS ","SERV","GL",1,{"$f":"VLOOKUP(A13,'CPU-SERV'!A:K,11,0)","v":18464.22},{"$f":"TRUNC(_xlfn.IFS(F13=\"SERV\",I13*(1+$L$5/100),F13=\"SERV DIF\",I13*(1+$L$6/100),F13=\"FORN\",I13*(1+$L$7/100)),2)","v":22526.34},18464.22,22526.34]
[4,"1.4",103689,"SINAPI","PLACA DE OBRA EM CHAPA DE AÇO GALVANIZADO","SERV","M2",4,{"$f":"VLOOKUP(A14,'CPU-SERV'!A:K,11,0)","v":550.64},{"$f":"TRUNC(_xlfn.IFS(F14=\"SERV\",I14*(1+$L$5/100),F14=\"SERV DIF\",I14*(1+$L$6/100),F14=\"FORN\",I14*(1+$L$7/100)),2)","v":671.78},2202.56,2687.12]
[5,"1.5","CPU.4","CODEVASF","VEÍCULO PARA A FISCALIZAÇÃO, MÁXIMO 02 ANOS DE USO OU 50.000KM, PREFERENCIALMENTE NA COR BRANCA, COM IDENTIFICAÇÃO CONFORME ESPECIFICAÇÕES DA CODEVASF, INCLUSIVE COMBUSTÍVEL, MANUTENÇÃO, SEGURO E IMPOSTOS - CONFORME ESPECIFICAÇÕES","SERV","MÊS",10,{"$f":"VLOOKUP(A15,'CPU-SERV'!A:K,11,0)","v":4264.1499999999996},{"$f":"TRUNC(_xlfn.IFS(F15=\"SERV\",I15*(1+$L$5/100),F15=\"SERV DIF\",I15*(1+$L$6/100),F15=\"FORN\",I15*(1+$L$7/100)),2)","v":5202.26},{"$f":"TRUNC(H15*I15,2)","v":42641.5},{"$f":"TRUNC(H15*J15,2)","v":52022.6}]
[6,"1.6",78472,"SINAPI","SERVIÇOS TOPOGRÁFICOS PARA PAVIMENTAÇÃO, INCLUSIVE LEVANTAMENTO PLANIALTIMÉTRICO CADASTRAL, GERAÇÃO DE NOTAS DE SERVIÇO, SEÇÕES TRANSVERSAIS E GREIDE, ESTAQUEAMENTO E ACOMPANHAMENTO EXECUTIVO","SERV","M2",35000,{"$f":"VLOOKUP(A16,'CPU-SERV'!A:K,11,0)","v":0.4},{"$f":"TRUNC(_xlfn.IFS(F16=\"SERV\",I16*(1+$L$5/100),F16=\"SERV DIF\",I16*(1+$L$6/100),F16=\"FORN\",I16*(1+$L$7/100)),2)","v":0.48},14000,16800]
["B",2,null,null,"TERRAPLANAGEM E PAVIMENTAÇÃO",{"$nulls":5},{"$f":"SUM(K18:K25)","v":2324666},{"$f":"SUM(L18:L25)","v":2835730}]
[7,"2.1",5502114,"SICRO","ESCAVAÇÃO, CARGA E TRANSPORTE DE MATERIAL DE 1ª CATEGORIA - DMT 1.000 A 1.200M, CAMINHO DE SERVIÇO EM REVESTIMENTO PRIMÁRIO","SERV","M3",30000,{"$f":"VLOOKUP(A18,'CPU-SERV'!A:K,11,0)","v":6.88},{"$f":"TRUNC(_xlfn.IFS(F18=\"SERV\",I18*(1+$L$5/100),F18=\"SERV DIF\",I18*(1+$L$6/100),F18=\"FORN\",I18*(1+$L$7/100)),2)","v":8.39},{"$f":"TRUNC(H18*I18,2)","v":206400},{"$f":"TRUNC(H18*J18,2)","v":251700}]
[8,"2.2",4413942,"SICRO","ESPALHAMENTO DE MATERIAL EM BOTA FORA","SERV","M3",23000,{"$f":"VLOOKUP(A19,'CPU-SERV'!A:K,11,0)","v":2},{"$f":"TRUNC(_xlfn.IFS(F19=\"SERV\",I19*(1+$L$5/100),F19=\"SERV DIF\",I19*(1+$L$6/100),F19=\"FORN\",I19*(1+$L$7/100)),2)","v":2.44},{"$f":"TRUNC(H19*I19,2)","v":46000},{"$f":"TRUNC(H19*J19,2)","v":56120}]
[9,"2.3",5502978,"SICRO","COMPACTAÇÃO DE ATERROS A 100% DO PROCTOR NORMAL","SERV","M3",7000,{"$f":"VLOOKUP(A20,'CPU-SERV'!A:K,11,0)","v":5.08},{"$f":"TRUNC(_xlfn.IFS(F20=\"SERV\",I20*(1+$L$5/100),F20=\"SERV DIF\",I20*(1+$L$6/100),F20=\"FORN\",I20*(1+$L$7/100)),2)","v":6.19},35560,43330]
[10,"2.3",4011209,"SICRO","REGULARIZAÇÃO E COMPACTAÇÃO DO SUBLEITO ","SERV","M2",35000,{"$f":"VLOOKUP(A21,'CPU-SERV'!A:K,11,0)","v":1.56},{"$f":"TRUNC(_xlfn.IFS(F21=\"SERV\",I21*(1+$L$5/100),F21=\"SERV DIF\",I21*(1+$L$6/100),F21=\"FORN\",I21*(1+$L$7/100)),2)","v":1.9},54600,66500]
[11,"2.4",4011276,"SICRO","EXECUÇÃO E COMPACTAÇÃO DE BASE E OU SUB BASE PARA PAVIMENTAÇÃO DE BICA CORRIDA - EXCLUSIVE TRANSPORTE","SERV","M3",7000,{"$f":"VLOOKUP(A22,'CPU-SERV'!A:K,11,0)","v":164.01},{"$f":"TRUNC(_xlfn.IFS(F22=\"SERV\",I22*(1+$L$5/100),F22=\"SERV DIF\",I22*(1+$L$6/100),F22=\"FORN\",I22*(1+$L$7/100)),2)","v":200.09},1148070,1400630]
[12,"2.5",4011352,"SICRO","IMPRIMAÇÃO COM EMULSÃO ASFÁLTICA (EAI)","SERV","M2",35000,{"$f":"VLOOKUP(A23,'CPU-SERV'!A:K,11,0)","v":0.41},{"$f":"TRUNC(_xlfn.IFS(F23=\"SERV\",I23*(1+$L$5/100),F23=\"SERV DIF\",I23*(1+$L$6/100),F23=\"FORN\",I23*(1+$L$7/100)),2)","v":0.5},{"$f":"TRUNC(H23*I23,2)","v":14350},{"$f":"TRUNC(H23*J23,2)","v":17500}]
[13,"2.6",4011353,"SICRO","PINTURA DE LIGAÇÃO COM EMULSÃO ASFÁLTICA RR-1C","SERV","M2",35000,{"$f":"VLOOKUP(A24,'CPU-SERV'!A:K,11,0)","v":0.28000000000000003},{"$f":"TRUNC(_xlfn.IFS(F24=\"SERV\",I24*(1+$L$5/100),F24=\"SERV DIF\",I24*(1+$L$6/100),F24=\"FORN\",I24*(1+$L$7/100)),2)","v":0.34},9800,11900]
[14,"2.7",4011463,"SICRO","EXECUÇÃO DE PAVIMENTO COM APLICAÇÃO DE CONCRETO ASFÁLTICO USINADO A QUENTE (CBUQ), CAMADA DE ROLAMENTO - EXCLUSIVE TRANSPORTE","SERV","T",4200,{"$f":"VLOOKUP(A25,'CPU-SERV'!A:K,11,0)","v":192.83},{"$f":"TRUNC(_xlfn.IFS(F25=\"SERV\",I25*(1+$L$5/100),F25=\"SERV DIF\",I25*(1+$L$6/100),F25=\"FORN\",I25*(1+$L$7/100)),2)","v":235.25},809886,988050]
["C",3,null,null,"TRANSPORTE DE MATERIAIS",{"$nulls":5},{"$f":"SUM(K27:K28)","v":495720},{"$f":"SUM(L27:L28)","v":600840}]
[15,"3.1",5915321,"SICRO","TRANSPORTE COM CAMINHÃO BASCULANTE, EM VIA URBANA PAVIMENTADA","SERV","TXKM",720000,{"$f":"VLOOKUP(A27,'CPU-SERV'!A:K,11,0)","v":0.66},{"$f":"TRUNC(_xlfn.IFS(F27=\"SERV\",I27*(1+$L$5/100),F27=\"SERV DIF\",I27*(1+$L$6/100),F27=\"FORN\",I27*(1+$L$7/100)),2)","v":0.8},{"$f":"TRUNC(H27*I27,2)","v":475200},{"$f":"TRUNC(H27*J27,2)","v":576000}]
[16,"3.2",5914434,"SICRO","TRANSPORTE COM CAMINHÃO CARROCERIA 9T, EM VIA URBANA PAVIMENTADA","SERV","TXKM",27000,{"$f":"VLOOKUP(A28,'CPU-SERV'!A:K,11,0)","v":0.76},{"$f":"TRUNC(_xlfn.IFS(F28=\"SERV\",I28*(1+$L$5/100),F28=\"SERV DIF\",I28*(1+$L$6/100),F28=\"FORN\",I28*(1+$L$7/100)),2)","v":0.92},20520,24840]
["D",4,null,null,"TRANSPORTE DE MATERIAL ASFÁLTICO (BDI DIFERENCIADO)",{"$nulls":5},{"$f":"SUM(K30:K31)","v":421737},{"$f":"SUM(L30:L31)","v":484215}]
[17,"4.1",5914612,"SICRO","TRANSPORTE DE MASSA ASFÁLTICA COM CAMINHÃO BASCULANTE COM CAÇAMBA TÉRMICA, EM VIA URBANA PAVIMENTADA (BDI DIFERENCIADO)","SERV DIF","TXKM",520000,{"$f":"VLOOKUP(A30,'CPU-SERV'!A:K,11,0)","v":0.81},{"$f":"TRUNC(_xlfn.IFS(F30=\"SERV\",I30*(1+$L$5/100),F30=\"SERV DIF\",I30*(1+$L$6/100),F30=\"FORN\",I30*(1+$L$7/100)),2)","v":0.93},{"$f":"TRUNC(H30*I30,2)","v":421200},{"$f":"TRUNC(H30*J30,2)","v":483600}]
[18,"4.2",5914622,"SICRO","TRANSPORTE COM CAMINHÃO TANQUE DE TRANSPORTE DE MATERIAL ASFÁLTICO DE 30000 L, EM VIA URBANA PAVIMENTADA (BDI DIFERENCIADO)","SERV DIF","TXKM",300,{"$f":"VLOOKUP(A31,'CPU-SERV'!A:K,11,0)","v":1.79},{"$f":"TRUNC(_xlfn.IFS(F31=\"SERV\",I31*(1+$L$5/100),F31=\"SERV DIF\",I31*(1+$L$6/100),F31=\"FORN\",I31*(1+$L$7/100)),2)","v":2.0499999999999998},537,615]
["E",5,null,null,"DRENAGEM E OBRAS COMPLEMENTARES",{"$nulls":5},{"$f":"SUM(K33:K58)","v":773267.1100000001},{"$f":"SUM(L33:L58)","v":943328.28}]
[19,"5.1",2003947,"SICRO","MEIO FIO DE CONCRETO - MFC 05, MOLDADO NO LOCAL - AREIA E BRITA COMERCIAIS","SERV","M",920,{"$f":"VLOOKUP(A33,'CPU-SERV'!A:K,11,0)","v":21.61},{"$f":"TRUNC(_xlfn.IFS(F33=\"SERV\",I33*(1+$L$5/100),F33=\"SERV DIF\",I33*(1+$L$6/100),F33=\"FORN\",I33*(1+$L$7/100)),2)","v":26.36},{"$f":"TRUNC(H33*I33,2)","v":19881.2},{"$f":"TRUNC(H33*J33,2)","v":24251.200000000001}]
[20,"5.2",2003943,"SICRO","MEIO FIO DE CONCRETO - MFC 03, MOLDADO NO LOCAL - AREIA E BRITA COMERCIAIS","SERV","M",230,{"$f":"VLOOKUP(A34,'CPU-SERV'!A:K,11,0)","v":27.5},{"$f":"TRUNC(_xlfn.IFS(F34=\"SERV\",I34*(1+$L$5/100),F34=\"SERV DIF\",I34*(1+$L$6/100),F34=\"FORN\",I34*(1+$L$7/100)),2)","v":33.549999999999997},6325,7716.5]
[21,"5.3",2003261,"SICRO","SARJETA TRIANGULAR DE CONCRETO - STC 80-15 - ESCAVAÇÃO MECÂNICA - AREIA E BRITA COMERCIAIS","SERV","M",3000,{"$f":"VLOOKUP(A35,'CPU-SERV'!A:K,11,0)","v":47.29},{"$f":"TRUNC(_xlfn.IFS(F35=\"SERV\",I35*(1+$L$5/100),F35=\"SERV DIF\",I35*(1+$L$6/100),F35=\"FORN\",I35*(1+$L$7/100)),2)","v":57.69},141870,173070]
[22,"5.4",2003387,"SICRO","ENTRADA PARA DESCIDA D'ÁGUA - EDA 02 - AREIA E BRITA COMERCIAIS","SERV","UNID.",12,{"$f":"VLOOKUP(A36,'CPU-SERV'!A:K,11,0)","v":73.959999999999994},{"$f":"TRUNC(_xlfn.IFS(F36=\"SERV\",I36*(1+$L$5/100),F36=\"SERV DIF\",I36*(1+$L$6/100),F36=\"FORN\",I36*(1+$L$7/100)),2)","v":90.23},887.52,1082.76]
[23,"5.5",2003389,"SICRO","DESCIDA D'ÁGUA DE ATERRO TIPO RÁPIDO - DAR 01 - AREIA E BRITA COMERCIAIS","SERV","M",45,{"$f":"VLOOKUP(A37,'CPU-SERV'!A:K,11,0)","v":227.95},{"$f":"TRUNC(_xlfn.IFS(F37=\"SERV\",I37*(1+$L$5/100),F37=\"SERV DIF\",I37*(1+$L$6/100),F37=\"FORN\",I37*(1+$L$7/100)),2)","v":278.08999999999997},10257.75,12514.05]
[24,"5.6",2003455,"SICRO","DISSIPADOR DE ENERGIA - DEB 04 - AREIA, BRITA E PEDRA DE MÃO COMERCIAIS","SERV","UNID.",12,{"$f":"VLOOKUP(A38,'CPU-SERV'!A:K,11,0)","v":1368.85},{"$f":"TRUNC(_xlfn.IFS(F38=\"SERV\",I38*(1+$L$5/100),F38=\"SERV DIF\",I38*(1+$L$6/100),F38=\"FORN\",I38*(1+$L$7/100)),2)","v":1669.99},16426.2,20039.88]
[25,"5.7",2003481,"SICRO","CAIXA COLETORA DE SARJETA - CCS 03 - COM GRELHA DE CONCRETO - TCC 01 - AREIA E BRITA COMERCIAIS","SERV","UNID.",6,{"$f":"VLOOKUP(A39,'CPU-SERV'!A:K,11,0)","v":3763.8},{"$f":"TRUNC(_xlfn.IFS(F39=\"SERV\",I39*(1+$L$5/100),F39=\"SERV DIF\",I39*(1+$L$6/100),F39=\"FORN\",I39*(1+$L$7/100)),2)","v":4591.83},22582.799999999999,27550.98]
[26,"5.8",804317,"SICRO","BOCA PARA BUEIRO TRIPLO TUBULAR DE CONCRETO (BTTC), D=1,0M - AREIA E BRITA COMERCIAIS","SERV","UNID.",2,{"$f":"VLOOKUP(A40,'CPU-SERV'!A:K,11,0)","v":2815.77},{"$f":"TRUNC(_xlfn.IFS(F40=\"SERV\",I40*(1+$L$5/100),F40=\"SERV DIF\",I40*(1+$L$6/100),F40=\"FORN\",I40*(1+$L$7/100)),2)","v":3435.23},5631.54,6870.46]
[27,"5.9",804292,"SICRO","CORPO DE BUEIRO TRIPLO TUBULAR DE CONCRETO (BTTC), D=1,0M - PA-1 - AREIA E BRITA COMERCIAIS","SERV","M",27,{"$f":"VLOOKUP(A41,'CPU-SERV'!A:K,11,0)","v":2391.11},{"$f":"TRUNC(_xlfn.IFS(F41=\"SERV\",I41*(1+$L$5/100),F41=\"SERV DIF\",I41*(1+$L$6/100),F41=\"FORN\",I41*(1+$L$7/100)),2)","v":2917.15},64559.97,78763.05]
[28,"5.10",804121,"SICRO","BOCA PARA BUEIRO SIMPLES TUBULAR DE CONCRETO (BSTC), D=1,0M - AREIA E BRITA COMERCIAIS","SERV","UNID.",3,{"$f":"VLOOKUP(A42,'CPU-SERV'!A:K,11,0)","v":1923.98},{"$f":"TRUNC(_xlfn.IFS(F42=\"SERV\",I42*(1+$L$5/100),F42=\"SERV DIF\",I42*(1+$L$6/100),F42=\"FORN\",I42*(1+$L$7/100)),2)","v":2347.25},5771.94,7041.75]
[29,"5.11",804037,"SICRO","CORPO DE BUEIRO SIMPLES TUBULAR DE CONCRETO (BSTC), D=1,0M - PA-1 - AREIA E BRITA COMERCIAIS","SERV","M",200,{"$f":"VLOOKUP(A43,'CPU-SERV'!A:K,11,0)","v":911.85},{"$f":"TRUNC(_xlfn.IFS(F43=\"SERV\",I43*(1+$L$5/100),F43=\"SERV DIF\",I43*(1+$L$6/100),F43=\"FORN\",I43*(1+$L$7/100)),2)","v":1112.45},182370,222490]
[30,"5.12",2003683,"SICRO","POÇO DE VISITA TIPO PVI-04 - AREIA E BRITA COMERCIAIS","SERV","UNID.",2,{"$f":"VLOOKUP(A44,'CPU-SERV'!A:K,11,0)","v":2514.75},{"$f":"TRUNC(_xlfn.IFS(F44=\"SERV\",I44*(1+$L$5/100),F44=\"SERV DIF\",I44*(1+$L$6/100),F44=\"FORN\",I44*(1+$L$7/100)),2)","v":3067.99},5029.5,6135.98]
[31,"5.13",2003720,"SICRO","CHAMINÉ PARA POÇOS DE VISITA - CPVI-04 - AREIA E BRITA COMERCIAIS","SERV","UNID.",2,{"$f":"VLOOKUP(A45,'CPU-SERV'!A:K,11,0)","v":2281.5300000000002},{"$f":"TRUNC(_xlfn.IFS(F45=\"SERV\",I45*(1+$L$5/100),F45=\"SERV DIF\",I45*(1+$L$6/100),F45=\"FORN\",I45*(1+$L$7/100)),2)","v":2783.46},4563.0600000000004,5566.92]
[32,"5.14",4805757,"SICRO","ESCAVAÇÃO MECÂNICA DE VALAS EM MATERIAL DE 1ª CATEGORIA","SERV","M3",1200,{"$f":"VLOOKUP(A46,'CPU-SERV'!A:K,11,0)","v":6.85},{"$f":"TRUNC(_xlfn.IFS(F46=\"SERV\",I46*(1+$L$5/100),F46=\"SERV DIF\",I46*(1+$L$6/100),F46=\"FORN\",I46*(1+$L$7/100)),2)","v":8.35},8220,10020]
[33,"5.15",4805756,"SICRO","APILOAMENTO MANUAL DE FUNDO DE VALA","SERV","M2",600,{"$f":"VLOOKUP(A47,'CPU-SERV'!A:K,11,0)","v":4.82},{"$f":"TRUNC(_xlfn.IFS(F47=\"SERV\",I47*(1+$L$5/100),F47=\"SERV DIF\",I47*(1+$L$6/100),F47=\"FORN\",I47*(1+$L$7/100)),2)","v":5.88},2892,3528]
[34,"5.16",2106292,"SICRO","ESCORAMENTO CONTÍNUO DE VALAS COM TÁBUAS E LONGARINAS, PROFUNDIDADE ATÉ 4,0M - CONFECÇÃO, INSTALAÇÃO E RETIRADA","SERV","M2",900,{"$f":"VLOOKUP(A48,'CPU-SERV'!A:K,11,0)","v":111.57},{"$f":"TRUNC(_xlfn.IFS(F48=\"SERV\",I48*(1+$L$5/100),F48=\"SERV DIF\",I48*(1+$L$6/100),F48=\"FORN\",I48*(1+$L$7/100)),2)","v":136.11000000000001},100413,122499]
[35,"5.17",4815671,"SICRO","REATERRO E COMPACTAÇÃO MANUAL DE VALAS COM SOQUETE VIBRATÓRIO","SERV","M3",850,{"$f":"VLOOKUP(A49,'CPU-SERV'!A:K,11,0)","v":16.86},{"$f":"TRUNC(_xlfn.IFS(F49=\"SERV\",I49*(1+$L$5/100),F49=\"SERV DIF\",I49*(1+$L$6/100),F49=\"FORN\",I49*(1+$L$7/100)),2)","v":20.56},14331,17476]
[36,"5.18",94990,"SINAPI","EXECUÇÃO DE PASSEIO (CALÇADA) OU PISO DE CONCRETO MOLDADO IN LOCO, ACABAMENTO CONVENCIONAL, NÃO ARMADO","SERV","M3",5,{"$f":"VLOOKUP(A50,'CPU-SERV'!A:K,11,0)","v":757.11},{"$f":"TRUNC(_xlfn.IFS(F50=\"SERV\",I50*(1+$L$5/100),F50=\"SERV DIF\",I50*(1+$L$6/100),F50=\"FORN\",I50*(1+$L$7/100)),2)","v":923.67},3785.55,4618.3500000000004]
[37,"5.19",5213489,"SICRO","PLACA EM AÇO - 2,00X1,00M - PELÍCULA RETRORREFLETIVA - FORNECIMENTO E INSTALAÇÃO, INCLUSIVE  SUPORTE","SERV","UN.",2,{"$f":"VLOOKUP(A51,'CPU-SERV'!A:K,11,0)","v":913.45},{"$f":"TRUNC(_xlfn.IFS(F51=\"SERV\",I51*(1+$L$5/100),F51=\"SERV DIF\",I51*(1+$L$6/100),F51=\"FORN\",I51*(1+$L$7/100)),2)","v":1114.4000000000001},1826.9,2228.8000000000002]
[38,"5.19",5213464,"SICRO","PLACA DE ADVERTÊNCIA EM AÇO, LADO DE 60CM - PELÍCULA RETRORREFLETIVA - FORNECIMENTO E INSTALAÇÃO, INCLUSIVE  SUPORTE","SERV","UN.",12,{"$f":"VLOOKUP(A52,'CPU-SERV'!A:K,11,0)","v":271.91000000000003},{"$f":"TRUNC(_xlfn.IFS(F52=\"SERV\",I52*(1+$L$5/100),F52=\"SERV DIF\",I52*(1+$L$6/100),F52=\"FORN\",I52*(1+$L$7/100)),2)","v":331.73},3262.92,3980.76]
[39,"5.20",5213440,"SICRO","PLACA DE REGULAMENTAÇÃO EM AÇO, D=60CM - PELÍCULA RETRORREFLETIVA - FORNECIMENTO E INSTALAÇÃO, INCLUSIVE  SUPORTE","SERV","UN.",6,{"$f":"VLOOKUP(A53,'CPU-SERV'!A:K,11,0)","v":271.87},{"$f":"TRUNC(_xlfn.IFS(F53=\"SERV\",I53*(1+$L$5/100),F53=\"SERV DIF\",I53*(1+$L$6/100),F53=\"FORN\",I53*(1+$L$7/100)),2)","v":331.68},1631.22,1990.08]
[40,"5.21",5213476,"SICRO","PLACA DELINEADORA EM AÇO, 0,50 X 0,60M - PELÍCULA RETRORREFLETIVA - FORNECIMENTO E IMPLANTAÇÃO","SERV","UN.",16,{"$f":"VLOOKUP(A54,'CPU-SERV'!A:K,11,0)","v":179},{"$f":"TRUNC(_xlfn.IFS(F54=\"SERV\",I54*(1+$L$5/100),F54=\"SERV DIF\",I54*(1+$L$6/100),F54=\"FORN\",I54*(1+$L$7/100)),2)","v":218.38},2864,3494.08]
[41,"5.22",3713604,"SICRO","DEFENSA SEMIMALEÁVEL SIMPLES, INCLUSIVE POSTE, ESPAÇADOR, CALÇO E ACESSÓRIOS PARA FIXAÇÃO - FORNECIMENTO E IMPLANTAÇÃO","SERV","M",86,{"$f":"VLOOKUP(A55,'CPU-SERV'!A:K,11,0)","v":355.64},{"$f":"TRUNC(_xlfn.IFS(F55=\"SERV\",I55*(1+$L$5/100),F55=\"SERV DIF\",I55*(1+$L$6/100),F55=\"FORN\",I55*(1+$L$7/100)),2)","v":433.88},30585.040000000001,37313.68]
[42,"5.23",5213401,"SICRO","PINTURA DE EIXO VIÁRIO SOBRE ASFALTO COM TINTA RETRORREFLETIVA A BASE DE RESINA ACRÍLICA COM MICROESFERAS DE VIDRO, APLICAÇÃO MECÂNICA COM DEMARCADORA AUTOPROPELIDA","SERV","M2",1900,{"$f":"VLOOKUP(A56,'CPU-SERV'!A:K,11,0)","v":27.24},{"$f":"TRUNC(_xlfn.IFS(F56=\"SERV\",I56*(1+$L$5/100),F56=\"SERV DIF\",I56*(1+$L$6/100),F56=\"FORN\",I56*(1+$L$7/100)),2)","v":33.229999999999997},51756,63137]
[43,"5.24",5213360,"SICRO","TACHA REFLETIVA EM PLÁSTICO INJETADO - BIDIRECIONAL COM UM PINO - FORNECIMENTO E COLOCAÇÃO","SERV","UNID.",1900,{"$f":"VLOOKUP(A57,'CPU-SERV'!A:K,11,0)","v":32.35},{"$f":"TRUNC(_xlfn.IFS(F57=\"SERV\",I57*(1+$L$5/100),F57=\"SERV DIF\",I57*(1+$L$6/100),F57=\"FORN\",I57*(1+$L$7/100)),2)","v":39.46},61465,74974]
[44,"5.25",5213405,"SICRO","PINTURA DE FAIXA DE PEDESTRE OU ZEBRADA TINTA RETRORREFLETIVA A BASE DE RESINA ACRÍLICA COM MICROESFERAS DE VIDRO, APLICAÇÃO MANUAL","SERV","M2",100,{"$f":"VLOOKUP(A58,'CPU-SERV'!A:K,11,0)","v":40.78},{"$f":"TRUNC(_xlfn.IFS(F58=\"SERV\",I58*(1+$L$5/100),F58=\"SERV DIF\",I58*(1+$L$6/100),F58=\"FORN\",I58*(1+$L$7/100)),2)","v":49.75},4078,4975]
["F",6,null,null,"FORNECIMENTOS - MATERIAL ASFÁLTICO (BDI DIFERENCIADO)",{"$nulls":5},{"$f":"SUM(K60:K65)","v":1407869.4100000001},{"$f":"SUM(L60:L65)","v":1619047.33}]
[45,"6.1","CPU.7","CODEVASF","AQUISIÇÃO DE EMULSÃO ASFÁLTICA PARA IMPRIMAÇÃO (EAI) - EXCLUSIVE TRANSPORTE","FORN","T",38,{"$f":"VLOOKUP(A60,'CPU-FORNEC'!A:J,9,0)","v":2723.1},{"$f":"TRUNC(_xlfn.IFS(F60=\"SERV\",I60*(1+$L$5/100),F60=\"SERV DIF\",I60*(1+$L$6/100),F60=\"FORN\",I60*(1+$L$7/100)),2)","v":3131.56},{"$f":"TRUNC(H60*I60,2)","v":103477.8},{"$f":"TRUNC(H60*J60,2)","v":118999.28}]
[46,"6.2","CPU.8","CODEVASF","TRANSPORTE DE EMULSÃO ASFÁLTICA PARA IMPRIMAÇÃO (EAI)","SERV DIF","T",38,{"$f":"VLOOKUP(A61,'CPU-FORNEC'!A:J,9,0)","v":466.4},{"$f":"TRUNC(_xlfn.IFS(F61=\"SERV\",I61*(1+$L$5/100),F61=\"SERV DIF\",I61*(1+$L$6/100),F61=\"FORN\",I61*(1+$L$7/100)),2)","v":536.36},17723.2,20381.68]
[47,"6.3","CPU.9","CODEVASF","AQUISIÇÃO DE EMULSAO ASFALTICA CATIONICA RR-1C - EXCLUSIVE TRANSPORTE","FORN","T",16,{"$f":"VLOOKUP(A62,'CPU-FORNEC'!A:J,9,0)","v":3456.95},{"$f":"TRUNC(_xlfn.IFS(F62=\"SERV\",I62*(1+$L$5/100),F62=\"SERV DIF\",I62*(1+$L$6/100),F62=\"FORN\",I62*(1+$L$7/100)),2)","v":3975.49},55311.199999999997,63607.839999999997]
[48,"6.4","CPU.10","CODEVASF","TRANSPORTE DE EMULSÃO ASFÁLTICA CATIONICA RR-1C","SERV DIF","T",16,{"$f":"VLOOKUP(A63,'CPU-FORNEC'!A:J,9,0)","v":484.42},{"$f":"TRUNC(_xlfn.IFS(F63=\"SERV\",I63*(1+$L$5/100),F63=\"SERV DIF\",I63*(1+$L$6/100),F63=\"FORN\",I63*(1+$L$7/100)),2)","v":557.08000000000004},7750.72,8913.2800000000007]
[49,"6.5","CPU.11","CODEVASF","AQUISIÇÃO DE CONCRETO ASFÁLTICO DE PETRÓLEO - CAP 50/70 - EXCLUSIVE TRANSPORTE","FORN","T",233,{"$f":"VLOOKUP(A64,'CPU-FORNEC'!A:J,9,0)","v":4496.7700000000004},{"$f":"TRUNC(_xlfn.IFS(F64=\"SERV\",I64*(1+$L$5/100),F64=\"SERV DIF\",I64*(1+$L$6/100),F64=\"FORN\",I64*(1+$L$7/100)),2)","v":5171.28},1047747.41,1204908.24]
[50,"6.6","CPU.12","CODEVASF","TRANSPORTE DE CONCRETO ASFÁLTICO DE PETRÓLEO - CAP 50/70","SERV DIF","T",233,{"$f":"VLOOKUP(A65,'CPU-FORNEC'!A:J,9,0)","v":754.76},{"$f":"TRUNC(_xlfn.IFS(F65=\"SERV\",I65*(1+$L$5/100),F65=\"SERV DIF\",I65*(1+$L$6/100),F65=\"FORN\",I65*(1+$L$7/100)),2)","v":867.97},175859.08,202237.01]
[null,"TOTAL GERAL DA OBRA COM BDI ",{"$nulls":8},{"$f":"SUM(K10,K17,K26,K32,K59,K29)","v":5778987.8600000003},{"$f":"SUM(L10,L17,L26,L32,L59,L29)","v":6916869.1399999997}]

{"sheet":"CPU-SERV","index":1,"n_rows":1838,"n_cols":16,"rows_kept":1838,"cut":false,"hidden":false,"merged":[[1025,11,1027,13],[163,0,208,0],[164,2,164,9],[165,1,166,3],[165,4,165,5],[166,4,166,5],[167,2,167,7],[167,8,167,9],[168,1,169,2],[168,3,169,3],[168,4,168,5],[168,6,168,7],[173,7,173,9],[176,3,176,7],[177,3,177,7],[178,3,178,7],[181,7,181,9],[184,3,184,7],[185,7,185,9],[196,3,196,7],[198,8,198,9],[201,3,201,7],[202,1,203,2],[202,3,203,3],[202,4,203,4],[202,5,202,7],[202,9,203,9],[206,3,206,7],[207,5,207,7],[255,8,255,9],[256,1,257,2],[256,3,257,3],[7,13,7,15],[15,11,15,13],[39,0,81,0],[40,2,40,9],[22,7,22,9],[25,3,25,7],[2,10,2,11],[27,8,27,9],[21,3,21,7],[4,2,4,7],[4,8,4,9],[5,1,6,2],[5,3,6,3],[5,4,5,5],[5,6,5,7],[573,0,625,0],[574,2,574,9],[575,1,576,3],[575,4,575,5],[576,4,576,5],[577,2,577,7],[577,8,577,9],[578,1,579,2],[578,3,579,3],[578,4,578,5],[578,6,578,7],[586,7,586,9],[588,3,588,7],[589,3,589,7],[590,3,590,7],[593,7,593,9],[602,3,602,7],[44,3,45,3],[44,4,44,5],[44,6,44,7],[49,7,49,9],[55,3,55,7],[56,3,56,7],[41,1,42,3],[41,4,41,5],[42,4,42,5],[43,2,43,7],[43,8,43,9],[44,1,45,2],[0,0,37,0],[3,4,3,5],[0,11,0,12],[1,11,1,12],[2,4,2,5],[1,2,1,9],[2,1,3,3],[31,3,32,3],[31,4,32,4],[31,5,31,7],[31,9,32,9],[35,3,35,7],[36,5,36,7],[10,7,10,9],[13,3,13,7],[14,3,14,7],[15,3,15,7],[18,7,18,9],[30,3,30,7],[31,1,32,2],[97,3,97,7],[88,3,89,3],[88,4,88,5],[88,6,88,7],[79,3,79,7],[80,5,80,7],[85,4,85,5],[74,3,74,7],[75,1,76,2],[75,3,76,3],[75,4,76,4],[75,5,75,7],[75,9,76,9],[57,3,57,7],[60,7,60,9],[63,3,63,7],[64,7,64,9],[69,3,69,7],[71,8,71,9],[119,5,119,7],[122,0,161,0],[123,2,123,9],[124,1,125,3],[124,4,124,5],[125,4,125,5],[126,2,126,7],[126,8,126,9],[159,3,159,7],[160,5,160,7],[114,1,115,2],[114,3,115,3],[114,4,115,4],[114,5,114,7],[114,9,115,9],[118,3,118,7],[93,7,93,9],[98,3,98,7],[101,7,101,9],[104,3,104,7],[105,7,105,9],[108,3,108,7],[83,0,120,0],[84,2,84,9],[85,1,86,3],[86,4,86,5],[87,2,87,7],[87,8,87,9],[88,1,89,2],[110,8,110,9],[113,3,113,7],[96,3,96,7],[136,3,136,7],[137,3,137,7],[140,7,140,9],[145,3,145,7],[146,7,146,9],[149,3,149,7],[127,1,128,2],[127,3,128,3],[127,4,127,5],[127,6,127,7],[132,7,132,9],[135,3,135,7],[210,0,249,0],[211,2,211,9],[212,1,213,3],[212,4,212,5],[213,4,213,5],[214,2,214,7],[247,3,247,7],[248,5,248,7],[151,8,151,9],[154,3,154,7],[155,1,156,2],[155,3,156,3],[155,4,156,4],[155,5,155,7],[155,9,156,9],[242,3,242,7],[243,1,244,2],[243,3,244,3],[243,4,244,4],[243,5,243,7],[256,4,256,5],[225,3,225,7],[226,3,226,7],[227,3,227,7],[230,7,230,9],[233,3,233,7],[234,7,234,9],[214,8,214,9],[215,1,216,2],[215,3,216,3],[215,4,215,5],[215,6,215,7],[220,7,220,9],[290,0,327,0],[291,2,291,9],[292,1,293,3],[292,4,292,5],[293,4,293,5],[294,2,294,7],[325,3,325,7],[326,5,326,7],[251,0,288,0],[252,2,252,9],[253,1,254,3],[253,4,253,5],[254,4,254,5],[255,2,255,7],[237,3,237,7],[239,8,239,9],[243,9,244,9],[276,3,276,7],[278,8,278,9],[281,3,281,7],[282,1,283,2],[282,3,283,3],[282,4,283,4],[282,5,282,7],[282,9,283,9],[264,3,264,7],[265,3,265,7],[333,8,333,9],[334,1,335,2],[334,3,335,3],[334,4,334,5],[256,6,256,7],[261,7,261,9],[303,3,303,7],[304,3,304,7],[305,3,305,7],[308,7,308,9],[311,3,311,7],[312,7,312,9],[294,8,294,9],[295,1,296,2],[295,3,296,3],[295,4,295,5],[295,6,295,7],[300,7,300,9],[286,3,286,7],[287,5,287,7],[266,3,266,7],[269,7,269,9],[272,3,272,7],[273,7,273,9],[371,0,412,0],[372,2,372,9],[373,1,374,3],[373,4,373,5],[374,4,374,5],[375,2,375,7],[410,3,410,7],[411,5,411,7],[329,0,369,0],[330,2,330,9],[331,1,332,3],[331,4,331,5],[332,4,332,5],[333,2,333,7],[315,3,315,7],[317,8,317,9],[320,3,320,7],[321,1,322,2],[321,3,322,3],[321,4,322,4],[321,5,321,7],[321,9,322,9],[357,3,357,7],[359,8,359,9],[362,3,362,7],[363,1,364,2],[363,3,364,3],[363,4,364,4],[363,5,363,7],[363,9,364,9],[345,3,345,7],[346,3,346,7],[418,8,418,9],[419,1,420,2],[419,3,420,3],[419,4,419,5],[334,6,334,7],[342,7,342,9],[388,3,388,7],[389,3,389,7],[390,3,390,7],[393,7,393,9],[396,3,396,7],[397,7,397,9],[375,8,375,9],[376,1,377,2],[376,3,377,3],[376,4,376,5],[376,6,376,7],[385,7,385,9],[367,3,367,7],[368,5,368,7],[347,3,347,7],[350,7,350,9],[353,3,353,7],[354,7,354,9],[455,0,492,0],[456,2,456,9],[457,1,458,3],[457,4,457,5],[458,4,458,5],[459,2,459,7],[490,3,490,7],[491,5,491,7],[474,7,474,8],[414,0,453,0],[415,2,415,9],[416,1,417,3],[416,4,416,5],[417,4,417,5],[418,2,418,7],[400,3,400,7],[402,8,402,9],[405,3,405,7],[406,1,407,2],[406,3,407,3],[406,4,407,4],[406,5,406,7],[406,9,407,9],[441,3,441,7],[443,8,443,9],[446,3,446,7],[447,1,448,2],[447,3,448,3],[447,4,448,4],[447,5,447,7],[447,9,448,9],[429,3,429,7],[507,3,507,7],[498,8,498,9],[499,1,500,2],[499,3,500,3],[499,4,499,5],[419,6,419,7],[426,7,426,9],[468,3,468,7],[469,3,469,7],[470,3,470,7],[473,7,473,9],[476,3,476,7],[477,7,477,9],[459,8,459,9],[460,1,461,2],[460,3,461,3],[460,4,460,5],[460,6,460,7],[465,7,465,9],[451,3,451,7],[452,5,452,7],[430,3,430,7],[431,3,431,7],[434,7,434,9],[437,3,437,7],[438,7,438,9],[559,3,559,7],[533,0,571,0],[534,2,534,9],[535,1,536,3],[535,4,535,5],[536,4,536,5],[537,2,537,7],[569,3,569,7],[570,5,570,7],[513,7,513,8],[494,0,531,0],[495,2,495,9],[496,1,497,3],[496,4,496,5],[497,4,497,5],[498,2,498,7],[480,3,480,7],[482,8,482,9],[485,3,485,7],[486,1,487,2],[486,3,487,3],[486,4,487,4],[486,5,486,7],[486,9,487,9],[519,3,519,7],[521,8,521,9],[524,3,524,7],[525,1,526,2],[525,3,526,3],[525,4,526,4],[525,5,525,7],[525,9,526,9],[598,7,598,8],[624,5,624,7],[652,3,652,7],[654,8,654,9],[657,3,657,7],[658,1,659,2],[658,3,659,3],[658,4,659,4],[658,5,658,7],[658,9,659,9],[499,6,499,7],[504,7,504,9],[547,3,547,7],[548,3,548,7],[549,3,549,7],[552,7,552,9],[555,3,555,7],[556,7,556,9],[537,8,537,9],[538,1,539,2],[538,3,539,3],[538,4,538,5],[538,6,538,7],[544,7,544,9],[529,3,529,7],[530,5,530,7],[508,3,508,7],[509,3,509,7],[512,7,512,9],[515,3,515,7],[516,7,516,9],[603,7,603,9],[645,7,645,9],[648,3,648,7],[649,7,649,9],[631,8,631,9],[632,1,633,2],[632,3,633,3],[632,4,632,5],[632,6,632,7],[637,7,637,9],[679,3,679,7],[680,3,680,7],[681,3,681,7],[684,7,684,9],[687,3,687,7],[631,2,631,7],[561,8,561,9],[564,3,564,7],[565,1,566,2],[565,3,566,3],[565,4,566,4],[565,5,565,7],[565,9,566,9],[615,1,616,2],[615,3,616,3],[615,4,616,4],[615,5,615,7],[615,9,616,9],[623,3,623,7],[605,3,605,7],[607,8,607,9],[614,3,614,7],[640,3,640,7],[688,7,688,9],[670,8,670,9],[671,1,672,2],[671,3,672,3],[671,4,671,5],[671,6,671,7],[676,7,676,9],[662,3,662,7],[663,5,663,7],[666,0,703,0],[667,2,667,9],[668,1,669,3],[668,4,668,5],[669,4,669,5],[670,2,670,7],[701,3,701,7],[702,5,702,7],[627,0,664,0],[628,2,628,9],[629,1,630,3],[629,4,629,5],[630,4,630,5],[691,3,691,7],[693,8,693,9],[696,3,696,7],[697,1,698,2],[697,3,698,3],[697,4,698,4],[697,5,697,7],[697,9,698,9],[641,3,641,7],[642,3,642,7],[730,3,730,7],[732,8,732,9],[735,3,735,7],[736,1,737,2],[736,3,737,3],[736,4,737,4],[736,5,736,7],[736,9,737,9],[718,3,718,7],[719,3,719,7],[720,3,720,7],[723,7,723,9],[726,3,726,7],[727,7,727,9],[709,8,709,9],[710,1,711,2],[710,3,711,3],[710,4,710,5],[710,6,710,7],[715,7,715,9],[757,3,757,7],[758,3,758,7],[759,3,759,7],[762,7,762,9],[765,3,765,7],[766,7,766,9],[748,8,748,9],[749,1,750,2],[749,3,750,3],[749,4,749,5],[749,6,749,7],[754,7,754,9],[740,3,740,7],[741,5,741,7],[744,0,781,0],[745,2,745,9],[746,1,747,3],[746,4,746,5],[747,4,747,5],[748,2,748,7],[779,3,779,7],[780,5,780,7],[705,0,742,0],[706,2,706,9],[707,1,708,3],[707,4,707,5],[708,4,708,5],[709,2,709,7],[769,3,769,7],[771,8,771,9],[774,3,774,7],[775,1,776,2],[775,3,776,3],[775,4,776,4],[775,5,775,7],[775,9,776,9],[808,3,808,7],[810,8,810,9],[813,3,813,7],[814,1,815,2],[814,3,815,3],[814,4,815,4],[814,5,814,7],[814,9,815,9],[796,3,796,7],[797,3,797,7],[798,3,798,7],[801,7,801,9],[804,3,804,7],[805,7,805,9],[787,8,787,9],[788,1,789,2],[788,3,789,3],[788,4,788,5],[788,6,788,7],[793,7,793,9],[835,3,835,7],[836,3,836,7],[837,3,837,7],[840,7,840,9],[843,3,843,7],[844,7,844,9],[826,8,826,9],[827,1,828,2],[827,3,828,3],[827,4,827,5],[827,6,827,7],[832,7,832,9],[818,3,818,7],[819,5,819,7],[822,0,859,0],[823,2,823,9],[824,1,825,3],[824,4,824,5],[825,4,825,5],[826,2,826,7],[857,3,857,7],[858,5,858,7],[783,0,820,0],[784,2,784,9],[785,1,786,3],[785,4,785,5],[786,4,786,5],[787,2,787,7],[847,3,847,7],[849,8,849,9],[852,3,852,7],[853,1,854,2],[853,3,854,3],[853,4,854,4],[853,5,853,7],[853,9,854,9],[889,3,889,7],[891,8,891,9],[894,3,894,7],[895,1,896,2],[895,3,896,3],[895,4,896,4],[895,5,895,7],[895,9,896,9],[874,3,874,7],[875,3,875,7],[876,3,876,7],[879,7,879,9],[882,3,882,7],[883,7,883,9],[865,8,865,9],[866,1,867,2],[866,3,867,3],[866,4,866,5],[866,6,866,7],[871,7,871,9],[916,3,916,7],[917,3,917,7],[918,3,918,7],[921,7,921,9],[924,3,924,7],[925,7,925,9],[907,8,907,9],[908,1,909,2],[908,3,909,3],[908,4,908,5],[908,6,908,7],[913,7,913,9],[899,3,899,7],[900,5,900,7],[903,0,940,0],[904,2,904,9],[905,1,906,3],[905,4,905,5],[906,4,906,5],[907,2,907,7],[938,3,938,7],[939,5,939,7],[861,0,901,0],[862,2,862,9],[863,1,864,3],[863,4,863,5],[864,4,864,5],[865,2,865,7],[928,3,928,7],[930,8,930,9],[933,3,933,7],[934,1,935,2],[934,3,935,3],[934,4,935,4],[934,5,934,7],[934,9,935,9],[970,3,970,7],[972,8,972,9],[975,3,975,7],[976,1,977,2],[976,3,977,3],[976,4,977,4],[976,5,976,7],[976,9,977,9],[955,3,955,7],[956,3,956,7],[957,3,957,7],[960,7,960,9],[963,3,963,7],[964,7,964,9],[946,8,946,9],[947,1,948,2],[947,3,948,3],[947,4,947,5],[947,6,947,7],[952,7,952,9],[997,3,997,7],[998,3,998,7],[999,3,999,7],[1002,7,1002,9],[1005,3,1005,7],[1006,7,1006,9],[988,8,988,9],[989,1,990,2],[989,3,990,3],[989,4,989,5],[989,6,989,7],[994,7,994,9],[980,3,980,7],[981,5,981,7],[984,0,1023,0],[985,2,985,9],[986,1,987,3],[986,4,986,5],[987,4,987,5],[988,2,988,7],[1021,3,1021,7],[1022,5,1022,7],[942,0,982,0],[943,2,943,9],[944,1,945,3],[944,4,944,5],[945,4,945,5],[946,2,946,7],[1011,3,1011,7],[1013,8,1013,9],[1016,3,1016,7],[1017,1,1018,2],[1017,3,1018,3],[1017,4,1018,4],[1017,5,1017,7],[1017,9,1018,9],[1054,3,1054,7],[1056,8,1056,9],[1059,3,1059,7],[1060,1,1061,2],[1060,3,1061,3],[1060,4,1061,4],[1060,5,1060,7],[1060,9,1061,9],[1038,3,1038,7],[1039,3,1039,7],[1040,3,1040,7],[1043,7,1043,9],[1046,3,1046,7],[1047,7,1047,9],[1029,8,1029,9],[1030,1,1031,2],[1030,3,1031,3],[1030,4,1030,5],[1030,6,1030,7],[1035,7,1035,9],[1081,3,1081,7],[1082,3,1082,7],[1083,3,1083,7],[1086,7,1086,9],[1089,3,1089,7],[1090,7,1090,9],[1072,8,1072,9],[1073,1,1074,2],[1073,3,1074,3],[1073,4,1073,5],[1073,6,1073,7],[1078,7,1078,9],[1064,3,1064,7],[1065,5,1065,7],[1068,0,1105,0],[1069,2,1069,9],[1070,1,1071,3],[1070,4,1070,5],[1071,4,1071,5],[1072,2,1072,7],[1103,3,1103,7],[1104,5,1104,7],[1025,0,1066,0],[1026,2,1026,9],[1027,1,1028,3],[1027,4,1027,5],[1028,4,1028,5],[1029,2,1029,7],[1093,3,1093,7],[1095,8,1095,9],[1098,3,1098,7],[1099,1,1100,2],[1099,3,1100,3],[1099,4,1100,4],[1099,5,1099,7],[1099,9,1100,9],[1133,3,1133,7],[1135,8,1135,9],[1138,3,1138,7],[1139,1,1140,2],[1139,3,1140,3],[1139,4,1140,4],[1139,5,1139,7],[1139,9,1140,9],[1120,3,1120,7],[1121,3,1121,7],[1122,3,1122,7],[1125,7,1125,9],[1128,3,1128,7],[1129,7,1129,9],[1111,8,1111,9],[1112,1,1113,2],[1112,3,1113,3],[1112,4,1112,5],[1112,6,1112,7],[1117,7,1117,9],[1160,3,1160,7],[1161,3,1161,7],[1162,3,1162,7],[1165,7,1165,9],[1168,3,1168,7],[1169,7,1169,9],[1151,8,1151,9],[1152,1,1153,2],[1152,3,1153,3],[1152,4,1152,5],[1152,6,1152,7],[1157,7,1157,9],[1143,3,1143,7],[1144,5,1144,7],[1147,0,1184,0],[1148,2,1148,9],[1149,1,1150,3],[1149,4,1149,5],[1150,4,1150,5],[1151,2,1151,7],[1182,3,1182,7],[1183,5,1183,7],[1107,0,1145,0],[1108,2,1108,9],[1109,1,1110,3],[1109,4,1109,5],[1110,4,1110,5],[1111,2,1111,7],[1172,3,1172,7],[1174,8,1174,9],[1177,3,1177,7],[1178,1,1179,2],[1178,3,1179,3],[1178,4,1179,4],[1178,5,1178,7],[1178,9,1179,9],[1212,3,1212,7],[1214,8,1214,9],[1217,3,1217,7],[1218,1,1219,2],[1218,3,1219,3],[1218,4,1219,4],[1218,5,1218,7],[1218,9,1219,9],[1199,3,1199,7],[1200,3,1200,7],[1201,3,1201,7],[1204,7,1204,9],[1207,3,1207,7],[1208,7,1208,9],[1190,8,1190,9],[1191,1,1192,2],[1191,3,1192,3],[1191,4,1191,5],[1191,6,1191,7],[1196,7,1196,9],[1239,3,1239,7],[1240,3,1240,7],[1241,3,1241,7],[1244,7,1244,9],[1247,3,1247,7],[1248,7,1248,9],[1230,8,1230,9],[1231,1,1232,2],[1231,3,1232,3],[1231,4,1231,5],[1231,6,1231,7],[1236,7,1236,9],[1222,3,1222,7],[1223,5,1223,7],[1226,0,1264,0],[1227,2,1227,9],[1228,1,1229,3],[1228,4,1228,5],[1229,4,1229,5],[1230,2,1230,7],[1262,3,1262,7],[1263,5,1263,7],[1186,0,1224,0],[1187,2,1187,9],[1188,1,1189,3],[1188,4,1188,5],[1189,4,1189,5],[1190,2,1190,7],[1252,3,1252,7],[1254,8,1254,9],[1257,3,1257,7],[1258,1,1259,2],[1258,3,1259,3],[1258,4,1259,4],[1258,5,1258,7],[1258,9,1259,9],[1295,3,1295,7],[1297,8,1297,9],[1300,3,1300,7],[1301,1,1302,2],[1301,3,1302,3],[1301,4,1302,4],[1301,5,1301,7],[1301,9,1302,9],[1279,3,1279,7],[1280,3,1280,7],[1281,3,1281,7],[1284,7,1284,9],[1287,3,1287,7],[1288,7,1288,9],[1270,8,1270,9],[1271,1,1272,2],[1271,3,1272,3],[1271,4,1271,5],[1271,6,1271,7],[1276,7,1276,9],[1322,3,1322,7],[1323,3,1323,7],[1324,3,1324,7],[1327,7,1327,9],[1330,3,1330,7],[1331,7,1331,9],[1313,8,1313,9],[1314,1,1315,2],[1314,3,1315,3],[1314,4,1314,5],[1314,6,1314,7],[1319,7,1319,9],[1305,3,1305,7],[1306,5,1306,7],[1309,0,1346,0],[1310,2,1310,9],[1311,1,1312,3],[1311,4,1311,5],[1312,4,1312,5],[1313,2,1313,7],[1344,3,1344,7],[1345,5,1345,7],[1266,0,1307,0],[1267,2,1267,9],[1268,1,1269,3],[1268,4,1268,5],[1269,4,1269,5],[1270,2,1270,7],[1334,3,1334,7],[1336,8,1336,9],[1339,3,1339,7],[1340,1,1341,2],[1340,3,1341,3],[1340,4,1341,4],[1340,5,1340,7],[1340,9,1341,9],[1373,3,1373,7],[1375,8,1375,9],[1378,3,1378,7],[1379,1,1380,2],[1379,3,1380,3],[1379,4,1380,4],[1379,5,1379,7],[1379,9,1380,9],[1361,3,1361,7],[1362,3,1362,7],[1363,3,1363,7],[1366,7,1366,9],[1369,3,1369,7],[1370,7,1370,9],[1352,8,1352,9],[1353,1,1354,2],[1353,3,1354,3],[1353,4,1353,5],[1353,6,1353,7],[1358,7,1358,9],[1400,3,1400,7],[1401,3,1401,7],[1402,3,1402,7],[1405,7,1405,9],[1409,3,1409,7],[1410,7,1410,9],[1391,8,1391,9],[1392,1,1393,2],[1392,3,1393,3],[1392,4,1392,5],[1392,6,1392,7],[1397,7,1397,9],[1383,3,1383,7],[1384,5,1384,7],[1387,0,1427,0],[1388,2,1388,9],[1389,1,1390,3],[1389,4,1389,5],[1390,4,1390,5],[1391,2,1391,7],[1425,3,1425,7],[1426,5,1426,7],[1348,0,1385,0],[1349,2,1349,9],[1350,1,1351,3],[1350,4,1350,5],[1351,4,1351,5],[1352,2,1352,7],[1413,3,1413,7],[1415,8,1415,9],[1419,3,1419,7],[1420,1,1421,2],[1420,3,1421,3],[1420,4,1421,4],[1420,5,1420,7],[1420,9,1421,9],[1454,3,1454,7],[1456,8,1456,9],[1459,3,1459,7],[1460,1,1461,2],[1460,3,1461,3],[1460,4,1461,4],[1460,5,1460,7],[1460,9,1461,9],[1442,3,1442,7],[1443,3,1443,7],[1444,3,1444,7]],"merged_total":1269,"flags":["merged_cut"]}
[1,"1ª/GRD",{"$nulls":8},{"$f":"J37","v":13978.63},"Minas Gerais"]
[null,"OBRA:"," PAVIMENTAÇÃO ASFÁLTICA EM CBUQ - ESTRADA PARA SANTO ANTÔNIO DA BOA VISTA (SÃO JOÃO DA PONTE / MG)",{"$nulls":8}," Janeiro/2025"]
[null,"Custo Unitário de Referência",null,null,"Minas Gerais",{"$nulls":5},"QUANT.MATERIAL:",null,{"$f":"SUM(M20:M1839)","v":2153997.6378140883},{"$f":"M3/(ORÇAMENTO!L66-ORÇAMENTO!L59)","v":0.40658174530299812}]
[{"$nulls":4}," Janeiro/2025",null,null,"Produção da equipe ",0.5,{"$f":"VLOOKUP(A1,ORÇAMENTO!$A$10:$L$66,7,1)","v":"GL"}]
[null,"CPU.1","MOBILIZAÇÃO E DESMOBILIZAÇÃO",{"$nulls":5},"Valores em reais (R$)"]
[null,"A - EQUIPAMENTOS",null,"Quantidade","Utilização",null,"Custo Horário",null,null,"Custo"]
[{"$nulls":4},"Operativa","Improdutiva","Produtivo","Improdutivo",null,"Horário Total"]
[null,"E9687","Caminhão carroceria com capacidade de 5 t - 120 kW",8,0.5,0.5,154.82689999999999,59.719900000000003,null,{"$f":"D8*(E8*G8+F8*H8)","v":858.18719999999996},null,"distancia =",125,"MONTES CLAROS"]
[null,"E9575","Caminhão basculante com caçamba estanque com capacidade de 14 m³ - 210 kW",8,1,0,314.16070000000002,91.266099999999994,null,{"$f":"D9*(E9*G9+F9*H9)","v":2513.2856000000002},null,"Pá carregadeira ",null,null,10.1," ton"]
[{"$nulls":7},"Custo horário total de equipamentos",null,{"$f":"SUM(J8:J9)","v":3371.4728},null,"Motoniveladora ",null,null,12.47," ton"]
[null,"B - MÃO DE OBRA",null,"Quantidade","Unidade",null,"Custo Horário","Custo Horário Total",null,null,null,"Trator de pneus",null,null,2.8," ton"]
[null,"P9824","Servente",8,"h",null,21.435400000000001,null,null,{"$f":"D12*G12","v":171.48320000000001},null,"Rolo Compactador ",null,null,15.33," ton"]
[{"$nulls":9},{"$f":"D13*G13","v":0},null,"Grade de disco",null,null,1," ton"]
[null,null,null,"Custo horário total de mão de obra",{"$nulls":5},{"$f":"SUM(J12:J13)","v":171.48320000000001},null,"RETROESCAVADEIRA",null,null,6.67," ton"]
[null,null,null,"Custo horário total de execução",{"$nulls":5},{"$f":"J10+J14","v":3542.9560000000001}]
[null,null,null,"Custo unitário de execução",{"$nulls":5},{"$f":"J15/I4","v":7085.9120000000003},null,"MOBILIZAÇÃO + DESMOBILIZAÇÃO DOS EQUIPTOS",null,null,{"$f":"SUM(O9:O15)*M8","v":6046.2500000000009},"ton.km"]
[{"$nulls":7},"Custo do FIC",null,0]
[{"$nulls":7},"Custo do FIT",null,0]
[null,"C - MATERIAL",null,"Quantidade","Unidade",null,"Preço Unitário","Custo Unitário"]
[null,"-",0,null,0,null,0,null,null,{"$f":"D20*G20","v":0},null,{"$f":"VLOOKUP(A1,ORÇAMENTO!A$11:L$66,8,FALSE)","v":1},{"$f":"J20*L20","v":0}]
[null,"-",0,null,0,null,0,null,null,{"$f":"D21*G21","v":0},null,{"$f":"VLOOKUP(A1,ORÇAMENTO!A$11:L$66,8,FALSE)","v":1},{"$f":"J21*L21","v":0}]
[null,null,null,"Custo unitário total de material",{"$nulls":5},{"$f":"SUM(J20:J21)","v":0}]
[null,"D - ATIVIDADES AUXILIARES",null,"Quantidade","Unidade",null,"Custo Unitário","Custo Unitário"]
[null,5914640,"Transporte com cavalo mecânico com semirreboque com capacidade de 32 t - rodovia pavimentada",12092.500000000002,"tkm",null,0.56999999999999995,null,null,{"$f":"D24*G24","v":6892.7250000000004}]
[null,"-",0,0,0,null,0,null,null,{"$f":"D25*G25","v":0}]
[null,null,null,"Custo total de atividades auxiliares",{"$nulls":5},{"$f":"SUM(J24:J25)","v":6892.7250000000004}]
[{"$nulls":7},"Subtotal",null,{"$f":"J16+J22+J26+J17+J18","v":13978.637000000001}]
[null,"E - TEMPO FIXO",null,"Código","Quantidade","Unidade",null,"Custo Unitário","Custo Unitário"]
[null,"-",0,"-",null,0,null,0,null,{"$f":"ROUNDDOWN(E29*H29,4)","v":0}]
[null,"-",0,"-",null,0,null,0,null,{"$f":"ROUNDDOWN(E30*H30,4)","v":0}]
[null,null,null,"Custo unitário total de tempo fixo",{"$nulls":5},{"$f":"SUM(J29:J30)","v":0}]
[null,"F - MOMENTO DE TRANSPORTE",null,"Quantidade","Unidade","DMT",null,null,null,"Custo Unitário"]
[{"$nulls":5},"LN","RP","P"]
[null,"-",0,null,"tkm"]
[null,"-",0,null,"tkm"]
[null,null,null,"Custo unitário total de transporte"]
[{"$nulls":5},"Custo unitário direto total",null,null,null,{"$f":"TRUNC(J27+J31,2)","v":13978.63}]
[null,"Obs."]
[]
[{"$f":"A1+1","v":2},"1ª/GRD",{"$nulls":8},{"$f":"J81","v":264441.435}]
[null,"OBRA:"," PAVIMENTAÇÃO ASFÁLTICA EM CBUQ - ESTRADA PARA SANTO ANTÔNIO DA BOA VISTA (SÃO JOÃO DA PONTE / MG)"]
[null,"Custo Unitário de Referência",null,null,"Minas Gerais"]
[{"$nulls":4}," Janeiro/2025",null,null,"Produção da equipe ",0.125,{"$f":"VLOOKUP(A40,ORÇAMENTO!$A$10:$L$66,7,1)","v":"GL"},"8 MESES"]
[null,"CPU.2","ADMINISTRAÇÃO LOCAL ",{"$nulls":5},"Valores em reais (R$)"]
[null,"A - EQUIPAMENTOS",null,"Quantidade","Utilização",null,"Custo Horário",null,null,"Custo"]
[{"$nulls":4},"Operativa","Improdutiva","Produtivo","Improdutivo",null,"Horário Total"]
[null,"-",0,null,null,null,0,0,null,{"$f":"D47*(E47*G47+F47*H47)","v":0}]
[null,"-",0,null,null,null,0,0,null,{"$f":"D48*(E48*G48+F48*H48)","v":0}]
[{"$nulls":7},"Custo horário total de equipamentos",null,{"$f":"SUM(J47:J48)","v":0}]
[null,"B - MÃO DE OBRA",null,"Quantidade","Unidade",null,"Custo Horário","Custo Horário Total"]
[null,"P9812","Engenheiro",0.21939643005018974,"mês",null,24042.89842298895,null,null,{"$f":"D51*G51","v":5274.9260820631125}]
[null,"P9840","Encarregado geral",1,"mês",null,13559.4041,null,null,{"$f":"D52*G52","v":13559.4041}]
[null,"P9876","Técnico de segurança do trabalho",1,"mês",null,7971.3544000000002,null,null,7971.3544000000002]
[null,"P9858","Laboratorista",0.5,"mês",null,6457.7923000000001,null,null,3228.89615]
[null,"P9806","Auxiliar administrativo",0.5,"mês",null,4564.7978999999996,null,null,2282.3989499999998]
[null,null,null,"Custo horário total de mão de obra",{"$nulls":5},{"$f":"SUM(J51:J55)","v":32316.979682063113}]
[null,null,null,"Custo horário total de execução",{"$nulls":5},{"$f":"J49+J56","v":32316.979682063113}]
[null,null,null,"Custo unitário de execução",{"$nulls":5},{"$f":"J57/I43","v":258535.8374565049}]
[{"$nulls":7},"Custo do FIC",null,"-"]
[{"$nulls":7},"Custo do FIT",null,"-"]
[null,"C - MATERIAL",null,"Quantidade","Unidade",null,"Preço Unitário","Custo Unitário"]
[null,"-",0,0,0,null,0,null,null,{"$f":"D62*G62","v":0}]
[null,"-",0,0,0,null,0,null,null,0]
[null,null,null,"Custo unitário total de material",{"$nulls":5},{"$f":"SUM(J62:J63)","v":0}]
[null,"D - ATIVIDADES AUXILIARES",null,"Quantidade","Unidade",null,"Custo Unitário","Custo Unitário"]
[null,14250,"Energia Elétrica",480,"kwh",null,0.95,null,null,{"$f":"D66*G66","v":456}]
[null,44480,"Tarifa A - Água e Esgoto",48,"m³",null,17.97,null,null,{"$f":"D67*G67","v":862.56}]
[null,5212560,"Placa de advertência para sinalização de obras montada em suporte metálico móvel, lado 1,00 m - utilização de 600 ciclos - fornecimento, 01 implantação e 01 retirada diária",1056,"un.dia",null,3.89,null,null,{"$f":"D68*G68","v":4107.84}]
[null,"Cotação","Telefone",8,"mês",null,59.9,null,null,{"$f":"D69*G69","v":479.2}]
[null,null,null,"Custo total de atividades auxiliares",{"$nulls":5},{"$f":"SUM(J66:J69)","v":5905.5999999999995}]
[{"$nulls":7},"Subtotal",null,{"$f":"J58+J64+J70","v":264441.43745650491}]
[null,"E - TEMPO FIXO",null,"Código","Quantidade","Unidade",null,"Custo Unitário","Custo Unitário"]
[null,"-",0,"-",0,"t",null,0,null,{"$f":"ROUNDDOWN(E73*H73,4)","v":0}]
[null,"-",0,"-",0,"t",null,0,null,{"$f":"ROUNDDOWN(E74*H74,4)","v":0}]
[null,null,null,"Custo unitário total de tempo fixo",{"$nulls":5},{"$f":"SUM(J73:J74)","v":0}]
[null,"F - MOMENTO DE TRANSPORTE",null,"Quantidade","Unidade","DMT",null,null,null,"Custo Unitário"]
[{"$nulls":5},"LN","RP","P"]
[null,"-",0,null,"tkm"]
[null,"-",0,null,"tkm"]
[null,null,null,"Custo unitário total de transporte"]
[{"$nulls":5},"Custo unitário direto total",null,null,null,{"$f":"TRUNC(J71+J75,2)+0.005","v":264441.435}]
[null,"Obs."]
[]
[{"$f":"A40+1","v":3},"1ª/GRD",{"$nulls":8},{"$f":"J120","v":18464.22}]
[null,"OBRA:"," PAVIMENTAÇÃO ASFÁLTICA EM CBUQ - ESTRADA PARA SANTO ANTÔNIO DA BOA VISTA (SÃO JOÃO DA PONTE / MG)"]
[null,"Custo Unitário de Referência",null,null,"Minas Gerais"]
[{"$nulls":4}," Janeiro/2025",null,null,"Produção da equipe ",1,{"$f":"VLOOKUP(A84,ORÇAMENTO!$A$10:$L$66,7,1)","v":"GL"}]
[null,"CPU.3","CANTEIRO DE OBRAS ",{"$nulls":5},"Valores em reais (R$)"]
[null,"A - EQUIPAMENTOS",null,"Quantidade","Utilização",null,"Custo Horário",null,null,"Custo"]
[{"$nulls":4},"Operativa","Improdutiva","Produtivo","Improdutivo",null,"Horário Total"]
[null,"-",0,null,null,null,0,0,null,{"$f":"D91*(E91*G91+F91*H91)","v":0}]
[null,"-",0,null,null,null,0,0,null,{"$f":"D92*(E92*G92+F92*H92)","v":0}]
[{"$nulls":7},"Custo horário total de equipamentos",null,{"$f":"SUM(J91:J92)","v":0}]
[null,"B - MÃO DE OBRA",null,"Quantidade","Unidade",null,"Custo Horário","Custo Horário Total"]
[null,"P9824","Servente",16,"h",null,21.435400000000001,null,null,{"$f":"D95*G95","v":342.96640000000002}]
[null,"P9808","Carpinteiro",8,"h",null,26.881399999999999,null,null,{"$f":"D96*G96","v":215.05119999999999}]
[null,null,null,"Custo horário total de mão de obra",{"$nulls":5},{"$f":"SUM(J95:J96)","v":558.01760000000002}]
[null,null,null,"Custo horário total de execução",{"$nulls":5},{"$f":"J93+J97","v":558.01760000000002}]
[null,null,null,"Custo unitário de execução",{"$nulls":5},{"$f":"J98/I87","v":558.01760000000002}]
[{"$nulls":7},"Custo do FIC",null,"-"]
[{"$nulls":7},"Custo do FIT",null,"-"]
[null,"C - MATERIAL",null,"Quantidade","Unidade",null,"Preço Unitário","Custo Unitário"]
[null,"M0053","Tela plástica em polipropileno na cor laranja para tapume - L = 1,2 m",100,"m",null,1.7621,null,null,{"$f":"D103*G103","v":176.21},null,{"$f":"VLOOKUP(A84,ORÇAMENTO!A$11:L$66,8,FALSE)","v":1},{"$f":"J103*L103","v":176.21}]
[null,"-",0,0,0,null,0,null,null,{"$f":"D104*G104","v":0},null,{"$f":"VLOOKUP(A84,ORÇAMENTO!A$11:L$66,8,FALSE)","v":1},{"$f":"J104*L104","v":0}]
[null,null,null,"Custo unitário total de material",{"$nulls":5},{"$f":"SUM(J103:J104)","v":176.21}]
[null,"D - ATIVIDADES AUXILIARES",null,"Quantidade","Unidade",null,"Custo Unitário","Custo Unitário"]
[null,10775,"Locação de container 2,30 X 6,00 m, alt. 2,50 m, com 1 sanitário, para escritório, completo, sem divisórias internas",8,"mês",null,985,null,null,{"$f":"D107*G107","v":7880}]
[null,10779,"Locação de container 2,30 X 4,30 m, alt. 2,50 M, p/ sanitário, c/ 5 bacias, 1 lavatório e 4 mictórios",8,"mês",null,1231.25,null,null,{"$f":"D108*G108","v":9850}]
[null,null,null,"Custo total de atividades auxiliares",{"$nulls":5},{"$f":"SUM(J107:J108)","v":17730}]
[{"$nulls":7},"Subtotal",null,{"$f":"J99+J105+J109","v":18464.227599999998}]
[null,"E - TEMPO FIXO",null,"Código","Quantidade","Unidade",null,"Custo Unitário","Custo Unitário"]
[null,"-",0,"-",0,"t",null,0,null,{"$f":"ROUNDDOWN(E112*H112,4)","v":0}]
[null,"-",0,"-",0,"t",null,0,null,{"$f":"ROUNDDOWN(E113*H113,4)","v":0}]
[null,null,null,"Custo unitário total de tempo fixo",{"$nulls":5},{"$f":"SUM(J112:J113)","v":0}]
[null,"F - MOMENTO DE TRANSPORTE",null,"Quantidade","Unidade","DMT",null,null,null,"Custo Unitário"]
[{"$nulls":5},"LN","RP","P"]
[null,"-",0,0,"tkm"]
[null,"-",0,0,"tkm"]
[null,null,null,"Custo unitário total de transporte"]
[{"$nulls":5},"Custo unitário direto total",null,null,null,{"$f":"TRUNC(J110+J114,2)","v":18464.22}]
[null,"Obs."]
[]
[{"$f":"A84+1","v":4},"1ª/GRD",{"$nulls":8},{"$f":"J161","v":550.64}]
[null,"OBRA:"," PAVIMENTAÇÃO ASFÁLTICA EM CBUQ - ESTRADA PARA SANTO ANTÔNIO DA BOA VISTA (SÃO JOÃO DA PONTE / MG)"]
[null,"Custo Unitário de Referência",null,null,"Minas Gerais"]
[{"$nulls":4}," Janeiro/2025",null,null,"Produção da equipe ",1,{"$f":"VLOOKUP(A123,ORÇAMENTO!$A$10:$L$66,7,1)","v":"M2"}]
[null,103689,"PLACA DE OBRA EM CHAPA DE AÇO GALVANIZADO",{"$nulls":5},"Valores em reais (R$)"]
[null,"A - EQUIPAMENTOS",null,"Quantidade","Utilização",null,"Custo Horário",null,null,"Custo"]
[{"$nulls":4},"Operativa","Improdutiva","Produtivo","Improdutivo",null,"Horário Total"]
[null,"-",0,null,null,null,0,0,null,{"$f":"D130*(E130*G130+F130*H130)","v":0}]
[null,"-",0,null,null,null,0,0,null,{"$f":"D131*(E131*G131+F131*H131)","v":0}]
[{"$nulls":7},"Custo horário total de equipamentos",null,{"$f":"SUM(J130:J131)","v":0}]
[null,"B - MÃO DE OBRA",null,"Quantidade","Unidade",null,"Custo Horário","Custo Horário Total"]
[null,"P9824","Servente",1.1186,"h",null,21.435400000000001,null,null,{"$f":"D134*G134","v":23.977638440000003}]
[null,"P9808","Carpinteiro",0.37290000000000001,"h",null,26.881399999999999,null,null,{"$f":"D135*G135","v":10.02407406}]
[null,null,null,"Custo horário total de mão de obra",{"$nulls":5},{"$f":"SUM(J134:J135)","v":34.001712500000004}]
[null,null,null,"Custo horário total de execução",{"$nulls":5},{"$f":"J132+J136","v":34.001712500000004}]
[null,null,null,"Custo unitário de execução",{"$nulls":5},{"$f":"J137/I126","v":34.001712500000004}]
[{"$nulls":7},"Custo do FIC",null,"-"]
[{"$nulls":7},"Custo do FIT",null,"-"]
[null,"C - MATERIAL",null,"Quantidade","Unidade",null,"Preço Unitário","Custo Unitário"]
[null,"M1358","Sarrafo em madeira de terceira - E = 2,5 cm e L = 5 cm",6.4165999999999999,"m",null,2.0291000000000001,null,null,{"$f":"D142*G142","v":13.01992306},null,{"$f":"VLOOKUP(A$123,ORÇAMENTO!A$11:L$66,8,FALSE)","v":4},{"$f":"J142*L142","v":52.07969224}]
[null,"M1205","Prego de ferro",2.4500000000000001E-2,"kg",null,16.771799999999999,null,null,{"$f":"D143*G143","v":0.41090909999999997},null,{"$f":"VLOOKUP(A$123,ORÇAMENTO!A$11:L$66,8,FALSE)","v":4},{"$f":"J143*L143","v":1.6436363999999999}]
[null,"M0998","Madeira estrutural de eucalipto",2.2608E-2,"m³",null,2685.3184000000001,null,null,{"$f":"D144*G144","v":60.7096783872},null,{"$f":"VLOOKUP(A$123,ORÇAMENTO!A$11:L$66,8,FALSE)","v":4},242.8387135488]
[null,4813,"Placa de obra (para construção civil) em chapa galvanizada *N. 22*, adesivada, de *2,4 X 1,2* m (sem postes para fixação)",1,"m²",null,442.5,"SINAPI",null,442.5,null,{"$f":"VLOOKUP(A$123,ORÇAMENTO!A$11:L$66,8,FALSE)","v":4},1770]
[null,null,null,"Custo unitário total de material",{"$nulls":5},{"$f":"SUM(J142:J145)","v":516.64051054719994}]
[null,"D - ATIVIDADES AUXILIARES",null,"Quantidade","Unidade",null,"Custo Unitário","Custo Unitário"]
[null,"-",0,0,0,null,0,null,null,{"$f":"D148*G148","v":0}]
[null,"-",0,0,0,null,0,null,null,{"$f":"D149*G149","v":0}]
[null,null,null,"Custo total de atividades auxiliares",{"$nulls":5},{"$f":"SUM(J148:J149)","v":0}]
[{"$nulls":7},"Subtotal",null,{"$f":"J138+J146+J150","v":550.64222304719999}]
[null,"E - TEMPO FIXO",null,"Código","Quantidade","Unidade",null,"Custo Unitário","Custo Unitário"]
[null,"-",0,"-",0,"t",null,0,null,{"$f":"ROUNDDOWN(E153*H153,4)","v":0}]
[null,"-",0,"-",0,"t",null,0,null,{"$f":"ROUNDDOWN(E154*H154,4)","v":0}]
[null,null,null,"Custo unitário total de tempo fixo",{"$nulls":5},{"$f":"SUM(J153:J154)","v":0}]
[null,"F - MOMENTO DE TRANSPORTE",null,"Quantidade","Unidade","DMT",null,null,null,"Custo Unitário"]
[{"$nulls":5},"LN","RP","P"]
[null,"-",0,0,"tkm"]
[null,"-",0,0,"tkm"]
[null,null,null,"Custo unitário total de transporte"]
[{"$nulls":5},"Custo unitário direto total",null,null,null,{"$f":"TRUNC(J151+J155,2)","v":550.64}]
[null,"Obs."]
[]
[5,"1ª/GRD",{"$nulls":8},{"$f":"J208","v":4264.1499999999996}]
[null,"OBRA:"," PAVIMENTAÇÃO ASFÁLTICA EM CBUQ - ESTRADA PARA SANTO ANTÔNIO DA BOA VISTA (SÃO JOÃO DA PONTE / MG)"]
[null,"Custo Unitário de Referência",null,null,"Minas Gerais"]
[{"$nulls":4}," Janeiro/2025",null,null,"Produção da equipe ",1,{"$f":"VLOOKUP(A164,ORÇAMENTO!$A$10:$L$66,7,1)","v":"MÊS"}]
[null,"CPU.4","VEÍCULO PARA A FISCALIZAÇÃO, MÁXIMO 02 ANOS DE USO OU 50.000KM, PREFERENCIALMENTE NA COR BRANCA, COM IDENTIFICAÇÃO CONFORME ESPECIFICAÇÕES DA CODEVASF, INCLUSIVE COMBUSTÍVEL, MANUTENÇÃO, SEGURO E IMPOSTOS - CONFORME ESPECIFICAÇÕES",{"$nulls":5},"Valores em reais (R$)"]
[null,"A - EQUIPAMENTOS",null,"Quantidade","Utilização",null,"Custo Horário",null,null,"Custo"]
[{"$nulls":4},"Operativa","Improdutiva","Produtivo","Improdutivo",null,"Horário Total"]
[null,"-",0,null,null,null,0,0,null,{"$f":"D171*(E171*G171+F171*H171)","v":0}]
[null,"-",0,null,null,null,0,0,null,{"$f":"D172*(E172*G172+F172*H172)","v":0}]
[{"$nulls":7},"Custo horário total de equipamentos",null,{"$f":"SUM(J171:J172)","v":0}]
[null,"B - MÃO DE OBRA",null,"Quantidade","Unidade",null,"Custo Horário","Custo Horário Total"]
[null,"-",0,0,0,null,0,0,null,{"$f":"D175*G175","v":0}]
[null,"-",0,0,0,null,0,0,null,{"$f":"D176*G176","v":0}]
[null,null,null,"Custo horário total de mão de obra",{"$nulls":5},{"$f":"SUM(J175:J176)","v":0}]
[null,null,null,"Custo horário total de execução",{"$nulls":5},{"$f":"J173+J177","v":0}]
[null,null,null,"Custo unitário de execução",{"$nulls":5},{"$f":"J178/I167","v":0}]
[{"$nulls":7},"Custo do FIC",null,"-"]
[{"$nulls":7},"Custo do FIT",null,"-"]
[null,"C - MATERIAL",null,"Quantidade","Unidade",null,"Preço Unitário","Custo Unitário"]
[null,"-",0,0,0,null,0,null,null,{"$f":"D183*G183","v":0},null,{"$f":"VLOOKUP(A$211,ORÇAMENTO!A$11:L$66,8,FALSE)","v":35000},{"$f":"J183*L183","v":0}]
[null,"-",0,0,0,null,0,null,null,0,null,{"$f":"VLOOKUP(A$211,ORÇAMENTO!A$11:L$66,8,FALSE)","v":35000},{"$f":"J184*L184","v":0}]
[null,null,null,"Custo unitário total de material",{"$nulls":5},{"$f":"SUM(J183:J184)","v":0}]
[null,"D - ATIVIDADES AUXILIARES",null,"Quantidade","Unidade",null,"Custo Unitário","Custo Unitário"]
[null,"-","Depreciação",1,"vb",null,692.66666666666663,null,null,{"$f":"D187*G187","v":692.66666666666663}]
[null,"-","Oportunidade de Capital",1,"vb",null,510.84,null,null,{"$f":"D188*G188","v":510.84}]
[null,"-","Impostos e Licenciamento",1,"vb",null,346.33,null,null,346.33]
[null,"-","Seguro Total",1,"vb",null,281.58,null,null,281.58]
[null,"-","Combustível",1,"vb",null,1287.8599999999999,null,null,1287.8599999999999]
[null,"-","Manutenções Preventivas",1,"vb",null,254.02,null,null,254.02]
[null,"-","Limpeza",1,"vb",null,100,null,null,100]
[null,"-","Pneus",1,"vb",null,115.18,null,null,115.18]
[null,"-","Peças",1,"vb",null,77.22,null,null,77.22]
[null,"-","Manutenção Corretiva (%)",1,"vb",null,598.46,null,null,{"$f":"D196*G196","v":598.46}]
[null,null,null,"Custo total de atividades auxiliares",{"$nulls":5},{"$f":"SUM(J187:J196)","v":4264.1566666666658}]
[{"$nulls":7},"Subtotal",null,{"$f":"J179+J185+J197","v":4264.1566666666658}]
[null,"E - TEMPO FIXO",null,"Código","Quantidade","Unidade",null,"Custo Unitário","Custo Unitário"]
[null,"-",0,"-",0,"t",null,0,null,{"$f":"ROUNDDOWN(E200*H200,4)","v":0}]
[null,"-",0,"-",0,"t",null,0,null,{"$f":"ROUNDDOWN(E201*H201,4)","v":0}]
[null,null,null,"Custo unitário total de tempo fixo",{"$nulls":5},{"$f":"SUM(J200:J201)","v":0}]
[null,"F - MOMENTO DE TRANSPORTE",null,"Quantidade","Unidade","DMT",null,null,null,"Custo Unitário"]
[{"$nulls":5},"LN","RP","P"]
[null,"-",0,0,"tkm"]
[null,"-",0,0,"tkm"]
[null,null,null,"Custo unitário total de transporte"]
[{"$nulls":5},"Custo unitário direto total",null,null,null,{"$f":"TRUNC(J198+J202,2)","v":4264.1499999999996}]
[null,"Obs."]
[]
[6,"1ª/GRD",{"$nulls":8},{"$f":"J249","v":0.4}]
[null,"OBRA:"," PAVIMENTAÇÃO ASFÁLTICA EM CBUQ - ESTRADA PARA SANTO ANTÔNIO DA BOA VISTA (SÃO JOÃO DA PONTE / MG)"]
[null,"Custo Unitário de Referência",null,null,"Minas Gerais"]
[{"$nulls":4}," Janeiro/2025",null,null,"Produção da equipe ",1,{"$f":"VLOOKUP(A211,ORÇAMENTO!$A$10:$L$66,7,1)","v":"M2"}]
[null,78472,"SERVIÇOS TOPOGRÁFICOS PARA PAVIMENTAÇÃO, INCLUSIVE LEVANTAMENTO PLANIALTIMÉTRICO CADASTRAL, GERAÇÃO DE NOTAS DE SERVIÇO, SEÇÕES TRANSVERSAIS E GREIDE, ESTAQUEAMENTO E ACOMPANHAMENTO EXECUTIVO",{"$nulls":5},"Valores em reais (R$)"]
[null,"A - EQUIPAMENTOS",null,"Quantidade","Utilização",null,"Custo Horário",null,null,"Custo"]
[{"$nulls":4},"Operativa","Improdutiva","Produtivo","Improdutivo",null,"Horário Total"]
[null,92145,"Caminhonete cabine simples com motor 1.6 flex, câmbio manual, potência 101/104 cv, 2 portas",5.0000000000000001E-4,1,0,76.5,0,null,{"$f":"D218*(E218*G218+F218*H218)","v":3.8249999999999999E-2}]
[null,"-",0,0,1,0,0,0,null,{"$f":"D219*(E219*G219+F219*H219)","v":0}]
[{"$nulls":7},"Custo horário total de equipamentos",null,{"$f":"SUM(J218:J219)","v":3.8249999999999999E-2}]
[null,"B - MÃO DE OBRA",null,"Quantidade","Unidade",null,"Custo Horário","Custo Horário Total"]
[null,"P9949","Topógrafo",9.2592592592592591E-6,"mês",null,6936.5330000000004,28.902220833333335,null,{"$f":"D222*G222","v":6.4227157407407406E-2}]
[null,"P9950","Auxiliar de topografia",9.2592592592592591E-6,"mês",null,6476.4769999999999,23.986951851851853,null,{"$f":"D223*G223","v":5.9967379629629627E-2}]
[null,"P9824","Servente",7.4999999999999997E-3,"h",null,21.435400000000001,8.9314166666666667E-2,null,{"$f":"D224*G224","v":0.16076550000000001}]
[null,"P9848","Desenhista",7.4074074074074075E-6,"mês",null,10596.234399999999,39.24531259259259,null,{"$f":"D225*G225","v":7.8490625185185181E-2}]
[null,null,null,"Custo horário total de mão de obra",{"$nulls":5},{"$f":"SUM(J222:J225)","v":0.36345066222222222}]
[null,null,null,"Custo horário total de execução",{"$nulls":5},{"$f":"J220+J226","v":0.40170066222222223}]
[null,null,null,"Custo unitário de execução",{"$nulls":5},{"$f":"J227/I214","v":0.40170066222222223}]
[{"$nulls":7},"Custo do FIC",null,"-"]
[{"$nulls":7},"Custo do FIT",null,"-"]
[null,"C - MATERIAL",null,"Quantidade","Unidade",null,"Preço Unitário","Custo Unitário"]
[null,"-",0,0,0,null,0,null,null,{"$f":"D232*G232","v":0},null,{"$f":"VLOOKUP(A$211,ORÇAMENTO!A$11:L$66,8,FALSE)","v":35000},{"$f":"J232*L232","v":0}]
[null,"-",0,0,0,null,0,null,null,0,null,{"$f":"VLOOKUP(A$211,ORÇAMENTO!A$11:L$66,8,FALSE)","v":35000},{"$f":"J233*L233","v":0}]
[null,null,null,"Custo unitário total de material",{"$nulls":5},{"$f":"SUM(J232:J233)","v":0}]
[null,"D - ATIVIDADES AUXILIARES",null,"Quantidade","Unidade",null,"Custo Unitário","Custo Unitário"]
[null,"-",0,0,0,null,0,null,null,{"$f":"D236*G236","v":0}]
[null,"-",0,0,0,null,0,null,null,{"$f":"D237*G237","v":0}]
[null,null,null,"Custo total de atividades auxiliares",{"$nulls":5},{"$f":"SUM(J236:J237)","v":0}]
[{"$nulls":7},"Subtotal",null,{"$f":"J228+J234+J238","v":0.40170066222222223}]
[null,"E - TEMPO FIXO",null,"Código","Quantidade","Unidade",null,"Custo Unitário","Custo Unitário"]
[null,"-",0,"-",0,"t",null,0,null,{"$f":"ROUNDDOWN(E241*H241,4)","v":0}]
[null,"-",0,"-",0,"t",null,0,null,{"$f":"ROUNDDOWN(E242*H242,4)","v":0}]
[null,null,null,"Custo unitário total de tempo fixo",{"$nulls":5},{"$f":"SUM(J241:J242)","v":0}]
[null,"F - MOMENTO DE TRANSPORTE",null,"Quantidade","Unidade","DMT",null,null,null,"Custo Unitário"]
[{"$nulls":5},"LN","RP","P"]
[null,"-",0,0,"tkm"]
[null,"-",0,0,"tkm"]
[null,null,null,"Custo unitário total de transporte"]
[{"$nulls":5},"Custo unitário direto total",null,null,null,{"$f":"TRUNC(J239+J243,2)","v":0.4}]
[null,"Obs."]
[]
[{"$f":"A211+1","v":7},"1ª/GRD",{"$nulls":8},{"$f":"J288","v":6.88}]
[null,"OBRA:"," PAVIMENTAÇÃO ASFÁLTICA EM CBUQ - ESTRADA PARA SANTO ANTÔNIO DA BOA VISTA (SÃO JOÃO DA PONTE / MG)"]
[null,"Custo Unitário de Referência",null,null,"Minas Gerais"]
[{"$nulls":4}," Janeiro/2025",null,null,"Produção da equipe ",230.19,{"$f":"VLOOKUP(A252,ORÇAMENTO!$A$10:$L$66,7,1)","v":"M3"}]
[null,5502114,"ESCAVAÇÃO, CARGA E TRANSPORTE DE MATERIAL DE 1ª CATEGORIA - DMT 1.000 A 1.200M, CAMINHO DE SERVIÇO EM REVESTIMENTO PRIMÁRIO",{"$nulls":5},"Valores em reais (R$)"]
[null,"A - EQUIPAMENTOS",null,"Quantidade","Utilização",null,"Custo Horário",null,null,"Custo"]
[{"$nulls":4},"Operativa","Improdutiva","Produtivo","Improdutivo",null,"Horário Total"]
[null,"E9667","Caminhão basculante com capacidade de 14 m³ - 210 kW",4,0.96,0.04,313.74529999999999,91.048100000000005,null,{"$f":"D259*(E259*G259+F259*H259)","v":1219.3496479999999}]
[null,"E9515","Escavadeira hidráulica sobre esteiras com caçamba com capacidade de 1,56 m³ - 118 kW",1,1,0,307.78859999999997,139.61009999999999,null,{"$f":"D260*(E260*G260+F260*H260)","v":307.78859999999997}]
[{"$nulls":7},"Custo horário total de equipamentos",null,{"$f":"SUM(J259:J260)","v":1527.1382479999997}]
[null,"B - MÃO DE OBRA",null,"Quantidade","Unidade",null,"Custo Horário","Custo Horário Total"]
[null,"P9824","Servente",1,"h",null,21.435400000000001,null,null,{"$f":"D263*G263","v":21.435400000000001}]
[{"$nulls":9},{"$f":"D264*G264","v":0}]
[null,null,null,"Custo horário total de mão de obra",{"$nulls":5},{"$f":"SUM(J263:J264)","v":21.435400000000001}]
[null,null,null,"Custo horário total de execução",{"$nulls":5},{"$f":"J261+J265","v":1548.5736479999998}]
[null,null,null,"Custo unitário de execução",{"$nulls":5},{"$f":"J266/I255","v":6.7273715104913325}]
[{"$nulls":7},"Custo do FIC",null,0.155]
[{"$nulls":7},"Custo do FIT",null,0]
[null,"C - MATERIAL",null,"Quantidade","Unidade",null,"Preço Unitário","Custo Unitário"]
[null,"-",0,null,0,null,0,null,null,{"$f":"D271*G271","v":0},null,{"$f":"VLOOKUP(A252,ORÇAMENTO!A$11:L$66,8,FALSE)","v":30000},{"$f":"J271*L271","v":0}]
[null,"-",0,null,0,null,0,null,null,{"$f":"D272*G272","v":0},null,{"$f":"VLOOKUP(A252,ORÇAMENTO!A$11:L$66,8,FALSE)","v":30000},{"$f":"J272*L272","v":0}]
[null,null,null,"Custo unitário total de material",{"$nulls":5},{"$f":"SUM(J271:J272)","v":0}]
[null,"D - ATIVIDADES AUXILIARES",null,"Quantidade","Unidade",null,"Custo Unitário","Custo Unitário"]
[null,"-",0,0,0,null,0,null,null,{"$f":"D275*G275","v":0}]
[null,"-",0,0,0,null,0,null,null,{"$f":"D276*G276","v":0}]
[null,null,null,"Custo total de atividades auxiliares",{"$nulls":5},{"$f":"SUM(J275:J276)","v":0}]
[{"$nulls":7},"Subtotal",null,{"$f":"J267+J273+J277+J268+J269","v":6.8823715104913328}]
[null,"E - TEMPO FIXO",null,"Código","Quantidade","Unidade",null,"Custo Unitário","Custo Unitário"]
[null,"-",0,"-",0,"t",null,0,null,{"$f":"ROUNDDOWN(E280*H280,4)","v":0}]
[null,"-",0,"-",0,"t",null,0,null,{"$f":"ROUNDDOWN(E281*H281,4)","v":0}]
[null,null,null,"Custo unitário total de tempo fixo",{"$nulls":5},{"$f":"SUM(J280:J281)","v":0}]
[null,"F - MOMENTO DE TRANSPORTE",null,"Quantidade","Unidade","DMT",null,null,null,"Custo Unitário"]
[{"$nulls":5},"LN","RP","P"]
[null,"-",0,null,"tkm"]
[null,"-",0,null,"tkm"]
[null,null,null,"Custo unitário total de transporte"]
[{"$nulls":5},"Custo unitário direto total",null,null,null,{"$f":"TRUNC(J278+J282,2)","v":6.88}]
[null,"Obs."]
[]
[{"$f":"A252+1","v":8},"1ª/GRD",{"$nulls":8},{"$f":"J327","v":2}]
[null,"OBRA:"," PAVIMENTAÇÃO ASFÁLTICA EM CBUQ - ESTRADA PARA SANTO ANTÔNIO DA BOA VISTA (SÃO JOÃO DA PONTE / MG)"]
[null,"Custo Unitário de Referência",null,null,"Minas Gerais"]
[{"$nulls":4}," Janeiro/2025",null,null,"Produção da equipe ",176.81,{"$f":"VLOOKUP(A291,ORÇAMENTO!$A$10:$L$66,7,1)","v":"M3"}]
[null,4413942,"ESPALHAMENTO DE MATERIAL EM BOTA FORA",{"$nulls":5},"Valores em reais (R$)"]
[null,"A - EQUIPAMENTOS",null,"Quantidade","Utilização",null,"Custo Horário",null,null,"Custo"]
[{"$nulls":4},"Operativa","Improdutiva","Produtivo","Improdutivo",null,"Horário Total"]
[null,"E9540","Trator sobre esteiras com lâmina - 127 kW",1,1,0,326.08949999999999,131.4693,null,{"$f":"D298*(E298*G298+F298*H298)","v":326.08949999999999}]
[null,"-",0,0,0,0,0,0,null,{"$f":"D299*(E299*G299+F299*H299)","v":0}]
[{"$nulls":7},"Custo horário total de equipamentos",null,{"$f":"SUM(J298:J299)","v":326.08949999999999}]
[null,"B - MÃO DE OBRA",null,"Quantidade","Unidade",null,"Custo Horário","Custo Horário Total"]
[null,"P9824","Servente",1,"h",null,21.435400000000001,null,null,{"$f":"D302*G302","v":21.435400000000001}]
[{"$nulls":9},{"$f":"D303*G303","v":0}]
[null,null,null,"Custo horário total de mão de obra",{"$nulls":5},{"$f":"SUM(J302:J303)","v":21.435400000000001}]
[null,null,null,"Custo horário total de execução",{"$nulls":5},{"$f":"J300+J304","v":347.5249}]
[null,null,null,"Custo unitário de execução",{"$nulls":5},{"$f":"J305/I294","v":1.9655274022962501}]
[{"$nulls":7},"Custo do FIC",null,3.9199999999999999E-2]
[{"$nulls":7},"Custo do FIT",null,0]
[null,"C - MATERIAL",null,"Quantidade","Unidade",null,"Preço Unitário","Custo Unitário"]
[null,"-",0,0,0,null,0,null,null,{"$f":"D310*G310","v":0},null,{"$f":"VLOOKUP(A291,ORÇAMENTO!A$11:L$66,8,FALSE)","v":23000},{"$f":"J310*L310","v":0}]
[null,"-",0,0,0,null,0,null,null,0,null,{"$f":"VLOOKUP(A291,ORÇAMENTO!A$11:L$66,8,FALSE)","v":23000},{"$f":"J311*L311","v":0}]
[null,null,null,"Custo unitário total de material",{"$nulls":5},{"$f":"SUM(J310:J311)","v":0}]
[null,"D - ATIVIDADES AUXILIARES",null,"Quantidade","Unidade",null,"Custo Unitário","Custo Unitário"]
[null,"-",0,0,0,null,0,null,null,{"$f":"D314*G314","v":0}]
[null,"-",0,0,0,null,0,null,null,{"$f":"D315*G315","v":0}]
[null,null,null,"Custo total de atividades auxiliares",{"$nulls":5},{"$f":"SUM(J314:J315)","v":0}]
[{"$nulls":7},"Subtotal",null,{"$f":"J306+J312+J316+J307+J308","v":2.00472740229625}]
[null,"E - TEMPO FIXO",null,"Código","Quantidade","Unidade",null,"Custo Unitário","Custo Unitário"]
[null,"-",0,"-",0,"t",null,0,null,{"$f":"ROUNDDOWN(E319*H319,4)","v":0}]
[null,"-",0,"-",0,"t",null,0,null,{"$f":"ROUNDDOWN(E320*H320,4)","v":0}]
[null,null,null,"Custo unitário total de tempo fixo",{"$nulls":5},{"$f":"SUM(J319:J320)","v":0}]
[null,"F - MOMENTO DE TRANSPORTE",null,"Quantidade","Unidade","DMT",null,null,null,"Custo Unitário"]
[{"$nulls":5},"LN","RP","P"]
[null,"-",0,0,"tkm"]
[null,"-",0,0,"tkm"]
[null,null,null,"Custo unitário total de transporte"]
[{"$nulls":5},"Custo unitário direto total",null,null,null,{"$f":"TRUNC(J317+J321,2)","v":2}]
[null,"Obs."]
[]
[{"$f":"A291+1","v":9},"1ª/GRD",{"$nulls":8},{"$f":"J369","v":5.08}]
[null,"OBRA:"," PAVIMENTAÇÃO ASFÁLTICA EM CBUQ - ESTRADA PARA SANTO ANTÔNIO DA BOA VISTA (SÃO JOÃO DA PONTE / MG)"]
[null,"Custo Unitário de Referência",null,null,"Minas Gerais"]
[{"$nulls":4}," Janeiro/2025",null,null,"Produção da equipe ",168.2,{"$f":"VLOOKUP(A330,ORÇAMENTO!$A$10:$L$66,7,1)","v":"M3"}]
[null,5502978,"COMPACTAÇÃO DE ATERROS A 100% DO PROCTOR NORMAL",{"$nulls":5},"Valores em reais (R$)"]
[null,"A - EQUIPAMENTOS",null,"Quantidade","Utilização",null,"Custo Horário",null,null,"Custo"]
[{"$nulls":4},"Operativa","Improdutiva","Produtivo","Improdutivo",null,"Horário Total"]
[null,"E9571","Caminhão tanque com capacidade de 10.000 l - 188 kW",1,0.9,0.1,332.8408,83.189300000000003,null,{"$f":"D337*(E337*G337+F337*H337)","v":307.87565000000001}]
[null,"E9518","Grade de 24 discos rebocável de D = 60 cm (24\")",1,0.52,0.48,4.9446000000000003,3.4432999999999998,null,{"$f":"D338*(E338*G338+F338*H338)","v":4.2239760000000004}]
[null,"E9524","Motoniveladora - 93 kW",1,0.28999999999999998,0.71,283.71199999999999,122.7861,null,169.454611]
[null,"E9685","Rolo compactador pé de carneiro vibratório autopropelido por pneus de 11,6 t - 82 kW",1,1,0,228.8742,102.6397,null,228.8742]
[null,"E9577","Trator agrícola sobre pneus - 77 kW",1,0.52,0.48,154.65969999999999,55.817599999999999,null,{"$f":"D341*(E341*G341+F341*H341)","v":107.21549199999998}]
[{"$nulls":7},"Custo horário total de equipamentos",null,{"$f":"SUM(J337:J341)","v":817.64392900000007}]
[null,"B - MÃO DE OBRA",null,"Quantidade","Unidade",null,"Custo Horário","Custo Horário Total"]
[null,"P9824","Servente",1,"h",null,21.435400000000001,null,null,{"$f":"D344*G344","v":21.435400000000001}]
[null,"-",null,0,0,null,0,null,null,{"$f":"D345*G345","v":0}]
[null,null,null,"Custo horário total de mão de obra",{"$nulls":5},{"$f":"SUM(J344:J345)","v":21.435400000000001}]
[null,null,null,"Custo horário total de execução",{"$nulls":5},{"$f":"J342+J346","v":839.07932900000003}]
[null,null,null,"Custo unitário de execução",{"$nulls":5},{"$f":"J347/I333","v":4.9885810285374559}]
[{"$nulls":7},"Custo do FIC",null,9.8400000000000001E-2]
[{"$nulls":7},"Custo do FIT",null,0]
[null,"C - MATERIAL",null,"Quantidade","Unidade",null,"Preço Unitário","Custo Unitário"]
[null,"-",0,0,0,null,0,null,null,{"$f":"D352*G352","v":0},null,{"$f":"VLOOKUP(A$330,ORÇAMENTO!A$11:L$66,8,FALSE)","v":7000},{"$f":"J352*L352","v":0}]
[null,"-",0,0,0,null,0,null,null,{"$f":"D353*G353","v":0},null,{"$f":"VLOOKUP(A$330,ORÇAMENTO!A$11:L$66,8,FALSE)","v":7000},{"$f":"J353*L353","v":0}]
[null,null,null,"Custo unitário total de material",{"$nulls":5},{"$f":"SUM(J352:J353)","v":0}]
[null,"D - ATIVIDADES AUXILIARES",null,"Quantidade","Unidade",null,"Custo Unitário","Custo Unitário"]
[null,"-",0,0,0,null,0,null,null,{"$f":"D356*G356","v":0}]
[null,"-",0,0,0,null,0,null,null,{"$f":"D357*G357","v":0}]
[null,null,null,"Custo total de atividades auxiliares",{"$nulls":5},{"$f":"SUM(J356:J357)","v":0}]
[{"$nulls":7},"Subtotal",null,{"$f":"J348+J354+J358+J349+J350","v":5.0869810285374557}]
[null,"E - TEMPO FIXO",null,"Código","Quantidade","Unidade",null,"Custo Unitário","Custo Unitário"]
[null,"-",0,"-",0,"t",null,0,null,{"$f":"ROUNDDOWN(E361*H361,4)","v":0}]
[null,"-",0,"-",0,"t",null,0,null,{"$f":"ROUNDDOWN(E362*H362,4)","v":0}]
[null,null,null,"Custo unitário total de tempo fixo",{"$nulls":5},{"$f":"SUM(J361:J362)","v":0}]
[null,"F - MOMENTO DE TRANSPORTE",null,"Quantidade","Unidade","DMT",null,null,null,"Custo Unitário"]
[{"$nulls":5},"LN","RP","P"]
[null,"-",0,0,"tkm"]
[null,"-",0,0,"tkm"]
[null,null,null,"Custo unitário total de transporte"]
[{"$nulls":5},"Custo unitário direto total",null,null,null,{"$f":"TRUNC(J359+J363,2)","v":5.08}]
[null,"Obs."]
[]
[{"$f":"A330+1","v":10},"1ª/GRD",{"$nulls":8},{"$f":"J412","v":1.56}]
[null,"OBRA:"," PAVIMENTAÇÃO ASFÁLTICA EM CBUQ - ESTRADA PARA SANTO ANTÔNIO DA BOA VISTA (SÃO JOÃO DA PONTE / MG)"]
[null,"Custo Unitário de Referência",null,null,"Minas Gerais"]
[{"$nulls":4}," Janeiro/2025",null,null,"Produção da equipe ",672.8,{"$f":"VLOOKUP(A372,ORÇAMENTO!$A$10:$L$66,7,1)","v":"M2"}]
[null,4011209,"REGULARIZAÇÃO E COMPACTAÇÃO DO SUBLEITO ",{"$nulls":5},"Valores em reais (R$)"]
[null,"A - EQUIPAMENTOS",null,"Quantidade","Utilização",null,"Custo Horário",null,null,"Custo"]
[{"$nulls":4},"Operativa","Improdutiva","Produtivo","Improdutivo",null,"Horário Total"]
[null,"E9571","Caminhão tanque com capacidade de 10.000 l - 188 kW",1,0.61,0.39,332.8408,83.189300000000003,null,{"$f":"D379*(E379*G379+F379*H379)","v":235.47671499999998}]
[null,"E9518","Grade de 24 discos rebocável de D = 60 cm (24\")",1,0.41,0.59,4.9446000000000003,3.4432999999999998,null,{"$f":"D380*(E380*G380+F380*H380)","v":4.0588329999999999}]
[null,"E9524","Motoniveladora - 93 kW",1,0.43,0.56999999999999995,283.71199999999999,122.7861,null,191.98423699999998]
[null,"E9762","Rolo compactador de pneus autopropelido de 27 t - 85 kW",1,0.96,0.04,257.48289999999997,125.15349999999999,null,252.18972399999996]
[null,"E9685","Rolo compactador pé de carneiro vibratório autopropelido por pneus de 11,6 t - 82 kW",1,1,0,228.8742,102.6397,null,228.8742]
[null,"E9577","Trator agrícola sobre pneus - 77 kW",1,0.41,0.59,154.65969999999999,55.817599999999999,null,96.342860999999999]
[{"$nulls":7},"Custo horário total de equipamentos",null,{"$f":"SUM(J379:J384)","v":1008.9265699999999}]
[null,"B - MÃO DE OBRA",null,"Quantidade","Unidade",null,"Custo Horário","Custo Horário Total"]
[null,"P9824","Servente",1,"h",null,21.435400000000001,null,null,{"$f":"D387*G387","v":21.435400000000001}]
[null,"-",null,0,0,null,0,null,null,{"$f":"D388*G388","v":0}]
[null,null,null,"Custo horário total de mão de obra",{"$nulls":5},{"$f":"SUM(J387:J388)","v":21.435400000000001}]
[null,null,null,"Custo horário total de execução",{"$nulls":5},{"$f":"J385+J389","v":1030.3619699999999}]
[null,null,null,"Custo unitário de execução",{"$nulls":5},{"$f":"J390/I375","v":1.5314535820451842}]
[{"$nulls":7},"Custo do FIC",null,3.1E-2]
[{"$nulls":7},"Custo do FIT",null,0]
[null,"C - MATERIAL",null,"Quantidade","Unidade",null,"Preço Unitário","Custo Unitário"]
[null,"-",0,null,0,null,0,null,null,{"$f":"D395*G395","v":0},null,{"$f":"VLOOKUP(A$372,ORÇAMENTO!A$11:L$66,8,FALSE)","v":35000},{"$f":"J395*L395","v":0}]
[null,"-",0,null,0,null,0,null,null,{"$f":"D396*G396","v":0},null,{"$f":"VLOOKUP(A$372,ORÇAMENTO!A$11:L$66,8,FALSE)","v":35000},{"$f":"J396*L396","v":0}]
[null,null,null,"Custo unitário total de material",{"$nulls":5},{"$f":"SUM(J395:J396)","v":0}]
[null,"D - ATIVIDADES AUXILIARES",null,"Quantidade","Unidade",null,"Custo Unitário","Custo Unitário"]
[null,"-",0,0,0,null,0,null,null,{"$f":"D399*G399","v":0}]
[null,"-",0,0,0,null,0,null,null,{"$f":"D400*G400","v":0}]
[null,null,null,"Custo total de atividades auxiliares",{"$nulls":5},{"$f":"SUM(J399:J400)","v":0}]
[{"$nulls":7},"Subtotal",null,{"$f":"J391+J397+J401+J392+J393","v":1.5624535820451841}]
[null,"E - TEMPO FIXO",null,"Código","Quantidade","Unidade",null,"Custo Unitário","Custo Unitário"]
[null,"-",0,"-",0,"t",null,0,null,{"$f":"ROUNDDOWN(E404*H404,4)","v":0}]
[null,"-",0,"-",0,"t",null,0,null,{"$f":"ROUNDDOWN(E405*H405,4)","v":0}]
[null,null,null,"Custo unitário total de tempo fixo",{"$nulls":5},{"$f":"SUM(J404:J405)","v":0}]
[null,"F - MOMENTO DE TRANSPORTE",null,"Quantidade","Unidade","DMT",null,null,null,"Custo Unitário"]
[{"$nulls":5},"LN","RP","P"]
[null,"-",0,null,"tkm"]
[null,"-",0,null,"tkm"]
[null,null,null,"Custo unitário total de transporte"]
[{"$nulls":5},"Custo unitário direto total",null,null,null,{"$f":"TRUNC(J402+J406,2)","v":1.56}]
[null,"Obs."]
[]
[{"$f":"A372+1","v":11},"1ª/GRD",{"$nulls":8},{"$f":"J453","v":164.01}]
[null,"OBRA:"," PAVIMENTAÇÃO ASFÁLTICA EM CBUQ - ESTRADA PARA SANTO ANTÔNIO DA BOA VISTA (SÃO JOÃO DA PONTE / MG)"]
[null,"Custo Unitário de Referência",null,null,"Minas Gerais"]
[{"$nulls":4}," Janeiro/2025",null,null,"Produção da equipe ",113.18,{"$f":"VLOOKUP(A415,ORÇAMENTO!$A$10:$L$66,7,1)","v":"M3"}]
[null,4011276,"EXECUÇÃO E COMPACTAÇÃO DE BASE E OU SUB BASE PARA PAVIMENTAÇÃO DE BICA CORRIDA - EXCLUSIVE TRANSPORTE",{"$nulls":5},"Valores em reais (R$)"]
[null,"A - EQUIPAMENTOS",null,"Quantidade","Utilização",null,"Custo Horário",null,null,"Custo"]
[{"$nulls":4},"Operativa","Improdutiva","Produtivo","Improdutivo",null,"Horário Total"]
[null,"E9571","Caminhão tanque com capacidade de 10.000 l - 188 kW",1,0.34,0.66,332.8408,83.189300000000003,null,{"$f":"D422*(E422*G422+F422*H422)","v":168.07080999999999}]
[null,"E9514","Distribuidor de agregados sobre pneus autopropelido - 130 kW",1,1,0,293.41419999999999,107.0603,null,{"$f":"D423*(E423*G423+F423*H423)","v":293.41419999999999}]
[null,"E9762","Rolo compactador de pneus autopropelido de 27 t - 85 kW",1,0.97,0.03,257.48289999999997,125.15349999999999,null,253.51301799999996]
[null,"E9530","Rolo compactador liso vibratório autopropelido por pneus de 11 t - 97 kW",1,0.79,0.21,264.91219999999998,115.2555,null,{"$f":"D425*(E425*G425+F425*H425)","v":233.48429300000001}]
[{"$nulls":7},"Custo horário total de equipamentos",null,{"$f":"SUM(J422:J425)","v":948.48232099999996}]
[null,"B - MÃO DE OBRA",null,"Quantidade","Unidade",null,"Custo Horário","Custo Horário Total"]
[null,"P9824","Servente",1,"h",null,21.435400000000001,null,null,{"$f":"D428*G428","v":21.435400000000001}]
[null,"-",0,0,0,null,0,null,null,{"$f":"D429*G429","v":0}]
[null,null,null,"Custo horário total de mão de obra",{"$nulls":5},{"$f":"SUM(J428:J429)","v":21.435400000000001}]
[null,null,null,"Custo horário total de execução",{"$nulls":5},{"$f":"J426+J430","v":969.91772099999991}]
[null,null,null,"Custo unitário de execução",{"$nulls":5},{"$f":"J431/I418","v":8.5696918271779445}]
[{"$nulls":7},"Custo do FIC",null,5.1200000000000002E-2]
[{"$nulls":7},"Custo do FIT",null,0]
[null,"C - MATERIAL",null,"Quantidade","Unidade",null,"Preço Unitário","Custo Unitário"]
[null,"-",0,null,0,null,0,null,null,{"$f":"D436*G436","v":0},null,null,{"$f":"J436*L436","v":0}]
[null,"-",0,null,0,null,0,null,null,{"$f":"D437*G437","v":0},null,null,{"$f":"J437*L437","v":0}]
[null,null,null,"Custo unitário total de material",{"$nulls":5},{"$f":"SUM(J436:J437)","v":0}]
[null,"D - ATIVIDADES AUXILIARES",null,"Quantidade","Unidade",null,"Custo Unitário","Custo Unitário"]
[null,6416040,"Usinagem de brita graduada com brita comercial em usina de 300 t/h",1,"m³",null,148,"COTAÇÃO",null,{"$f":"D440*G440","v":148},null,{"$f":"VLOOKUP(A$415,ORÇAMENTO!A$11:L$66,8,FALSE)","v":7000},{"$f":"J440*L440","v":1036000}]
[null,"-",0,0,0,null,0,null,null,{"$f":"D441*G441","v":0},null,null,{"$f":"J441*L441","v":0}]
[null,null,null,"Custo total de atividades auxiliares",{"$nulls":5},{"$f":"SUM(J440:J441)","v":148}]
[{"$nulls":7},"Subtotal",null,{"$f":"J432+J438+J442+J433+J434","v":156.62089182717793}]
[null,"E - TEMPO FIXO",null,"Código","Quantidade","Unidade",null,"Custo Unitário","Custo Unitário"]
[null,6416040,"Usinagem de brita graduada com brita comercial em usina de 300 t/h",5914652,2.2000000000000002,"t",null,3.36,null,{"$f":"ROUNDDOWN(E445*H445,4)","v":7.3920000000000003}]
[null,"-",0,"-",null,"t",null,0,null,{"$f":"ROUNDDOWN(E446*H446,4)","v":0}]
[null,null,null,"Custo unitário total de tempo fixo",{"$nulls":5},{"$f":"SUM(J445:J446)","v":7.3920000000000003}]
[null,"F - MOMENTO DE TRANSPORTE",null,"Quantidade","Unidade","DMT",null,null,null,"Custo Unitário"]
[{"$nulls":5},"LN","RP","P"]
[null,6416040,"Usinagem de brita graduada com brita comercial em usina de 300 t/h",2.2000000000000002,"tkm"]
[null,"-",0,0,"tkm"]
[null,null,null,"Custo unitário total de transporte"]
[{"$nulls":5},"Custo unitário direto total",null,null,null,{"$f":"TRUNC(J443+J447,2)","v":164.01}]
[null,"Obs."]
[]
[{"$f":"A415+1","v":12},"1ª/GRD",{"$nulls":8},{"$f":"J492","v":0.41}]
[null,"OBRA:"," PAVIMENTAÇÃO ASFÁLTICA EM CBUQ - ESTRADA PARA SANTO ANTÔNIO DA BOA VISTA (SÃO JOÃO DA PONTE / MG)"]
[null,"Custo Unitário de Referência",null,null,"Minas Gerais"]
[{"$nulls":4}," Janeiro/2025",null,null,"Produção da equipe ",1038.46,{"$f":"VLOOKUP(A456,ORÇAMENTO!$A$10:$L$66,7,1)","v":"M2"}]
[null,4011352,"IMPRIMAÇÃO COM EMULSÃO ASFÁLTICA (EAI)",{"$nulls":5},"Valores em reais (R$)"]
[null,"A - EQUIPAMENTOS",null,"Quantidade","Utilização",null,"Custo Horário",null,null,"Custo"]
[{"$nulls":4},"Operativa","Improdutiva","Produtivo","Improdutivo",null,"Horário Total"]
[null,"E9509","Caminhão tanque distribuidor de asfalto com capacidade de 6.000 l - 7 kW/136 kW",1,1,0,267.51929999999999,74.644499999999994,null,{"$f":"D463*(E463*G463+F463*H463)","v":267.51929999999999}]
[null,"E9558","Tanque de estocagem de asfalto com capacidade de 30.000 l",2,1,0,57.98,39.604599999999998,null,{"$f":"D464*(E464*G464+F464*H464)","v":115.96}]
[{"$nulls":7},"Custo horário total de equipamentos",null,{"$f":"SUM(J463:J464)","v":383.47929999999997}]
[null,"B - MÃO DE OBRA",null,"Quantidade","Unidade",null,"Custo Horário","Custo Horário Total"]
[null,"P9824","Servente",2,"h",null,21.435400000000001,null,null,{"$f":"D467*G467","v":42.870800000000003}]
[null,"-",{"$nulls":7},{"$f":"D468*G468","v":0}]
[null,null,null,"Custo horário total de mão de obra",{"$nulls":5},{"$f":"SUM(J467:J468)","v":42.870800000000003}]
[null,null,null,"Custo horário total de execução",{"$nulls":5},{"$f":"J465+J469","v":426.3501}]
[null,null,null,"Custo unitário de execução",{"$nulls":5},{"$f":"J470/I459","v":0.41055996379253895}]
[{"$nulls":7},"Custo do FIC",null,1.2999999999999999E-3]
[{"$nulls":7},"Custo do FIT",null,0]
[null,"C - MATERIAL",null,"Quantidade","Unidade",null,"Preço Unitário","Custo Unitário"]
[null,"M2092","Emulsão asfáltica para imprimação",1.2999999999999999E-3,"t",null,0,"FORNECIMENTO COM BDI DIFERENCIADO",null,{"$f":"D475*G475","v":0},null,{"$f":"VLOOKUP(A456,ORÇAMENTO!A$11:L$66,8,FALSE)","v":35000},{"$f":"J475*L475","v":0}]
[null,"-",0,null,0,null,0,null,null,{"$f":"D476*G476","v":0},null,null,{"$f":"J476*L476","v":0}]
[null,null,null,"Custo unitário total de material",{"$nulls":5},{"$f":"SUM(J475:J476)","v":0}]
[null,"D - ATIVIDADES AUXILIARES",null,"Quantidade","Unidade",null,"Custo Unitário","Custo Unitário"]
[null,"-",0,0,0,null,0,null,null,{"$f":"D479*G479","v":0}]
[null,"-",0,0,0,null,0,null,null,{"$f":"D480*G480","v":0}]
[null,null,null,"Custo total de atividades auxiliares",{"$nulls":5},{"$f":"SUM(J479:J480)","v":0}]
[{"$nulls":7},"Subtotal",null,{"$f":"J471+J477+J481+J472+J473","v":0.41185996379253897}]
[null,"E - TEMPO FIXO",null,"Código","Quantidade","Unidade",null,"Custo Unitário","Custo Unitário"]
[null,"-",0,"-",0,"t",null,0,null,{"$f":"ROUNDDOWN(E484*H484,4)","v":0}]
[null,"-",0,"-",0,"t",null,0,null,{"$f":"ROUNDDOWN(E485*H485,4)","v":0}]
[null,null,null,"Custo unitário total de tempo fixo",{"$nulls":5},{"$f":"SUM(J484:J485)","v":0}]
[null,"F - MOMENTO DE TRANSPORTE",null,"Quantidade","Unidade","DMT",null,null,null,"Custo Unitário"]
[{"$nulls":5},"LN","RP","P"]
[null,"-",0,null,"tkm"]
[null,"-",0,null,"tkm"]
[null,null,null,"Custo unitário total de transporte"]
[{"$nulls":5},"Custo unitário direto total",null,null,null,{"$f":"TRUNC(J482+J486,2)","v":0.41}]
[null,"Obs."]
[]
[{"$f":"A456+1","v":13},"1ª/GRD",{"$nulls":8},{"$f":"J531","v":0.28000000000000003}]
[null,"OBRA:"," PAVIMENTAÇÃO ASFÁLTICA EM CBUQ - ESTRADA PARA SANTO ANTÔNIO DA BOA VISTA (SÃO JOÃO DA PONTE / MG)"]
[null,"Custo Unitário de Referência",null,null,"Minas Gerais"]
[{"$nulls":4}," Janeiro/2025",null,null,"Produção da equipe ",1500,{"$f":"VLOOKUP(A495,ORÇAMENTO!$A$10:$L$66,7,1)","v":"M2"}]
[null,4011353,"PINTURA DE LIGAÇÃO COM EMULSÃO ASFÁLTICA RR-1C",{"$nulls":5},"Valores em reais (R$)"]
[null,"A - EQUIPAMENTOS",null,"Quantidade","Utilização",null,"Custo Horário",null,null,"Custo"]
[{"$nulls":4},"Operativa","Improdutiva","Produtivo","Improdutivo",null,"Horário Total"]
[null,"E9509","Caminhão tanque distribuidor de asfalto com capacidade de 6.000 l - 7 kW/136 kW",1,1,0,267.51929999999999,74.644499999999994,null,{"$f":"D502*(E502*G502+F502*H502)","v":267.51929999999999}]
[null,"E9558","Tanque de estocagem de asfalto com capacidade de 30.000 l",2,1,0,57.98,39.604599999999998,null,{"$f":"D503*(E503*G503+F503*H503)","v":115.96}]
[{"$nulls":7},"Custo horário total de equipamentos",null,{"$f":"SUM(J502:J503)","v":383.47929999999997}]
[null,"B - MÃO DE OBRA",null,"Quantidade","Unidade",null,"Custo Horário","Custo Horário Total"]
[null,"P9824","Servente",2,"h",null,21.435400000000001,null,null,{"$f":"D506*G506","v":42.870800000000003}]
[null,"-",{"$nulls":7},{"$f":"D507*G507","v":0}]
[null,null,null,"Custo horário total de mão de obra",{"$nulls":5},{"$f":"SUM(J506:J507)","v":42.870800000000003}]
[null,null,null,"Custo horário total de execução",{"$nulls":5},{"$f":"J504+J508","v":426.3501}]
[null,null,null,"Custo unitário de execução",{"$nulls":5},{"$f":"J509/I498","v":0.28423340000000002}]
[{"$nulls":7},"Custo do FIC",null,8.9999999999999998E-4]
[{"$nulls":7},"Custo do FIT",null,0]
[null,"C - MATERIAL",null,"Quantidade","Unidade",null,"Preço Unitário","Custo Unitário"]
[null,"M1946","Emulsão asfáltica - RR-1C",4.4999999999999999E-4,"t",null,0,"FORNECIMENTO COM BDI DIFERENCIADO",null,{"$f":"D514*G514","v":0},null,{"$f":"VLOOKUP(A495,ORÇAMENTO!A$11:L$66,8,FALSE)","v":35000},{"$f":"J514*L514","v":0}]
[null,"-",0,null,0,null,0,null,null,{"$f":"D515*G515","v":0},null,null,{"$f":"J515*L515","v":0}]
[null,null,null,"Custo unitário total de material",{"$nulls":5},{"$f":"SUM(J514:J515)","v":0}]
[null,"D - ATIVIDADES AUXILIARES",null,"Quantidade","Unidade",null,"Custo Unitário","Custo Unitário"]
[null,"-",0,0,0,null,0,null,null,{"$f":"D518*G518","v":0}]
[null,"-",0,0,0,null,0,null,null,{"$f":"D519*G519","v":0}]
[null,null,null,"Custo total de atividades auxiliares",{"$nulls":5},{"$f":"SUM(J518:J519)","v":0}]
[{"$nulls":7},"Subtotal",null,{"$f":"J510+J516+J520+J511+J512","v":0.28513340000000004}]
[null,"E - TEMPO FIXO",null,"Código","Quantidade","Unidade",null,"Custo Unitário","Custo Unitário"]
[null,"-",0,"-",0,"t",null,0,null,{"$f":"ROUNDDOWN(E523*H523,4)","v":0}]
[null,"-",0,"-",0,"t",null,0,null,{"$f":"ROUNDDOWN(E524*H524,4)","v":0}]
[null,null,null,"Custo unitário total de tempo fixo",{"$nulls":5},{"$f":"SUM(J523:J524)","v":0}]
[null,"F - MOMENTO DE TRANSPORTE",null,"Quantidade","Unidade","DMT",null,null,null,"Custo Unitário"]
[{"$nulls":5},"LN","RP","P"]
[null,"-",0,null,"tkm"]
[null,"-",0,null,"tkm"]
[null,null,null,"Custo unitário total de transporte"]
[{"$nulls":5},"Custo unitário direto total",null,null,null,{"$f":"TRUNC(J521+J525,2)","v":0.28000000000000003}]
[null,"Obs."]
[]
[{"$f":"A495+1","v":14},"1ª/GRD",{"$nulls":8},{"$f":"J571","v":192.83}]
[null,"OBRA:"," PAVIMENTAÇÃO ASFÁLTICA EM CBUQ - ESTRADA PARA SANTO ANTÔNIO DA BOA VISTA (SÃO JOÃO DA PONTE / MG)"]
[null,"Custo Unitário de Referência",null,null,"Minas Gerais"]
[{"$nulls":4}," Janeiro/2025",null,null,"Produção da equipe ",99.6,{"$f":"VLOOKUP(A534,ORÇAMENTO!$A$10:$L$66,7,1)","v":"T"}]
[null,4011463,"EXECUÇÃO DE PAVIMENTO COM APLICAÇÃO DE CONCRETO ASFÁLTICO USINADO A QUENTE (CBUQ), CAMADA DE ROLAMENTO - EXCLUSIVE TRANSPORTE",{"$nulls":5},"Valores em reais (R$)"]
[null,"A - EQUIPAMENTOS",null,"Quantidade","Utilização",null,"Custo Horário",null,null,"Custo"]
[{"$nulls":4},"Operativa","Improdutiva","Produtivo","Improdutivo",null,"Horário Total"]
[null,"E9762","Rolo compactador de pneus autopropelido de 27 t - 85 kW",1,0.71,0.28999999999999998,257.48289999999997,125.15349999999999,null,{"$f":"D541*(E541*G541+F541*H541)","v":219.10737399999996}]
[null,"E9681","Rolo compactador liso tandem vibratório autopropelido de 10,4 t - 82 kW",1,0.82,0.18,299.81799999999998,113.9695,null,{"$f":"D542*(E542*G542+F542*H542)","v":266.36526999999995}]
[null,"E9545","Vibroacabadora de asfalto sobre esteiras - 97 kW",1,1,0,365.24360000000001,156.6223,null,{"$f":"D543*(E543*G543+F543*H543)","v":365.24360000000001}]
[{"$nulls":7},"Custo horário total de equipamentos",null,{"$f":"SUM(J541:J543)","v":850.71624399999996}]
[null,"B - MÃO DE OBRA",null,"Quantidade","Unidade",null,"Custo Horário","Custo Horário Total"]
[null,"P9824","Servente",8,"h",null,21.435400000000001,null,null,{"$f":"D546*G546","v":171.48320000000001}]
[null,"-",0,null,0,null,0,null,null,{"$f":"D547*G547","v":0}]
[null,null,null,"Custo horário total de mão de obra",{"$nulls":5},{"$f":"SUM(J546:J547)","v":171.48320000000001}]
[null,null,null,"Custo horário total de execução",{"$nulls":5},{"$f":"J544+J548","v":1022.199444}]
[null,null,null,"Custo unitário de execução",{"$nulls":5},{"$f":"J549/I537","v":10.263046626506025}]
[{"$nulls":7},"Custo do FIC",null,4.2200000000000001E-2]
[{"$nulls":7},"Custo do FIT",null,0]
[null,"C - MATERIAL",null,"Quantidade","Unidade",null,"Preço Unitário","Custo Unitário"]
[null,"-",0,null,0,null,0,null,null,{"$f":"D554*G554","v":0},null,null,{"$f":"J554*L554","v":0}]
[null,"-",0,null,0,null,0,null,null,{"$f":"D555*G555","v":0},null,null,{"$f":"J555*L555","v":0}]
[null,null,null,"Custo unitário total de material",{"$nulls":5},{"$f":"SUM(J554:J555)","v":0}]
[null,"D - ATIVIDADES AUXILIARES",null,"Quantidade","Unidade",null,"Custo Unitário","Custo Unitário"]
[null,6416078,"Usinagem de concreto asfáltico - faixa C-12,5 - areia e brita comerciais",1,"t",null,174.84467510216871,null,null,{"$f":"D558*G558","v":174.84467510216871}]
[null,"-",0,0,0,null,0,null,null,{"$f":"D559*G559","v":0}]
[null,null,null,"Custo total de atividades auxiliares",{"$nulls":5},{"$f":"SUM(J558:J559)","v":174.84467510216871}]
[{"$nulls":7},"Subtotal",null,{"$f":"J550+J556+J560+J551+J552","v":185.14992172867474}]
[null,"E - TEMPO FIXO",null,"Código","Quantidade","Unidade",null,"Custo Unitário","Custo Unitário"]
[null,6416078,"Usinagem de concreto asfáltico - faixa C-12,5 - areia e brita comerciais",5914649,1,"t",null,7.69,null,{"$f":"ROUNDDOWN(E563*H563,4)","v":7.69}]
[null,"-",0,"-",0,"t",null,0,null,{"$f":"ROUNDDOWN(E564*H564,4)","v":0}]
[null,null,null,"Custo unitário total de tempo fixo",{"$nulls":5},{"$f":"SUM(J563:J564)","v":7.69}]
[null,"F - MOMENTO DE TRANSPORTE",null,"Quantidade","Unidade","DMT",null,null,null,"Custo Unitário"]
[{"$nulls":5},"LN","RP","P"]
[null,6416078,"Usinagem de concreto asfáltico - faixa C-12,5 - areia e brita comerciais",1,"tkm"]
[null,"-",0,0,"tkm"]
[null,null,null,"Custo unitário total de transporte"]
[{"$nulls":5},"Custo unitário direto total",null,null,null,{"$f":"TRUNC(J561+J565,2)","v":192.83}]
[null,"Obs."]
[]
[null,"1ª/GRD",{"$nulls":8},{"$f":"J625","v":174.84467510216871}]
[null,"OBRA:"," PAVIMENTAÇÃO ASFÁLTICA EM CBUQ - ESTRADA PARA SANTO ANTÔNIO DA BOA VISTA (SÃO JOÃO DA PONTE / MG)"]
[null,"Custo Unitário de Referência - Auxiliar",null,null,"Minas Gerais"]
[{"$nulls":4}," Janeiro/2025",null,null,"Produção da equipe ",99.6,"t"]
[null,6416078,"Usinagem de concreto asfáltico - faixa C - areia e brita comerciais",{"$nulls":5},"Valores em reais (R$)"]
[null,"A - EQUIPAMENTOS",null,"Quantidade","Utilização",null,"Custo Horário",null,null,"Custo"]
[{"$nulls":4},"Operativa","Improdutiva","Produtivo","Improdutivo",null,"Horário Total"]
[null,"E9559","Aquecedor de fluido térmico - 12 kW",1,1,0,76.738399999999999,44.1357,null,{"$f":"D581*(E581*G581+F581*H581)","v":76.738399999999999}]
[null,"E9584","Carregadeira de pneus com capacidade de 1,72 m³ - 113 kW",1,0.86,0.14000000000000001,207.10550000000001,103.1602,null,{"$f":"D582*(E582*G582+F582*H582)","v":192.553158}]
[null,"E9021","Grupo gerador - 456 kVA",1,1,0,423.6705,22.1999,null,423.6705]
[null,"E9558","Tanque de estocagem de asfalto com capacidade de 30.000 l",2,1,0,57.98,39.604599999999998,null,115.96]
[null,"E9689","Usina de asfalto a quente gravimétrica com capacidade de 100/140 t/h - 260 kW",1,1,0,1240.8839,658.63800000000003,null,{"$f":"D585*(E585*G585+F585*H585)","v":1240.8839}]
[{"$nulls":7},"Custo horário total de equipamentos",null,{"$f":"SUM(J581:J585)","v":2049.8059579999999}]
[null,"B - MÃO DE OBRA",null,"Quantidade","Unidade",null,"Custo Horário","Custo Horário Total"]
[null,"P9824","Servente",4,"h",null,21.435400000000001,null,null,{"$f":"D588*G588","v":85.741600000000005}]
[null,null,null,"Custo horário total de mão de obra",{"$nulls":5},{"$f":"SUM(J588:J588)","v":85.741600000000005}]
[null,null,null,"Custo horário total de execução",{"$nulls":5},{"$f":"J586+J589","v":2135.5475579999998}]
[null,null,null,"Custo unitário de execução",{"$nulls":5},{"$f":"J590/I577","v":21.441240542168675}]
[{"$nulls":7},"Custo do FIC",null,0]
[{"$nulls":7},"Custo do FIT",null,0]
[null,"C - MATERIAL",null,"Quantidade","Unidade",null,"Preço Unitário","Custo Unitário"]
[null,"M0028","Areia média",2.7009999999999999E-2,"m³",null,145.6,null,null,{"$f":"D595*G595","v":3.9326559999999997},{"$f":"D595/SUM(D602,D601,D597,D596,D595)","v":4.2642879696874011E-2},{"$f":"VLOOKUP(A$534,ORÇAMENTO!A$11:L$66,8,FALSE)","v":4200},{"$f":"J595*L595","v":16517.155199999997}]
[null,"M0005","Brita 0",9.0029999999999999E-2,"m³",null,152.6,null,null,{"$f":"D596*G596","v":13.738577999999999},null,{"$f":"L595","v":4200},57702.027599999994]
[null,"M0191","Brita 1",3.2149999999999998E-2,"m³",null,145.6,null,null,4.6810399999999994,null,{"$f":"L596","v":4200},19660.367999999999]
[null,"M0344","Cal hidratada - a granel",14.4636,"kg",null,0.64459999999999995,null,null,9.3232365599999998,null,4200,39157.593551999998]
[null,"M1943","Cimento asfáltico de petróleo - CAP 50/70",5.5449999999999999E-2,"t",null,0,"FORNECIMENTO COM BDI DIFERENCIADO",null,0,null,4200,0]
[null,"M1941","Óleo tipo A1",8,"l",null,5.1599000000000004,null,null,41.279200000000003,null,4200,173372.64]
[null,"M1103","Pedrisco",0.1479,"m³",null,152.6,null,null,{"$f":"D601*G601","v":22.56954},null,4200]
[null,"M1135","Pó de pedra",0.33631,"m³",null,166.4,null,null,55.961984000000001,null,4200,235040.3328]
[null,null,null,"Custo unitário total de material",{"$nulls":5},{"$f":"SUM(J595:J602)","v":151.48623456000001}]
[null,"D - ATIVIDADES AUXILIARES",null,"Quantidade","Unidade",null,"Custo Unitário","Custo Unitário"]
[null,"-",0,0,0,null,0,null,null,{"$f":"D605*G605","v":0}]
[null,null,null,"Custo total de atividades auxiliares",{"$nulls":5},{"$f":"SUM(J605:J605)","v":0}]
[{"$nulls":7},"Subtotal",null,{"$f":"J591+J603+J606+J592+J593","v":172.9274751021687}]
[null,"E - TEMPO FIXO",null,"Código","Quantidade","Unidade",null,"Custo Unitário","Custo Unitário"]
[null,"M0028","Areia média",5914647,4.052E-2,"t",null,1.75,null,{"$f":"ROUNDDOWN(E609*H609,4)","v":7.0900000000000005E-2}]
[null,"M0005","Brita 0",5914647,0.13505,"t",null,1.75,null,0.23630000000000001]
[null,"M0191","Brita 1",5914647,4.8230000000000002E-2,"t",null,1.75,null,8.4400000000000003E-2]
[null,"M0344","Cal hidratada - a granel",5914363,1.4460000000000001E-2,"t",null,17.61,null,0.25459999999999999]
[null,"M1103","Pedrisco",5914647,0.22184999999999999,"t",null,1.75,null,{"$f":"ROUNDDOWN(E613*H613,4)","v":0.38819999999999999}]
[null,"M1135","Pó de pedra",5914647,0.50446999999999997,"t",null,1.75,null,{"$f":"ROUNDDOWN(E614*H614,4)","v":0.88280000000000003}]
[null,null,null,"Custo unitário total de tempo fixo",{"$nulls":5},{"$f":"SUM(J609:J614)","v":1.9172000000000002}]
[null,"F - MOMENTO DE TRANSPORTE",null,"Quantidade","Unidade","DMT",null,null,null,"Custo Unitário"]
[{"$nulls":5},"LN","RP","P"]
[null,"M0028","Areia média",4.052E-2,"tkm"]
[null,"M0005","Brita 0",0.13505,"tkm"]
[null,"M0191","Brita 1",4.8230000000000002E-2,"tkm"]
[null,"M0344","Cal hidratada - a granel",1.4460000000000001E-2,"tkm"]
[null,"M1103","Pedrisco",0.22184999999999999,"tkm"]
[null,"M1103","Pedrisco",0.50446999999999997,"tkm"]
[null,null,null,"Custo unitário total de transporte"]
[{"$nulls":5},"Custo unitário direto total",null,null,null,{"$f":"J607+J615","v":174.84467510216871}]
[null,"Obs."]
[]
[{"$f":"A534+1","v":15},"1ª/GRD",{"$nulls":8},{"$f":"J664","v":0.66}]
[null,"OBRA:"," PAVIMENTAÇÃO ASFÁLTICA EM CBUQ - ESTRADA PARA SANTO ANTÔNIO DA BOA VISTA (SÃO JOÃO DA PONTE / MG)"]
[null,"Custo Unitário de Referência",null,null,"Minas Gerais"]
[{"$nulls":4}," Janeiro/2025",null,null,"Produção da equipe ",470.61,{"$f":"VLOOKUP(A628,ORÇAMENTO!$A$10:$L$66,7,1)","v":"TXKM"}]
[null,5915321,"TRANSPORTE COM CAMINHÃO BASCULANTE, EM VIA URBANA PAVIMENTADA",{"$nulls":5},"Valores em reais (R$)"]
[null,"A - EQUIPAMENTOS",null,"Quantidade","Utilização",null,"Custo Horário",null,null,"Custo"]
[{"$nulls":4},"Operativa","Improdutiva","Produtivo","Improdutivo",null,"Horário Total"]
[null,"E9667","Caminhão basculante com capacidade de 14 m³ - 210 kW",1,1,0,313.74529999999999,91.048100000000005,null,{"$f":"D635*(E635*G635+F635*H635)","v":313.74529999999999}]
[null,"-",0,null,null,null,0,0,null,{"$f":"D636*(E636*G636+F636*H636)","v":0}]
[{"$nulls":7},"Custo horário total de equipamentos",null,{"$f":"SUM(J635:J636)","v":313.74529999999999}]
[null,"B - MÃO DE OBRA",null,"Quantidade","Unidade",null,"Custo Horário","Custo Horário Total"]
[null,"-",0,null,0,null,0,null,null,{"$f":"D639*G639","v":0}]
[null,"-",0,null,0,null,0,null,null,{"$f":"D640*G640","v":0}]
[null,null,null,"Custo horário total de mão de obra",{"$nulls":5},{"$f":"SUM(J639:J640)","v":0}]
[null,null,null,"Custo horário total de execução",{"$nulls":5},{"$f":"J637+J641","v":313.74529999999999}]
[null,null,null,"Custo unitário de execução",{"$nulls":5},{"$f":"J642/I631","v":0.66667792864580011}]
[{"$nulls":7},"Custo do FIC",null,0]
[{"$nulls":7},"Custo do FIT",null,0]
[null,"C - MATERIAL",null,"Quantidade","Unidade",null,"Preço Unitário","Custo Unitário"]
[null,"-",0,0,0,null,0,null,null,{"$f":"D647*G647","v":0}]
[null,"-",0,0,0,null,0,null,null,{"$f":"D648*G648","v":0}]
[null,null,null,"Custo unitário total de material",{"$nulls":5},{"$f":"SUM(J647:J648)","v":0}]
[null,"D - ATIVIDADES AUXILIARES",null,"Quantidade","Unidade",null,"Custo Unitário","Custo Unitário"]
[null,"-",0,0,0,null,0,null,null,{"$f":"D651*G651","v":0}]
[null,"-",0,0,0,null,0,null,null,{"$f":"D652*G652","v":0}]
[null,null,null,"Custo total de atividades auxiliares",{"$nulls":5},{"$f":"SUM(J651:J652)","v":0}]
[{"$nulls":7},"Subtotal",null,{"$f":"J643+J649+J653+J644+J645","v":0.66667792864580011}]
[null,"E - TEMPO FIXO",null,"Código","Quantidade","Unidade",null,"Custo Unitário","Custo Unitário"]
[null,"-",0,"-",0,"t",null,0,null,{"$f":"ROUNDDOWN(E656*H656,4)","v":0}]
[null,"-",0,"-",0,"t",null,0,null,{"$f":"ROUNDDOWN(E657*H657,4)","v":0}]
[null,null,null,"Custo unitário total de tempo fixo",{"$nulls":5},{"$f":"SUM(J656:J657)","v":0}]
[null,"F - MOMENTO DE TRANSPORTE",null,"Quantidade","Unidade","DMT",null,null,null,"Custo Unitário"]
[{"$nulls":5},"LN","RP","P"]
[null,"-",0,0,"tkm"]
[null,"-",0,0,"tkm"]
[null,null,null,"Custo unitário total de transporte"]
[{"$nulls":5},"Custo unitário direto total",null,null,null,{"$f":"TRUNC(J654+J658,2)","v":0.66},null,{"$f":"J664/0.63","v":1.0476190476190477}]
[null,"Obs."]
[]
[{"$f":"A628+1","v":16},"1ª/GRD",{"$nulls":8},{"$f":"J703","v":0.76}]
[null,"OBRA:"," PAVIMENTAÇÃO ASFÁLTICA EM CBUQ - ESTRADA PARA SANTO ANTÔNIO DA BOA VISTA (SÃO JOÃO DA PONTE / MG)"]
[null,"Custo Unitário de Referência",null,null,"Minas Gerais"]
[{"$nulls":4}," Janeiro/2025",null,null,"Produção da equipe ",241.03,{"$f":"VLOOKUP(A667,ORÇAMENTO!$A$10:$L$66,7,1)","v":"TXKM"}]
[null,5914434,"TRANSPORTE COM CAMINHÃO CARROCERIA 9T, EM VIA URBANA PAVIMENTADA",{"$nulls":5},"Valores em reais (R$)"]
[null,"A - EQUIPAMENTOS",null,"Quantidade","Utilização",null,"Custo Horário",null,null,"Custo"]
[{"$nulls":4},"Operativa","Improdutiva","Produtivo","Improdutivo",null,"Horário Total"]
[null,"E9508","Caminhão carroceria com capacidade de 9 t - 136 kW",1,1,0,183.48670000000001,69.869600000000005,null,{"$f":"D674*(E674*G674+F674*H674)","v":183.48670000000001}]
[null,"-",0,null,null,null,0,0,null,{"$f":"D675*(E675*G675+F675*H675)","v":0}]
[{"$nulls":7},"Custo horário total de equipamentos",null,{"$f":"SUM(J674:J675)","v":183.48670000000001}]
[null,"B - MÃO DE OBRA",null,"Quantidade","Unidade",null,"Custo Horário","Custo Horário Total"]
[null,"-",0,0,0,null,0,null,null,{"$f":"D678*G678","v":0}]
[null,"-",0,0,0,null,0,null,null,{"$f":"D679*G679","v":0}]
[null,null,null,"Custo horário total de mão de obra",{"$nulls":5},{"$f":"SUM(J678:J679)","v":0}]
[null,null,null,"Custo horário total de execução",{"$nulls":5},{"$f":"J676+J680","v":183.48670000000001}]
[null,null,null,"Custo unitário de execução",{"$nulls":5},{"$f":"J681/I670","v":0.76126083889972207}]
[{"$nulls":7},"Custo do FIC",null,0]
[{"$nulls":7},"Custo do FIT",null,0]
[null,"C - MATERIAL",null,"Quantidade","Unidade",null,"Preço Unitário","Custo Unitário"]
[null,"-",0,0,0,null,0,null,null,{"$f":"D686*G686","v":0},null,null,{"$f":"J686*L686","v":0}]
[null,"-",0,0,0,null,0,null,null,{"$f":"D687*G687","v":0},null,null,{"$f":"J687*L687","v":0}]
[null,null,null,"Custo unitário total de material",{"$nulls":5},{"$f":"SUM(J686:J687)","v":0}]
[null,"D - ATIVIDADES AUXILIARES",null,"Quantidade","Unidade",null,"Custo Unitário","Custo Unitário"]
[null,"-",0,0,0,null,0,null,null,{"$f":"D690*G690","v":0}]
[null,"-",0,0,0,null,0,null,null,{"$f":"D691*G691","v":0}]
[null,null,null,"Custo total de atividades auxiliares",{"$nulls":5},{"$f":"SUM(J690:J691)","v":0}]
[{"$nulls":7},"Subtotal",null,{"$f":"J682+J688+J692+J683+J684","v":0.76126083889972207}]
[null,"E - TEMPO FIXO",null,"Código","Quantidade","Unidade",null,"Custo Unitário","Custo Unitário"]
[null,"-",0,"-",0,"t",null,0,null,{"$f":"ROUNDDOWN(E695*H695,4)","v":0}]
[null,"-",0,"-",0,"t",null,0,null,{"$f":"ROUNDDOWN(E696*H696,4)","v":0}]
[null,null,null,"Custo unitário total de tempo fixo",{"$nulls":5},{"$f":"SUM(J695:J696)","v":0}]
[null,"F - MOMENTO DE TRANSPORTE",null,"Quantidade","Unidade","DMT",null,null,null,"Custo Unitário"]
[{"$nulls":5},"LN","RP","P"]
[null,"-",0,0,"tkm"]
[null,"-",0,0,"tkm"]
[null,null,null,"Custo unitário total de transporte"]
[{"$nulls":5},"Custo unitário direto total",null,null,null,{"$f":"TRUNC(J693+J697,2)","v":0.76}]
[null,"Obs."]
[]
[{"$f":"A667+1","v":17},"1ª/GRD",{"$nulls":8},{"$f":"J742","v":0.81}]
[null,"OBRA:"," PAVIMENTAÇÃO ASFÁLTICA EM CBUQ - ESTRADA PARA SANTO ANTÔNIO DA BOA VISTA (SÃO JOÃO DA PONTE / MG)"]
[null,"Custo Unitário de Referência",null,null,"Minas Gerais"]
[{"$nulls":4}," Janeiro/2025",null,null,"Produção da equipe ",224.1,{"$f":"VLOOKUP(A706,ORÇAMENTO!$A$10:$L$66,7,1)","v":"TXKM"}]
[null,5914612,"TRANSPORTE DE MASSA ASFÁLTICA COM CAMINHÃO BASCULANTE COM CAÇAMBA TÉRMICA, EM VIA URBANA PAVIMENTADA (BDI DIFERENCIADO)",{"$nulls":5},"Valores em reais (R$)"]
[null,"A - EQUIPAMENTOS",null,"Quantidade","Utilização",null,"Custo Horário",null,null,"Custo"]
[{"$nulls":4},"Operativa","Improdutiva","Produtivo","Improdutivo",null,"Horário Total"]
[null,"E9520","Caminhão com caçamba térmica com capacidade de 6 m³ - 136 kW",1,1,0,183.2457,69.798699999999997,null,{"$f":"D713*(E713*G713+F713*H713)","v":183.2457}]
[null,"-",0,null,null,null,0,0,null,{"$f":"D714*(E714*G714+F714*H714)","v":0}]
[{"$nulls":7},"Custo horário total de equipamentos",null,{"$f":"SUM(J713:J714)","v":183.2457}]
[null,"B - MÃO DE OBRA",null,"Quantidade","Unidade",null,"Custo Horário","Custo Horário Total"]
[null,"-",0,0,0,null,0,null,null,{"$f":"D717*G717","v":0}]
[null,"-",0,0,0,null,0,null,null,{"$f":"D718*G718","v":0}]
[null,null,null,"Custo horário total de mão de obra",{"$nulls":5},{"$f":"SUM(J717:J718)","v":0}]
[null,null,null,"Custo horário total de execução",{"$nulls":5},{"$f":"J715+J719","v":183.2457}]
[null,null,null,"Custo unitário de execução",{"$nulls":5},{"$f":"J720/I709","v":0.81769611780455154}]
[{"$nulls":7},"Custo do FIC",null,0]
[{"$nulls":7},"Custo do FIT",null,0]
[null,"C - MATERIAL",null,"Quantidade","Unidade",null,"Preço Unitário","Custo Unitário"]
[null,"-",0,0,0,null,0,null,null,{"$f":"D725*G725","v":0},null,null,{"$f":"J725*L725","v":0}]
[null,"-",0,0,0,null,0,null,null,{"$f":"D726*G726","v":0},null,null,{"$f":"J726*L726","v":0}]
[null,null,null,"Custo unitário total de material",{"$nulls":5},{"$f":"SUM(J725:J726)","v":0}]
[null,"D - ATIVIDADES AUXILIARES",null,"Quantidade","Unidade",null,"Custo Unitário","Custo Unitário"]
[null,"-",0,0,0,null,0,null,null,{"$f":"D729*G729","v":0}]
[null,"-",0,0,0,null,0,null,null,{"$f":"D730*G730","v":0}]
[null,null,null,"Custo total de atividades auxiliares",{"$nulls":5},{"$f":"SUM(J729:J730)","v":0}]
[{"$nulls":7},"Subtotal",null,{"$f":"J721+J727+J731+J722+J723","v":0.81769611780455154}]
[null,"E - TEMPO FIXO",null,"Código","Quantidade","Unidade",null,"Custo Unitário","Custo Unitário"]
[null,"-",0,"-",0,"t",null,0,null,{"$f":"ROUNDDOWN(E734*H734,4)","v":0}]
[null,"-",0,"-",0,"t",null,0,null,{"$f":"ROUNDDOWN(E735*H735,4)","v":0}]
[null,null,null,"Custo unitário total de tempo fixo",{"$nulls":5},{"$f":"SUM(J734:J735)","v":0}]
[null,"F - MOMENTO DE TRANSPORTE",null,"Quantidade","Unidade","DMT",null,null,null,"Custo Unitário"]
[{"$nulls":5},"LN","RP","P"]
[null,"-",0,0,"tkm"]
[null,"-",0,0,"tkm"]
[null,null,null,"Custo unitário total de transporte"]
[{"$nulls":5},"Custo unitário direto total",null,null,null,{"$f":"TRUNC(J732+J736,2)","v":0.81}]
[null,"Obs."]
[]
[{"$f":"A706+1","v":18},"1ª/GRD",{"$nulls":8},{"$f":"J781","v":1.79}]
[null,"OBRA:"," PAVIMENTAÇÃO ASFÁLTICA EM CBUQ - ESTRADA PARA SANTO ANTÔNIO DA BOA VISTA (SÃO JOÃO DA PONTE / MG)"]
[null,"Custo Unitário de Referência",null,null,"Minas Gerais"]
[{"$nulls":4}," Janeiro/2025",null,null,"Produção da equipe ",149.4,{"$f":"VLOOKUP(A745,ORÇAMENTO!$A$10:$L$66,7,1)","v":"TXKM"}]
[null,5914622,"TRANSPORTE COM CAMINHÃO TANQUE DE TRANSPORTE DE MATERIAL ASFÁLTICO DE 30000 L, EM VIA URBANA PAVIMENTADA (BDI DIFERENCIADO)",{"$nulls":5},"Valores em reais (R$)"]
[null,"A - EQUIPAMENTOS",null,"Quantidade","Utilização",null,"Custo Horário",null,null,"Custo"]
[{"$nulls":4},"Operativa","Improdutiva","Produtivo","Improdutivo",null,"Horário Total"]
[null,"E9509","Caminhão tanque distribuidor de asfalto com capacidade de 6.000 l - 7 kW/136 kW",1,1,0,267.51929999999999,74.644499999999994,null,{"$f":"D752*(E752*G752+F752*H752)","v":267.51929999999999}]
[null,"-",0,null,null,null,0,0,null,{"$f":"D753*(E753*G753+F753*H753)","v":0}]
[{"$nulls":7},"Custo horário total de equipamentos",null,{"$f":"SUM(J752:J753)","v":267.51929999999999}]
[null,"B - MÃO DE OBRA",null,"Quantidade","Unidade",null,"Custo Horário","Custo Horário Total"]
[null,"-",0,0,0,null,0,null,null,{"$f":"D756*G756","v":0}]
[null,"-",0,0,0,null,0,null,null,{"$f":"D757*G757","v":0}]
[null,null,null,"Custo horário total de mão de obra",{"$nulls":5},{"$f":"SUM(J756:J757)","v":0}]
[null,null,null,"Custo horário total de execução",{"$nulls":5},{"$f":"J754+J758","v":267.51929999999999}]
[null,null,null,"Custo unitário de execução",{"$nulls":5},{"$f":"J759/I748","v":1.7906244979919677}]
[{"$nulls":7},"Custo do FIC",null,0]
[{"$nulls":7},"Custo do FIT",null,0]
[null,"C - MATERIAL",null,"Quantidade","Unidade",null,"Preço Unitário","Custo Unitário"]
[null,"-",0,null,0,null,0,null,null,{"$f":"D764*G764","v":0},null,null,{"$f":"J764*L764","v":0}]
[null,"-",0,null,0,null,0,null,null,{"$f":"D765*G765","v":0},null,null,{"$f":"J765*L765","v":0}]
[null,null,null,"Custo unitário total de material",{"$nulls":5},{"$f":"SUM(J764:J765)","v":0}]
[null,"D - ATIVIDADES AUXILIARES",null,"Quantidade","Unidade",null,"Custo Unitário","Custo Unitário"]
[null,"-",0,0,0,null,0,null,null,{"$f":"D768*G768","v":0}]
[null,"-",0,0,0,null,0,null,null,{"$f":"D769*G769","v":0}]
[null,null,null,"Custo total de atividades auxiliares",{"$nulls":5},{"$f":"SUM(J768:J769)","v":0}]
[{"$nulls":7},"Subtotal",null,{"$f":"J760+J766+J770+J761+J762","v":1.7906244979919677}]
[null,"E - TEMPO FIXO",null,"Código","Quantidade","Unidade",null,"Custo Unitário","Custo Unitário"]
[null,"-",0,"-",0,"t",null,0,null,{"$f":"ROUNDDOWN(E773*H773,4)","v":0}]
[null,"-",0,"-",0,"t",null,0,null,{"$f":"ROUNDDOWN(E774*H774,4)","v":0}]
[null,null,null,"Custo unitário total de tempo fixo",{"$nulls":5},{"$f":"SUM(J773:J774)","v":0}]
[null,"F - MOMENTO DE TRANSPORTE",null,"Quantidade","Unidade","DMT",null,null,null,"Custo Unitário"]
[{"$nulls":5},"LN","RP","P"]
[null,"-",0,0,"tkm"]
[null,"-",0,0,"tkm"]
[null,null,null,"Custo unitário total de transporte"]
[{"$nulls":5},"Custo unitário direto total",null,null,null,{"$f":"TRUNC(J771+J775,2)","v":1.79}]
[null,"Obs."]
[]
[{"$f":"A745+1","v":19},"1ª/GRD",{"$nulls":8},{"$f":"J820","v":21.61}]
[null,"OBRA:"," PAVIMENTAÇÃO ASFÁLTICA EM CBUQ - ESTRADA PARA SANTO ANTÔNIO DA BOA VISTA (SÃO JOÃO DA PONTE / MG)"]
[null,"Custo Unitário de Referência",null,null,"Minas Gerais"]
[{"$nulls":4}," Janeiro/2025",null,null,"Produção da equipe ",93.19,{"$f":"VLOOKUP(A784,ORÇAMENTO!$A$10:$L$66,7,1)","v":"M"}]
[null,2003947,"MEIO FIO DE CONCRETO - MFC 05, MOLDADO NO LOCAL - AREIA E BRITA COMERCIAIS",{"$nulls":5},"Valores em reais (R$)"]
[null,"A - EQUIPAMENTOS",null,"Quantidade","Utilização",null,"Custo Horário",null,null,"Custo"]
[{"$nulls":4},"Operativa","Improdutiva","Produtivo","Improdutivo",null,"Horário Total"]
[null,"E9103","Extrusora para meio-fio de concreto - 10,44 kW",1,1,0,45.406599999999997,31.956299999999999,null,{"$f":"D791*(E791*G791+F791*H791)","v":45.406599999999997}]
[null,"-",0,null,null,null,0,0,null,{"$f":"D792*(E792*G792+F792*H792)","v":0}]
[{"$nulls":7},"Custo horário total de equipamentos",null,{"$f":"SUM(J791:J792)","v":45.406599999999997}]
[null,"B - MÃO DE OBRA",null,"Quantidade","Unidade",null,"Custo Horário","Custo Horário Total"]
[null,"P9821","Pedreiro",1,"h",null,27.132200000000001,null,null,{"$f":"D795*G795","v":27.132200000000001}]
[null,"P9824","Servente",2,"h",null,21.435400000000001,null,null,{"$f":"D796*G796","v":42.870800000000003}]
[null,null,null,"Custo horário total de mão de obra",{"$nulls":5},{"$f":"SUM(J795:J796)","v":70.003}]
[null,null,null,"Custo horário total de execução",{"$nulls":5},{"$f":"J793+J797","v":115.4096}]
[null,null,null,"Custo unitário de execução",{"$nulls":5},{"$f":"J798/I787","v":1.2384333082948815}]
[{"$nulls":7},"Custo do FIC",null,0]
[{"$nulls":7},"Custo do FIT",null,0]
[null,"C - MATERIAL",null,"Quantidade","Unidade",null,"Preço Unitário","Custo Unitário"]
[null,"-",0,null,0,null,0,null,null,{"$f":"D803*G803","v":0},null,null,{"$f":"J803*L803","v":0}]
[null,"-",0,null,0,null,0,null,null,0,null,null,{"$f":"J804*L804","v":0}]
[null,null,null,"Custo unitário total de material",{"$nulls":5},{"$f":"SUM(J803:J804)","v":0}]
[null,"D - ATIVIDADES AUXILIARES",null,"Quantidade","Unidade",null,"Custo Unitário","Custo Unitário"]
[null,1107928,"Concreto fck = 20 MPa - confecção em central dosadora de 30 m³/h - areia e brita comerciais",3.3399999999999999E-2,"m³",null,414.88,null,null,{"$f":"D807*G807","v":13.856992},null,{"$f":"VLOOKUP(A$784,ORÇAMENTO!A$11:L$66,8,FALSE)","v":920},{"$f":"J807*L807","v":12748.432639999999}]
[null,4805750,"Escavação manual em material de 1ª categoria na profundidade de até 1 m",1.7999999999999999E-2,"m³",null,43.75,null,null,{"$f":"D808*G808","v":0.78749999999999998},null,null,{"$f":"J808*L808","v":0}]
[null,null,null,"Custo total de atividades auxiliares",{"$nulls":5},{"$f":"SUM(J807:J808)","v":14.644492}]
[{"$nulls":7},"Subtotal",null,{"$f":"J799+J805+J809+J800+J801","v":15.882925308294881}]
[null,"E - TEMPO FIXO",null,"Código","Quantidade","Unidade",null,"Custo Unitário","Custo Unitário"]
[null,1107928,"Concreto fck = 20 MPa - confecção em central dosadora de 30 m³/h - areia e brita comerciais",5919533,8.0159999999999995E-2,"t",null,71.540000000000006,null,{"$f":"ROUNDDOWN(E812*H812,4)","v":5.7346000000000004}]
[null,"-",0,"-",0,"t",null,0,null,{"$f":"ROUNDDOWN(E813*H813,4)","v":0}]
[null,null,null,"Custo unitário total de tempo fixo",{"$nulls":5},{"$f":"SUM(J812:J813)","v":5.7346000000000004}]
[null,"F - MOMENTO DE TRANSPORTE",null,"Quantidade","Unidade","DMT",null,null,null,"Custo Unitário"]
[{"$nulls":5},"LN","RP","P"]
[null,1107928,"Concreto fck = 20 MPa - confecção em central dosadora de 30 m³/h - areia e brita comerciais",8.0159999999999995E-2,"tkm"]
[null,"-",0,0,"tkm"]
[null,null,null,"Custo unitário total de transporte"]
[{"$nulls":5},"Custo unitário direto total",null,null,null,{"$f":"TRUNC(J810+J814,2)","v":21.61}]
[null,"Obs."]
[]
[{"$f":"A784+1","v":20},"1ª/GRD",{"$nulls":8},{"$f":"J859","v":27.5}]
[null,"OBRA:"," PAVIMENTAÇÃO ASFÁLTICA EM CBUQ - ESTRADA PARA SANTO ANTÔNIO DA BOA VISTA (SÃO JOÃO DA PONTE / MG)"]
[null,"Custo Unitário de Referência",null,null,"Minas Gerais"]
[{"$nulls":4}," Janeiro/2025",null,null,"Produção da equipe ",74.11,{"$f":"VLOOKUP(A823,ORÇAMENTO!$A$10:$L$66,7,1)","v":"M"}]
[null,2003943,"MEIO FIO DE CONCRETO - MFC 03, MOLDADO NO LOCAL - AREIA E BRITA COMERCIAIS",{"$nulls":5},"Valores em reais (R$)"]
[null,"A - EQUIPAMENTOS",null,"Quantidade","Utilização",null,"Custo Horário",null,null,"Custo"]
[{"$nulls":4},"Operativa","Improdutiva","Produtivo","Improdutivo",null,"Horário Total"]
[null,"E9103","Extrusora para meio-fio de concreto - 10,44 kW",1,1,0,45.406599999999997,31.956299999999999,null,{"$f":"D830*(E830*G830+F830*H830)","v":45.406599999999997}]
[null,"-",0,null,null,null,0,0,null,{"$f":"D831*(E831*G831+F831*H831)","v":0}]
[{"$nulls":7},"Custo horário total de equipamentos",null,{"$f":"SUM(J830:J831)","v":45.406599999999997}]
[null,"B - MÃO DE OBRA",null,"Quantidade","Unidade",null,"Custo Horário","Custo Horário Total"]
[null,"P9821","Pedreiro",1,"h",null,27.132200000000001,null,null,{"$f":"D834*G834","v":27.132200000000001}]
[null,"P9824","Servente",2,"h",null,21.435400000000001,null,null,{"$f":"D835*G835","v":42.870800000000003}]
[null,null,null,"Custo horário total de mão de obra",{"$nulls":5},{"$f":"SUM(J834:J835)","v":70.003}]
[null,null,null,"Custo horário total de execução",{"$nulls":5},{"$f":"J832+J836","v":115.4096}]
[null,null,null,"Custo unitário de execução",{"$nulls":5},{"$f":"J837/I826","v":1.5572743219538523}]
[{"$nulls":7},"Custo do FIC",null,0]
[{"$nulls":7},"Custo do FIT",null,0]
[null,"C - MATERIAL",null,"Quantidade","Unidade",null,"Preço Unitário","Custo Unitário"]
[null,"-",0,0,0,null,0,null,null,{"$f":"D842*G842","v":0},null,null,{"$f":"J842*L842","v":0}]
[null,"-",0,0,0,null,0,null,null,0,null,null,{"$f":"J843*L843","v":0}]
[null,null,null,"Custo unitário total de material",{"$nulls":5},{"$f":"SUM(J842:J843)","v":0}]
[null,"D - ATIVIDADES AUXILIARES",null,"Quantidade","Unidade",null,"Custo Unitário","Custo Unitário"]
[null,1107928,"Concreto fck = 20 MPa - confecção em central dosadora de 30 m³/h - areia e brita comerciais",4.2000000000000003E-2,"m³",null,414.88,null,null,{"$f":"D846*G846","v":17.424960000000002},null,{"$f":"VLOOKUP(A$823,ORÇAMENTO!A$11:L$66,8,FALSE)","v":230},{"$f":"J846*L846","v":4007.7408000000005}]
[null,4805750,"Escavação manual em material de 1ª categoria na profundidade de até 1 m",0.03,"m³",null,43.75,null,null,{"$f":"D847*G847","v":1.3125}]
[null,null,null,"Custo total de atividades auxiliares",{"$nulls":5},{"$f":"SUM(J846:J847)","v":18.737460000000002}]
[{"$nulls":7},"Subtotal",null,{"$f":"J838+J844+J848+J839+J840","v":20.294734321953854}]
[null,"E - TEMPO FIXO",null,"Código","Quantidade","Unidade",null,"Custo Unitário","Custo Unitário"]
[null,1107928,"Concreto fck = 20 MPa - confecção em central dosadora de 30 m³/h - areia e brita comerciais",5919533,0.1008,"t",null,71.540000000000006,null,{"$f":"ROUNDDOWN(E851*H851,4)","v":7.2111999999999998}]
[null,"-",0,"-",0,"t",null,0,null,{"$f":"ROUNDDOWN(E852*H852,4)","v":0}]
[null,null,null,"Custo unitário total de tempo fixo",{"$nulls":5},{"$f":"SUM(J851:J852)","v":7.2111999999999998}]
[null,"F - MOMENTO DE TRANSPORTE",null,"Quantidade","Unidade","DMT",null,null,null,"Custo Unitário"]
[{"$nulls":5},"LN","RP","P"]
[null,1107928,"Concreto fck = 20 MPa - confecção em central dosadora de 30 m³/h - areia e brita comerciais",0.1008,"tkm"]
[null,"-",0,0,"tkm"]
[null,null,null,"Custo unitário total de transporte"]
[{"$nulls":5},"Custo unitário direto total",null,null,null,{"$f":"TRUNC(J849+J853,2)","v":27.5}]
[null,"Obs."]
[]
[{"$f":"A823+1","v":21},"1ª/GRD",{"$nulls":8},{"$f":"J901","v":47.29}]
[null,"OBRA:"," PAVIMENTAÇÃO ASFÁLTICA EM CBUQ - ESTRADA PARA SANTO ANTÔNIO DA BOA VISTA (SÃO JOÃO DA PONTE / MG)"]
[null,"Custo Unitário de Referência",null,null,"Minas Gerais"]
[{"$nulls":4}," Janeiro/2025",null,null,"Produção da equipe ",1,{"$f":"VLOOKUP(A862,ORÇAMENTO!$A$10:$L$66,7,1)","v":"M"}]
[null,2003261,"SARJETA TRIANGULAR DE CONCRETO - STC 80-15 - ESCAVAÇÃO MECÂNICA - AREIA E BRITA COMERCIAIS",{"$nulls":5},"Valores em reais (R$)"]
[null,"A - EQUIPAMENTOS",null,"Quantidade","Utilização",null,"Custo Horário",null,null,"Custo"]
[{"$nulls":4},"Operativa","Improdutiva","Produtivo","Improdutivo",null,"Horário Total"]
[null,"-",0,null,null,null,0,0,null,{"$f":"D869*(E869*G869+F869*H869)","v":0}]
[null,"-",0,null,null,null,0,0,null,{"$f":"D870*(E870*G870+F870*H870)","v":0}]
[{"$nulls":7},"Custo horário total de equipamentos",null,{"$f":"SUM(J869:J870)","v":0}]
[null,"B - MÃO DE OBRA",null,"Quantidade","Unidade",null,"Custo Horário","Custo Horário Total"]
[null,"-",0,0,0,null,0,null,null,{"$f":"D873*G873","v":0}]
[null,"-",0,0,0,null,0,null,null,{"$f":"D874*G874","v":0}]
[null,null,null,"Custo horário total de mão de obra",{"$nulls":5},{"$f":"SUM(J873:J874)","v":0}]
[null,null,null,"Custo horário total de execução",{"$nulls":5},{"$f":"J871+J875","v":0}]
[null,null,null,"Custo unitário de execução",{"$nulls":5},{"$f":"J876/I865","v":0}]
[{"$nulls":7},"Custo do FIC",null,"-"]
[{"$nulls":7},"Custo do FIT",null,"-"]
[null,"C - MATERIAL",null,"Quantidade","Unidade",null,"Preço Unitário","Custo Unitário"]
[null,"-",0,0,0,null,0,null,null,{"$f":"D881*G881","v":0},null,null,{"$f":"J881*L881","v":0}]
[null,"-",0,0,0,null,0,null,null,0,null,null,{"$f":"J882*L882","v":0}]
[null,null,null,"Custo unitário total de material",{"$nulls":5},{"$f":"SUM(J881:J882)","v":0}]
[null,"D - ATIVIDADES AUXILIARES",null,"Quantidade","Unidade",null,"Custo Unitário","Custo Unitário"]
[null,4805756,"Apiloamento manual de superfície com espessura de 15 cm",1.0294000000000001,"m²",null,4.82,null,null,{"$f":"D885*G885","v":4.9617080000000007}]
[null,1107892,"Concreto fck = 20 MPa - confecção em betoneira e lançamento manual - areia e brita comerciais",7.6300000000000007E-2,"m³",null,474.33,null,null,{"$f":"D886*G886","v":36.191379000000005},null,{"$f":"VLOOKUP(A$862,ORÇAMENTO!A$11:L$66,8,FALSE)","v":3000},{"$f":"J886*L886","v":108574.13700000002}]
[null,1109669,"Argamassa de cimento e areia 1:3 - confecção em betoneira e lançamento manual - areia comercial",1E-4,"m³",null,488.89,null,null,4.8889000000000002E-2,null,{"$f":"L886","v":3000},{"$f":"J887*L887","v":146.667}]
[null,2004519,"Escavação mecânica de vala trapezoidal ou triangular em material de 1ª categoria para drenagem superficial com retroescavadeira - 0,10 m² ≤ seção < 0,15 m²",0.13639999999999999,"m³",null,27.12,null,null,3.6991679999999998,null,null,{"$f":"J888*L888","v":0}]
[null,3108022,"Guia de madeira de 2,5 x 8,0 cm - confecção e instalação",0.51470000000000005,"m",null,4.66,null,null,2.3985020000000001,null,{"$f":"L886","v":3000},7195.5060000000003]
[null,null,null,"Custo total de atividades auxiliares",{"$nulls":5},{"$f":"SUM(J885:J889)","v":47.29964600000001}]
[{"$nulls":7},"Subtotal",null,{"$f":"J877+J883+J890","v":47.29964600000001}]
[null,"E - TEMPO FIXO",null,"Código","Quantidade","Unidade",null,"Custo Unitário","Custo Unitário"]
[null,"-",0,"-",0,"t",null,0,null,{"$f":"ROUNDDOWN(E893*H893,4)","v":0}]
[null,"-",0,"-",0,"t",null,0,null,{"$f":"ROUNDDOWN(E894*H894,4)","v":0}]
[null,null,null,"Custo unitário total de tempo fixo",{"$nulls":5},{"$f":"SUM(J893:J894)","v":0}]
[null,"F - MOMENTO DE TRANSPORTE",null,"Quantidade","Unidade","DMT",null,null,null,"Custo Unitário"]
[{"$nulls":5},"LN","RP","P"]
[null,"-",0,0,"tkm"]
[null,"-",0,0,"tkm"]
[null,null,null,"Custo unitário total de transporte"]
[{"$nulls":5},"Custo unitário direto total",null,null,null,{"$f":"TRUNC(J891+J895,2)","v":47.29}]
[null,"Obs."]
[]
[{"$f":"A862+1","v":22},"1ª/GRD",{"$nulls":8},{"$f":"J940","v":73.959999999999994}]
[null,"OBRA:"," PAVIMENTAÇÃO ASFÁLTICA EM CBUQ - ESTRADA PARA SANTO ANTÔNIO DA BOA VISTA (SÃO JOÃO DA PONTE / MG)"]
[null,"Custo Unitário de Referência",null,null,"Minas Gerais"]
[{"$nulls":4}," Janeiro/2025",null,null,"Produção da equipe ",1,{"$f":"VLOOKUP(A904,ORÇAMENTO!$A$10:$L$66,7,1)","v":"UNID."}]
[null,2003387,"ENTRADA PARA DESCIDA D'ÁGUA - EDA 02 - AREIA E BRITA COMERCIAIS",{"$nulls":5},"Valores em reais (R$)"]
[null,"A - EQUIPAMENTOS",null,"Quantidade","Utilização",null,"Custo Horário",null,null,"Custo"]
[{"$nulls":4},"Operativa","Improdutiva","Produtivo","Improdutivo",null,"Horário Total"]
[null,"-",0,null,null,null,0,0,null,{"$f":"D911*(E911*G911+F911*H911)","v":0}]
[null,"-",0,null,null,null,0,0,null,{"$f":"D912*(E912*G912+F912*H912)","v":0}]
[{"$nulls":7},"Custo horário total de equipamentos",null,{"$f":"SUM(J911:J912)","v":0}]
[null,"B - MÃO DE OBRA",null,"Quantidade","Unidade",null,"Custo Horário","Custo Horário Total"]
[null,"-",0,null,0,null,0,null,null,{"$f":"D915*G915","v":0}]
[null,"-",0,null,0,null,0,null,null,{"$f":"D916*G916","v":0}]
[null,null,null,"Custo horário total de mão de obra",{"$nulls":5},{"$f":"SUM(J915:J916)","v":0}]
[null,null,null,"Custo horário total de execução",{"$nulls":5},{"$f":"J913+J917","v":0}]
[null,null,null,"Custo unitário de execução",{"$nulls":5},{"$f":"J918/I907","v":0}]
[{"$nulls":7},"Custo do FIC",null,0]
[{"$nulls":7},"Custo do FIT",null,0]
[null,"C - MATERIAL",null,"Quantidade","Unidade",null,"Preço Unitário","Custo Unitário"]
[null,"-",0,null,0,null,0,null,null,{"$f":"D923*G923","v":0},null,null,{"$f":"J923*L923","v":0}]
[null,"-",0,null,0,null,0,null,null,0,null,null,{"$f":"J924*L924","v":0}]
[null,null,null,"Custo unitário total de material",{"$nulls":5},{"$f":"SUM(J923:J924)","v":0}]
[null,"D - ATIVIDADES AUXILIARES",null,"Quantidade","Unidade",null,"Custo Unitário","Custo Unitário"]
[null,1107892,"Concreto fck = 20 MPa - confecção em betoneira e lançamento manual - areia e brita comerciais",0.14000000000000001,"m³",null,474.33,null,null,{"$f":"D927*G927","v":66.406199999999998},null,{"$f":"VLOOKUP(A$904,ORÇAMENTO!A$11:L$66,8,FALSE)","v":12},{"$f":"J927*L927","v":796.87439999999992}]
[null,3103302,"Fôrmas de tábuas de pinho para dispositivos de drenagem - utilização de 3 vezes - confecção, instalação e retirada",0.1,"m²",null,75.569999999999993,null,null,{"$f":"D928*G928","v":7.5569999999999995},null,{"$f":"L927","v":12},{"$f":"J928*L928","v":90.683999999999997}]
[null,null,null,"Custo total de atividades auxiliares",{"$nulls":5},{"$f":"SUM(J927:J928)","v":73.963200000000001}]
[{"$nulls":7},"Subtotal",null,{"$f":"J919+J925+J929+J920+J921","v":73.963200000000001}]
[null,"E - TEMPO FIXO",null,"Código","Quantidade","Unidade",null,"Custo Unitário","Custo Unitário"]
[null,"-",0,"-",0,"t",null,0,null,{"$f":"ROUNDDOWN(E932*H932,4)","v":0}]
[null,"-",0,"-",0,"t",null,0,null,{"$f":"ROUNDDOWN(E933*H933,4)","v":0}]
[null,null,null,"Custo unitário total de tempo fixo",{"$nulls":5},{"$f":"SUM(J932:J933)","v":0}]
[null,"F - MOMENTO DE TRANSPORTE",null,"Quantidade","Unidade","DMT",null,null,null,"Custo Unitário"]
[{"$nulls":5},"LN","RP","P"]
[null,"-",0,0,"tkm"]
[null,"-",0,0,"tkm"]
[null,null,null,"Custo unitário total de transporte"]
[{"$nulls":5},"Custo unitário direto total",null,null,null,{"$f":"TRUNC(J930+J934,2)","v":73.959999999999994}]
[null,"Obs."]
[]
[{"$f":"A904+1","v":23},"1ª/GRD",{"$nulls":8},{"$f":"J982","v":227.95}]
[null,"OBRA:"," PAVIMENTAÇÃO ASFÁLTICA EM CBUQ - ESTRADA PARA SANTO ANTÔNIO DA BOA VISTA (SÃO JOÃO DA PONTE / MG)"]
[null,"Custo Unitário de Referência",null,null,"Minas Gerais"]
[{"$nulls":4}," Janeiro/2025",null,null,"Produção da equipe ",1,{"$f":"VLOOKUP(A943,ORÇAMENTO!$A$10:$L$66,7,1)","v":"M"}]
[null,2003389,"DESCIDA D'ÁGUA DE ATERRO TIPO RÁPIDO - DAR 01 - AREIA E BRITA COMERCIAIS",{"$nulls":5},"Valores em reais (R$)"]
[null,"A - EQUIPAMENTOS",null,"Quantidade","Utilização",null,"Custo Horário",null,null,"Custo"]
[{"$nulls":4},"Operativa","Improdutiva","Produtivo","Improdutivo",null,"Horário Total"]
[null,"-",0,null,null,null,0,0,null,{"$f":"D950*(E950*G950+F950*H950)","v":0}]
[null,"-",0,null,null,null,0,0,null,{"$f":"D951*(E951*G951+F951*H951)","v":0}]
[{"$nulls":7},"Custo horário total de equipamentos",null,{"$f":"SUM(J950:J951)","v":0}]
[null,"B - MÃO DE OBRA",null,"Quantidade","Unidade",null,"Custo Horário","Custo Horário Total"]
[null,"P9821","Pedreiro",0.25,"h",null,27.132200000000001,null,null,{"$f":"D954*G954","v":6.7830500000000002}]
[null,"P9824","Servente",2,"h",null,21.435400000000001,null,null,{"$f":"D955*G955","v":42.870800000000003}]
[null,null,null,"Custo horário total de mão de obra",{"$nulls":5},{"$f":"SUM(J954:J955)","v":49.653850000000006}]
[null,null,null,"Custo horário total de execução",{"$nulls":5},{"$f":"J952+J956","v":49.653850000000006}]
[null,null,null,"Custo unitário de execução",{"$nulls":5},{"$f":"J957/I946","v":49.653850000000006}]
[{"$nulls":7},"Custo do FIC",null,0]
[{"$nulls":7},"Custo do FIT",null,0]
[null,"C - MATERIAL",null,"Quantidade","Unidade",null,"Preço Unitário","Custo Unitário"]
[null,"M2117","Meio tubo de concreto simples - D = 0,40 m",1,"m",null,46.2926,null,null,{"$f":"D962*G962","v":46.2926},null,{"$f":"VLOOKUP(A$943,ORÇAMENTO!A$11:L$66,8,FALSE)","v":45},{"$f":"J962*L962","v":2083.1669999999999}]
[null,"-",0,null,0,null,0,null,null,{"$f":"D963*G963","v":0},null,{"$f":"L962","v":45},{"$f":"J963*L963","v":0}]
[null,null,null,"Custo unitário total de material",{"$nulls":5},{"$f":"SUM(J962:J963)","v":46.2926}]
[null,"D - ATIVIDADES AUXILIARES",null,"Quantidade","Unidade",null,"Custo Unitário","Custo Unitário"]
[null,4805756,"Apiloamento manual de superfície com espessura de 15 cm",0.68,"m²",null,4.82,null,null,{"$f":"D966*G966","v":3.2776000000000005}]
[null,1109669,"Argamassa de cimento e areia 1:3 - confecção em betoneira e lançamento manual - areia comercial",4.0000000000000002E-4,"m³",null,488.89,null,null,{"$f":"D967*G967","v":0.19555600000000001},null,{"$f":"L968","v":45},{"$f":"J967*L967","v":8.80002}]
[null,1107892,"Concreto fck = 20 MPa - confecção em betoneira e lançamento manual - areia e brita comerciais",0.1389,"m³",null,474.33,null,null,{"$f":"D968*G968","v":65.884436999999991},null,{"$f":"VLOOKUP(A$943,ORÇAMENTO!A$11:L$66,8,FALSE)","v":45},{"$f":"J968*L968","v":2964.7996649999995}]
[null,4805750,"Escavação manual em material de 1ª categoria na profundidade de até 1 m",0.17710000000000001,"m³",null,43.75,null,null,{"$f":"D969*G969","v":7.7481249999999999}]
[null,3103302,"Fôrmas de tábuas de pinho para dispositivos de drenagem - utilização de 3 vezes - confecção, instalação e retirada",0.68,"m²",null,75.569999999999993,null,null,{"$f":"D970*G970","v":51.387599999999999},null,{"$f":"VLOOKUP(A$943,ORÇAMENTO!A$11:L$66,8,FALSE)","v":45},{"$f":"J970*L970","v":2312.442}]
[null,null,null,"Custo total de atividades auxiliares",{"$nulls":5},{"$f":"SUM(J966:J970)","v":128.49331799999999}]
[{"$nulls":7},"Subtotal",null,{"$f":"J958+J964+J971+J959+J960","v":224.43976799999999}]
[null,"E - TEMPO FIXO",null,"Código","Quantidade","Unidade",null,"Custo Unitário","Custo Unitário"]
[null,"M2117","Meio tubo de concreto simples - D = 0,40 m",5914655,0.10838,"t",null,32.39,null,{"$f":"ROUNDDOWN(E974*H974,4)","v":3.5104000000000002}]
[null,"-",0,"-",null,"t",null,0,null,0]
[null,null,null,"Custo unitário total de tempo fixo",{"$nulls":5},{"$f":"SUM(J974:J975)","v":3.5104000000000002}]
[null,"F - MOMENTO DE TRANSPORTE",null,"Quantidade","Unidade","DMT",null,null,null,"Custo Unitário"]
[{"$nulls":5},"LN","RP","P"]
[null,"M2117","Meio tubo de concreto simples - D = 0,40 m",0.10838,"tkm"]
[null,"-",0,0,"tkm"]
[null,null,null,"Custo unitário total de transporte"]
[{"$nulls":5},"Custo unitário direto total",null,null,null,{"$f":"TRUNC(J972+J976,2)","v":227.95}]
[null,"Obs."]
[]
[{"$f":"A943+1","v":24},"1ª/GRD",{"$nulls":8},{"$f":"J1023","v":1368.85}]
[null,"OBRA:"," PAVIMENTAÇÃO ASFÁLTICA EM CBUQ - ESTRADA PARA SANTO ANTÔNIO DA BOA VISTA (SÃO JOÃO DA PONTE / MG)"]
[null,"Custo Unitário de Referência",null,null,"Minas Gerais"]
[{"$nulls":4}," Janeiro/2025",null,null,"Produção da equipe ",1,{"$f":"VLOOKUP(A985,ORÇAMENTO!$A$10:$L$66,7,1)","v":"UNID."}]
[null,2003455,"DISSIPADOR DE ENERGIA - DEB 04 - AREIA, BRITA E PEDRA DE MÃO COMERCIAIS",{"$nulls":5},"Valores em reais (R$)"]
[null,"A - EQUIPAMENTOS",null,"Quantidade","Utilização",null,"Custo Horário",null,null,"Custo"]
[{"$nulls":4},"Operativa","Improdutiva","Produtivo","Improdutivo",null,"Horário Total"]
[null,"-",0,null,null,null,0,0,null,{"$f":"D992*(E992*G992+F992*H992)","v":0}]
[null,"-",0,null,null,null,0,0,null,{"$f":"D993*(E993*G993+F993*H993)","v":0}]
[{"$nulls":7},"Custo horário total de equipamentos",null,{"$f":"SUM(J992:J993)","v":0}]
[null,"B - MÃO DE OBRA",null,"Quantidade","Unidade",null,"Custo Horário","Custo Horário Total"]
[null,"P9824","Servente",1.5167999999999999,"h",null,21.435400000000001,null,null,{"$f":"D996*G996","v":32.513214720000001}]
[null,"-",0,0,0,null,0,null,null,{"$f":"D997*G997","v":0}]
[null,null,null,"Custo horário total de mão de obra",{"$nulls":5},{"$f":"SUM(J996:J997)","v":32.513214720000001}]
[null,null,null,"Custo horário total de execução",{"$nulls":5},{"$f":"J994+J998","v":32.513214720000001}]
[null,null,null,"Custo unitário de execução",{"$nulls":5},{"$f":"J999/I988","v":32.513214720000001}]
[{"$nulls":7},"Custo do FIC",null,0]
[{"$nulls":7},"Custo do FIT",null,0]
[null,"C - MATERIAL",null,"Quantidade","Unidade",null,"Preço Unitário","Custo Unitário"]
[null,"M1097","Pedra de mão ou rachão",0.59670000000000001,"m³",null,156,null,null,{"$f":"D1004*G1004","v":93.0852},null,{"$f":"VLOOKUP(A$985,ORÇAMENTO!A$11:L$66,8,FALSE)","v":12},{"$f":"J1004*L1004","v":1117.0224000000001}]
[null,"-",0,0,0,null,0,null,null,{"$f":"D1005*G1005","v":0},null,{"$f":"L1004","v":12},{"$f":"J1005*L1005","v":0}]
[null,null,null,"Custo unitário total de material",{"$nulls":5},{"$f":"SUM(J1004:J1005)","v":93.0852}]
[null,"D - ATIVIDADES AUXILIARES",null,"Quantidade","Unidade",null,"Custo Unitário","Custo Unitário"]
[null,4805756,"Apiloamento manual de superfície com espessura de 15 cm",8.4623000000000008,"m²",null,4.82,null,null,{"$f":"D1008*G1008","v":40.788286000000006},null,null,{"$f":"J1008*L1008","v":0}]
[null,1107892,"Concreto fck = 20 MPa - confecção em betoneira e lançamento manual - areia e brita comerciais",1.5143,"m³",null,474.33,null,null,{"$f":"D1009*G1009","v":718.277919},null,{"$f":"VLOOKUP(A$985,ORÇAMENTO!A$11:L$66,8,FALSE)","v":12},{"$f":"J1009*L1009","v":8619.3350279999995}]
[null,4805750,"Escavação manual em material de 1ª categoria na profundidade de até 1 m",1.6924999999999999,"m³",null,43.75,null,null,{"$f":"D1010*G1010","v":74.046875}]
[null,3103302,"Fôrmas de tábuas de pinho para dispositivos de drenagem - utilização de 3 vezes - confecção, instalação e retirada",5.4066000000000001,"m²",null,75.569999999999993,null,null,{"$f":"D1011*G1011","v":408.57676199999997},null,{"$f":"VLOOKUP(A$985,ORÇAMENTO!A$11:L$66,8,FALSE)","v":12},{"$f":"J1011*L1011","v":4902.9211439999999}]
[null,null,null,"Custo total de atividades auxiliares",{"$nulls":5},{"$f":"SUM(J1008:J1011)","v":1241.689842}]
[{"$nulls":7},"Subtotal",null,{"$f":"J1000+J1006+J1012+J1001+J1002","v":1367.2882567199999}]
[null,"E - TEMPO FIXO",null,"Código","Quantidade","Unidade",null,"Custo Unitário","Custo Unitário"]
[null,"M1097","Pedra de mão ou rachão",5914647,0.89505000000000001,"t",null,1.75,null,{"$f":"ROUNDDOWN(E1015*H1015,4)","v":1.5663}]
[null,"-",0,"-",0,"t",null,0,null,0]
[null,null,null,"Custo unitário total de tempo fixo",{"$nulls":5},{"$f":"SUM(J1015:J1016)","v":1.5663}]
[null,"F - MOMENTO DE TRANSPORTE",null,"Quantidade","Unidade","DMT",null,null,null,"Custo Unitário"]
[{"$nulls":5},"LN","RP","P"]
[null,"M1097","Pedra de mão ou rachão",0.89505000000000001,"tkm"]
[null,"-",0,0,"tkm"]
[null,null,null,"Custo unitário total de transporte"]
[{"$nulls":5},"Custo unitário direto total",null,null,null,{"$f":"TRUNC(J1013+J1017,2)","v":1368.85}]
[null,"Obs."]
[]
[{"$f":"A985+1","v":25},"1ª/GRD",{"$nulls":8},{"$f":"J1066","v":3763.8}]
[null,"OBRA:"," PAVIMENTAÇÃO ASFÁLTICA EM CBUQ - ESTRADA PARA SANTO ANTÔNIO DA BOA VISTA (SÃO JOÃO DA PONTE / MG)"]
[null,"Custo Unitário de Referência",null,null,"Minas Gerais"]
[{"$nulls":4}," Janeiro/2025",null,null,"Produção da equipe ",7.9039999999999999E-2,{"$f":"VLOOKUP(A1026,ORÇAMENTO!$A$10:$L$66,7,1)","v":"UNID."}]
[null,2003481,"CAIXA COLETORA DE SARJETA - CCS 03 - COM GRELHA DE CONCRETO - TCC 01 - AREIA E BRITA COMERCIAIS",{"$nulls":5},"Valores em reais (R$)"]
[null,"A - EQUIPAMENTOS",null,"Quantidade","Utilização",null,"Custo Horário",null,null,"Custo"]
[{"$nulls":4},"Operativa","Improdutiva","Produtivo","Improdutivo",null,"Horário Total"]
[null,"-",0,null,null,null,0,0,null,{"$f":"D1033*(E1033*G1033+F1033*H1033)","v":0}]
[null,"-",0,null,null,null,0,0,null,{"$f":"D1034*(E1034*G1034+F1034*H1034)","v":0}]
[{"$nulls":7},"Custo horário total de equipamentos",null,{"$f":"SUM(J1033:J1034)","v":0}]
[null,"B - MÃO DE OBRA",null,"Quantidade","Unidade",null,"Custo Horário","Custo Horário Total"]
[null,"-",0,null,0,null,0,null,null,{"$f":"D1037*G1037","v":0}]
[null,"-",0,null,0,null,0,null,null,{"$f":"D1038*G1038","v":0}]
[null,null,null,"Custo horário total de mão de obra",{"$nulls":5},{"$f":"SUM(J1037:J1038)","v":0}]
[null,null,null,"Custo horário total de execução",{"$nulls":5},{"$f":"J1035+J1039","v":0}]
[null,null,null,"Custo unitário de execução",{"$nulls":5},{"$f":"J1040/I1029","v":0}]
[{"$nulls":7},"Custo do FIC",null,0]
[{"$nulls":7},"Custo do FIT",null,0]
[null,"C - MATERIAL",null,"Quantidade","Unidade",null,"Preço Unitário","Custo Unitário"]
[null,"-",0,0,0,null,0,null,null,{"$f":"D1045*G1045","v":0},null,null,{"$f":"J1045*L1045","v":0}]
[null,"-",0,0,0,null,0,null,null,0,null,null,{"$f":"J1046*L1046","v":0}]
[null,null,null,"Custo unitário total de material",{"$nulls":5},{"$f":"SUM(J1045:J1046)","v":0}]
[null,"D - ATIVIDADES AUXILIARES",null,"Quantidade","Unidade",null,"Custo Unitário","Custo Unitário"]
[null,4805755,"Apiloamento manual",5,"m³",null,32.15,null,null,{"$f":"D1049*G1049","v":160.75}]
[null,407819,"Armação em aço CA-50 - fornecimento, preparo e colocação",12.08,"kg",null,12.47,null,null,{"$f":"D1050*G1050","v":150.63760000000002},null,{"$f":"VLOOKUP(A$1026,ORÇAMENTO!A$11:L$66,8,FALSE)","v":6},{"$f":"J1050*L1050","v":903.82560000000012}]
[null,1107892,"Concreto fck = 20 MPa - confecção em betoneira e lançamento manual - areia e brita comerciais",2,"m³",null,474.33,null,null,948.66,null,{"$f":"L1050","v":6},{"$f":"J1051*L1051","v":5691.96}]
[null,1107896,"Concreto fck = 25 MPa - confecção em betoneira e lançamento manual - areia e brita comerciais",9.1999999999999998E-2,"m³",null,491.3,null,null,45.199600000000004,null,{"$f":"L1051","v":6},{"$f":"J1052*L1052","v":271.19760000000002}]
[null,4805751,"Escavação manual em material de 1ª categoria na profundidade de 1 a 2 m",15,"m³",null,54.68,null,null,{"$f":"D1053*G1053","v":820.2},null,6]
[null,3103302,"Fôrmas de tábuas de pinho para dispositivos de drenagem - utilização de 3 vezes - confecção, instalação e retirada",21.68,"m²",null,75.569999999999993,null,null,{"$f":"D1054*G1054","v":1638.3575999999998},null,6,{"$f":"J1054*L1054","v":9830.1455999999998}]
[null,null,null,"Custo total de atividades auxiliares",{"$nulls":5},{"$f":"SUM(J1049:J1054)","v":3763.8047999999994}]
[{"$nulls":7},"Subtotal",null,{"$f":"J1041+J1047+J1055+J1042+J1043","v":3763.8047999999994}]
[null,"E - TEMPO FIXO",null,"Código","Quantidade","Unidade",null,"Custo Unitário","Custo Unitário"]
[null,"-",0,"-",0,"t",null,0,null,{"$f":"ROUNDDOWN(E1058*H1058,4)","v":0}]
[null,"-",0,"-",0,"t",null,0,null,{"$f":"ROUNDDOWN(E1059*H1059,4)","v":0}]
[null,null,null,"Custo unitário total de tempo fixo",{"$nulls":5},{"$f":"SUM(J1058:J1059)","v":0}]
[null,"F - MOMENTO DE TRANSPORTE",null,"Quantidade","Unidade","DMT",null,null,null,"Custo Unitário"]
[{"$nulls":5},"LN","RP","P"]
[null,"-",0,null,"tkm"]
[null,"-",0,null,"tkm"]
[null,null,null,"Custo unitário total de transporte"]
[{"$nulls":5},"Custo unitário direto total",null,null,null,{"$f":"TRUNC(J1056+J1060,2)","v":3763.8}]
[null,"Obs."]
[]
[{"$f":"A1026+1","v":26},"1ª/GRD",{"$nulls":8},{"$f":"J1105","v":2815.77}]
[null,"OBRA:"," PAVIMENTAÇÃO ASFÁLTICA EM CBUQ - ESTRADA PARA SANTO ANTÔNIO DA BOA VISTA (SÃO JOÃO DA PONTE / MG)"]
[null,"Custo Unitário de Referência",null,null,"Minas Gerais"]
[{"$nulls":4}," Janeiro/2025",null,null,"Produção da equipe ",1,{"$f":"VLOOKUP(A1069,ORÇAMENTO!$A$10:$L$66,7,1)","v":"UNID."}]
[null,804317,"BOCA PARA BUEIRO TRIPLO TUBULAR DE CONCRETO (BTTC), D=1,0M - AREIA E BRITA COMERCIAIS",{"$nulls":5},"Valores em reais (R$)"]
[null,"A - EQUIPAMENTOS",null,"Quantidade","Utilização",null,"Custo Horário",null,null,"Custo"]
[{"$nulls":4},"Operativa","Improdutiva","Produtivo","Improdutivo",null,"Horário Total"]
[null,"-",0,null,null,null,0,0,null,{"$f":"D1076*(E1076*G1076+F1076*H1076)","v":0}]
[null,"-",0,null,null,null,0,0,null,{"$f":"D1077*(E1077*G1077+F1077*H1077)","v":0}]
[{"$nulls":7},"Custo horário total de equipamentos",null,{"$f":"SUM(J1076:J1077)","v":0}]
[null,"B - MÃO DE OBRA",null,"Quantidade","Unidade",null,"Custo Horário","Custo Horário Total"]
[null,"-",0,null,0,null,0,null,null,{"$f":"D1080*G1080","v":0}]
[null,"-",0,null,0,null,0,null,null,{"$f":"D1081*G1081","v":0}]
[null,null,null,"Custo horário total de mão de obra",{"$nulls":5},{"$f":"SUM(J1080:J1081)","v":0}]
[null,null,null,"Custo horário total de execução",{"$nulls":5},{"$f":"J1078+J1082","v":0}]
[null,null,null,"Custo unitário de execução",{"$nulls":5},{"$f":"J1083/I1072","v":0}]
[{"$nulls":7},"Custo do FIC",null,"-"]
[{"$nulls":7},"Custo do FIT",null,"-"]
[null,"C - MATERIAL",null,"Quantidade","Unidade",null,"Preço Unitário","Custo Unitário"]
[null,"-",0,0,0,null,0,null,null,{"$f":"D1088*G1088","v":0},null,null,{"$f":"J1088*L1088","v":0}]
[null,"-",0,0,0,null,0,null,null,0,null,null,{"$f":"J1089*L1089","v":0}]
[null,null,null,"Custo unitário total de material",{"$nulls":5},{"$f":"SUM(J1088:J1089)","v":0}]
[null,"D - ATIVIDADES AUXILIARES",null,"Quantidade","Unidade",null,"Custo Unitário","Custo Unitário"]
[null,1107892,"Concreto fck = 20 MPa - confecção em betoneira e lançamento manual - areia e brita comerciais",3.8109999999999999,"m³",null,474.33,null,null,{"$f":"D1092*G1092","v":1807.6716299999998},null,{"$f":"VLOOKUP(A$1069,ORÇAMENTO!A$11:L$66,8,FALSE)","v":2},{"$f":"J1092*L1092","v":3615.3432599999996}]
[null,3103302,"Fôrmas de tábuas de pinho para dispositivos de drenagem - utilização de 3 vezes - confecção, instalação e retirada",13.34,"m²",null,75.569999999999993,null,null,{"$f":"D1093*G1093","v":1008.1037999999999},null,{"$f":"VLOOKUP(A$1069,ORÇAMENTO!A$11:L$66,8,FALSE)","v":2},2016.2075999999997]
[null,null,null,"Custo total de atividades auxiliares",{"$nulls":5},{"$f":"SUM(J1092:J1093)","v":2815.7754299999997}]
[{"$nulls":7},"Subtotal",null,{"$f":"J1084+J1090+J1094","v":2815.7754299999997}]
[null,"E - TEMPO FIXO",null,"Código","Quantidade","Unidade",null,"Custo Unitário","Custo Unitário"]
[null,"-",0,"-",0,"t",null,0,null,{"$f":"ROUNDDOWN(E1097*H1097,4)","v":0}]
[null,"-",0,"-",0,"t",null,0,null,{"$f":"ROUNDDOWN(E1098*H1098,4)","v":0}]
[null,null,null,"Custo unitário total de tempo fixo",{"$nulls":5},{"$f":"SUM(J1097:J1098)","v":0}]
[null,"F - MOMENTO DE TRANSPORTE",null,"Quantidade","Unidade","DMT",null,null,null,"Custo Unitário"]
[{"$nulls":5},"LN","RP","P"]
[null,"-",0,0,"tkm"]
[null,"-",0,0,"tkm"]
[null,null,null,"Custo unitário total de transporte"]
[{"$nulls":5},"Custo unitário direto total",null,null,null,{"$f":"TRUNC(J1095+J1099,2)","v":2815.77}]
[null,"Obs."]
[]
[{"$f":"A1069+1","v":27},"1ª/GRD",{"$nulls":8},{"$f":"J1145","v":2391.11}]
[null,"OBRA:"," PAVIMENTAÇÃO ASFÁLTICA EM CBUQ - ESTRADA PARA SANTO ANTÔNIO DA BOA VISTA (SÃO JOÃO DA PONTE / MG)"]
[null,"Custo Unitário de Referência",null,null,"Minas Gerais"]
[{"$nulls":4}," Janeiro/2025",null,null,"Produção da equipe ",1.0375000000000001,{"$f":"VLOOKUP(A1108,ORÇAMENTO!$A$10:$L$66,7,1)","v":"M"}]
[null,804292,"CORPO DE BUEIRO TRIPLO TUBULAR DE CONCRETO (BTTC), D=1,0M - PA-1 - AREIA E BRITA COMERCIAIS",{"$nulls":5},"Valores em reais (R$)"]
[null,"A - EQUIPAMENTOS",null,"Quantidade","Utilização",null,"Custo Horário",null,null,"Custo"]
[{"$nulls":4},"Operativa","Improdutiva","Produtivo","Improdutivo",null,"Horário Total"]
[null,"E9686","Caminhão guindauto com capacidade de elevação de 6,2 t e carroceria de 7 t - 136 kW",1,1,0,297.26960000000003,97.0655,null,{"$f":"D1115*(E1115*G1115+F1115*H1115)","v":297.26960000000003}]
[null,"-",0,null,null,null,0,0,null,{"$f":"D1116*(E1116*G1116+F1116*H1116)","v":0}]
[{"$nulls":7},"Custo horário total de equipamentos",null,{"$f":"SUM(J1115:J1116)","v":297.26960000000003}]
[null,"B - MÃO DE OBRA",null,"Quantidade","Unidade",null,"Custo Horário","Custo Horário Total"]
[null,"P9824","Servente",3,"h",null,21.435400000000001,null,null,{"$f":"D1119*G1119","v":64.306200000000004}]
[null,"-",0,null,0,null,0,null,null,{"$f":"D1120*G1120","v":0}]
[null,null,null,"Custo horário total de mão de obra",{"$nulls":5},{"$f":"SUM(J1119:J1120)","v":64.306200000000004}]
[null,null,null,"Custo horário total de execução",{"$nulls":5},{"$f":"J1117+J1121","v":361.57580000000002}]
[null,null,null,"Custo unitário de execução",{"$nulls":5},{"$f":"J1122/I1111","v":348.50679518072286}]
[{"$nulls":7},"Custo do FIC",null,0]
[{"$nulls":7},"Custo do FIT",null,0]
[null,"C - MATERIAL",null,"Quantidade","Unidade",null,"Preço Unitário","Custo Unitário"]
[null,"M2175","Tubo de concreto armado PA1 - D = 1,00 m",3,"m",null,559.58989999999994,null,null,{"$f":"D1127*G1127","v":1678.7696999999998},null,{"$f":"VLOOKUP(A$1108,ORÇAMENTO!A$11:L$66,8,FALSE)","v":27},{"$f":"J1127*L1127","v":45326.781899999994}]
[null,"-",0,0,0,null,0,null,null,{"$f":"D1128*G1128","v":0},null,{"$f":"L1127","v":27},{"$f":"J1128*L1128","v":0}]
[null,null,null,"Custo unitário total de material",{"$nulls":5},{"$f":"SUM(J1127:J1128)","v":1678.7696999999998}]
[null,"D - ATIVIDADES AUXILIARES",null,"Quantidade","Unidade",null,"Custo Unitário","Custo Unitário"]
[null,1109670,"Argamassa de cimento e areia 1:4 - confecção em betoneira e lançamento manual - areia extraída",2.2040000000000001E-2,"m³",null,288.70999999999998,null,null,{"$f":"D1131*G1131","v":6.3631683999999993},null,{"$f":"$L$1127","v":27},{"$f":"J1131*L1131","v":171.80554679999997}]
[null,1106164,"Concreto ciclópico fck = 20 MPa - confecção em betoneira e lançamento manual - areia extraída, brita e pedra de mão produzidas",1.246,"m³",null,238.38,null,null,{"$f":"D1132*G1132","v":297.02148},null,{"$f":"$L$1127","v":27},8019.57996]
[null,3103302,"Fôrmas de tábuas de pinho para dispositivos de drenagem - utilização de 3 vezes - confecção, instalação e retirada",0.8,"m²",null,75.569999999999993,null,null,{"$f":"D1133*G1133","v":60.455999999999996},null,27,1632.3119999999999]
[null,null,null,"Custo total de atividades auxiliares",{"$nulls":5},{"$f":"SUM(J1131:J1133)","v":363.84064840000002}]
[{"$nulls":7},"Subtotal",null,{"$f":"J1123+J1129+J1134+J1124+J1125","v":2391.1171435807228}]
[null,"E - TEMPO FIXO",null,"Código","Quantidade","Unidade",null,"Custo Unitário","Custo Unitário"]
[null,"-",0,"-",0,"t",null,0,null,{"$f":"ROUNDDOWN(E1137*H1137,4)","v":0}]
[null,"-",0,"-",0,"t",null,0,null,{"$f":"ROUNDDOWN(E1138*H1138,4)","v":0}]
[null,null,null,"Custo unitário total de tempo fixo",{"$nulls":5},{"$f":"SUM(J1137:J1138)","v":0}]
[null,"F - MOMENTO DE TRANSPORTE",null,"Quantidade","Unidade","DMT",null,null,null,"Custo Unitário"]
[{"$nulls":5},"LN","RP","P"]
[null,"M2175","Tubo de concreto armado PA1 - D = 1,00 m",2.3600099999999999,"tkm"]
[null,"-",0,0,"tkm"]
[null,null,null,"Custo unitário total de transporte"]
[{"$nulls":5},"Custo unitário direto total",null,null,null,{"$f":"TRUNC(J1135+J1139,2)","v":2391.11}]
[null,"Obs."]
[]
[{"$f":"A1108+1","v":28},"1ª/GRD",{"$nulls":8},{"$f":"J1184","v":1923.98}]
[null,"OBRA:"," PAVIMENTAÇÃO ASFÁLTICA EM CBUQ - ESTRADA PARA SANTO ANTÔNIO DA BOA VISTA (SÃO JOÃO DA PONTE / MG)"]
[null,"Custo Unitário de Referência",null,null,"Minas Gerais"]
[{"$nulls":4}," Janeiro/2025",null,null,"Produção da equipe ",1,{"$f":"VLOOKUP(A1148,ORÇAMENTO!$A$10:$L$66,7,1)","v":"UNID."}]
[null,804121,"BOCA PARA BUEIRO SIMPLES TUBULAR DE CONCRETO (BSTC), D=1,0M - AREIA E BRITA COMERCIAIS",{"$nulls":5},"Valores em reais (R$)"]
[null,"A - EQUIPAMENTOS",null,"Quantidade","Utilização",null,"Custo Horário",null,null,"Custo"]
[{"$nulls":4},"Operativa","Improdutiva","Produtivo","Improdutivo",null,"Horário Total"]
[null,"-",0,null,null,null,0,0,null,{"$f":"D1155*(E1155*G1155+F1155*H1155)","v":0}]
[null,"-",0,null,null,null,0,0,null,{"$f":"D1156*(E1156*G1156+F1156*H1156)","v":0}]
[{"$nulls":7},"Custo horário total de equipamentos",null,{"$f":"SUM(J1155:J1156)","v":0}]
[null,"B - MÃO DE OBRA",null,"Quantidade","Unidade",null,"Custo Horário","Custo Horário Total"]
[null,"-",0,null,0,null,0,null,null,{"$f":"D1159*G1159","v":0}]
[null,"-",0,null,0,null,0,null,null,{"$f":"D1160*G1160","v":0}]
[null,null,null,"Custo horário total de mão de obra",{"$nulls":5},{"$f":"SUM(J1159:J1160)","v":0}]
[null,null,null,"Custo horário total de execução",{"$nulls":5},{"$f":"J1157+J1161","v":0}]
[null,null,null,"Custo unitário de execução",{"$nulls":5},{"$f":"J1162/I1151","v":0}]
[{"$nulls":7},"Custo do FIC",null,0]
[{"$nulls":7},"Custo do FIT",null,0]
[null,"C - MATERIAL",null,"Quantidade","Unidade",null,"Preço Unitário","Custo Unitário"]
[null,"-",0,0,0,null,0,null,null,{"$f":"D1167*G1167","v":0},null,null,{"$f":"J1167*L1167","v":0}]
[null,"-",0,0,0,null,0,null,null,{"$f":"D1168*G1168","v":0},null,null,{"$f":"J1168*L1168","v":0}]
[null,null,null,"Custo unitário total de material",{"$nulls":5},{"$f":"SUM(J1167:J1168)","v":0}]
[null,"D - ATIVIDADES AUXILIARES",null,"Quantidade","Unidade",null,"Custo Unitário","Custo Unitário"]
[null,1107892,"Concreto fck = 20 MPa - confecção em betoneira e lançamento manual - areia e brita comerciais",2.5139999999999998,"m³",null,474.33,null,null,{"$f":"D1171*G1171","v":1192.4656199999999},null,{"$f":"VLOOKUP(A$1148,ORÇAMENTO!A$11:L$66,8,FALSE)","v":3},{"$f":"J1171*L1171","v":3577.3968599999998}]
[null,3103302,"Fôrmas de tábuas de pinho para dispositivos de drenagem - utilização de 3 vezes - confecção, instalação e retirada",9.68,"m²",null,75.569999999999993,null,null,{"$f":"D1172*G1172","v":731.5175999999999},null,{"$f":"L1171","v":3},{"$f":"J1172*L1172","v":2194.5527999999995}]
[null,null,null,"Custo total de atividades auxiliares",{"$nulls":5},{"$f":"SUM(J1171:J1172)","v":1923.9832199999998}]
[{"$nulls":7},"Subtotal",null,{"$f":"J1163+J1169+J1173+J1164+J1165","v":1923.9832199999998}]
[null,"E - TEMPO FIXO",null,"Código","Quantidade","Unidade",null,"Custo Unitário","Custo Unitário"]
[null,"-",0,"-",0,"t",null,0,null,{"$f":"ROUNDDOWN(E1176*H1176,4)","v":0}]
[null,"-",0,"-",0,"t",null,0,null,{"$f":"ROUNDDOWN(E1177*H1177,4)","v":0}]
[null,null,null,"Custo unitário total de tempo fixo",{"$nulls":5},{"$f":"SUM(J1176:J1177)","v":0}]
[null,"F - MOMENTO DE TRANSPORTE",null,"Quantidade","Unidade","DMT",null,null,null,"Custo Unitário"]
[{"$nulls":5},"LN","RP","P"]
[null,"-",0,0,"tkm"]
[null,"-",0,0,"tkm"]
[null,null,null,"Custo unitário total de transporte"]
[{"$nulls":5},"Custo unitário direto total",null,null,null,{"$f":"TRUNC(J1174+J1178,2)","v":1923.98}]
[null,"Obs."]
[]
[{"$f":"A1148+1","v":29},"1ª/GRD",{"$nulls":8},{"$f":"J1224","v":911.85}]
[null,"OBRA:"," PAVIMENTAÇÃO ASFÁLTICA EM CBUQ - ESTRADA PARA SANTO ANTÔNIO DA BOA VISTA (SÃO JOÃO DA PONTE / MG)"]
[null,"Custo Unitário de Referência",null,null,"Minas Gerais"]
[{"$nulls":4}," Janeiro/2025",null,null,"Produção da equipe ",3.1124999999999998,{"$f":"VLOOKUP(A1187,ORÇAMENTO!$A$10:$L$66,7,1)","v":"M"}]
[null,804037,"CORPO DE BUEIRO SIMPLES TUBULAR DE CONCRETO (BSTC), D=1,0M - PA-1 - AREIA E BRITA COMERCIAIS",{"$nulls":5},"Valores em reais (R$)"]
[null,"A - EQUIPAMENTOS",null,"Quantidade","Utilização",null,"Custo Horário",null,null,"Custo"]
[{"$nulls":4},"Operativa","Improdutiva","Produtivo","Improdutivo",null,"Horário Total"]
[null,"E9686","Caminhão guindauto com capacidade de elevação de 6,2 t e carroceria de 7 t - 136 kW",1,1,0,297.26960000000003,97.0655,null,{"$f":"D1194*(E1194*G1194+F1194*H1194)","v":297.26960000000003}]
[null,"-",0,null,null,null,0,0,null,{"$f":"D1195*(E1195*G1195+F1195*H1195)","v":0}]
[{"$nulls":7},"Custo horário total de equipamentos",null,{"$f":"SUM(J1194:J1195)","v":297.26960000000003}]
[null,"B - MÃO DE OBRA",null,"Quantidade","Unidade",null,"Custo Horário","Custo Horário Total"]
[null,"P9824","Servente",3,"h",null,21.435400000000001,null,null,{"$f":"D1198*G1198","v":64.306200000000004}]
[null,"-",0,0,0,null,0,null,null,{"$f":"D1199*G1199","v":0}]
[null,null,null,"Custo horário total de mão de obra",{"$nulls":5},{"$f":"SUM(J1198:J1199)","v":64.306200000000004}]
[null,null,null,"Custo horário total de execução",{"$nulls":5},{"$f":"J1196+J1200","v":361.57580000000002}]
[null,null,null,"Custo unitário de execução",{"$nulls":5},{"$f":"J1201/I1190","v":116.16893172690764}]
[{"$nulls":7},"Custo do FIC",null,0]
[{"$nulls":7},"Custo do FIT",null,0]
[null,"C - MATERIAL",null,"Quantidade","Unidade",null,"Preço Unitário","Custo Unitário"]
[null,"M2175","Tubo de concreto armado PA1 - D = 1,00 m",1,"m",null,559.58989999999994,null,null,{"$f":"D1206*G1206","v":559.58989999999994},null,{"$f":"VLOOKUP(A$1187,ORÇAMENTO!A$11:L$66,8,FALSE)","v":200},{"$f":"J1206*L1206","v":111917.97999999998}]
[null,"-",0,0,0,null,0,null,null,{"$f":"D1207*G1207","v":0},null,{"$f":"L1206","v":200},{"$f":"J1207*L1207","v":0}]
[null,null,null,"Custo unitário total de material",{"$nulls":5},{"$f":"SUM(J1206:J1207)","v":559.58989999999994}]
[null,"D - ATIVIDADES AUXILIARES",null,"Quantidade","Unidade",null,"Custo Unitário","Custo Unitário"]
[null,1109671,"Argamassa de cimento e areia 1:4 - confecção em betoneira e lançamento manual - areia comercial",7.3499999999999998E-3,"m³",null,456.9,null,null,{"$f":"D1210*G1210","v":3.3582149999999995},null,{"$f":"$L$1206","v":200},{"$f":"J1210*L1210","v":671.64299999999992}]
[null,1106165,"Concreto ciclópico fck = 20 MPa - confecção em betoneira e lançamento manual - areia, brita e pedra de mão comerciais",0.40200000000000002,"m³",null,428.55,null,null,{"$f":"D1211*G1211","v":172.27710000000002},null,{"$f":"$L$1206","v":200},{"$f":"J1211*L1211","v":34455.420000000006}]
[null,3103302,"Fôrmas de tábuas de pinho para dispositivos de drenagem - utilização de 3 vezes - confecção, instalação e retirada",0.8,"m²",null,75.569999999999993,null,null,{"$f":"D1212*G1212","v":60.455999999999996},null,200,{"$f":"J1212*L1212","v":12091.199999999999}]
[null,null,null,"Custo total de atividades auxiliares",{"$nulls":5},{"$f":"SUM(J1210:J1212)","v":236.09131500000001}]
[{"$nulls":7},"Subtotal",null,{"$f":"J1202+J1208+J1213+J1203+J1204","v":911.85014672690761}]
[null,"E - TEMPO FIXO",null,"Código","Quantidade","Unidade",null,"Custo Unitário","Custo Unitário"]
[null,"-",0,"-",0,"t",null,0,null,{"$f":"ROUNDDOWN(E1216*H1216,4)","v":0}]
[null,"-",0,"-",0,"t",null,0,null,{"$f":"ROUNDDOWN(E1217*H1217,4)","v":0}]
[null,null,null,"Custo unitário total de tempo fixo",{"$nulls":5},{"$f":"SUM(J1216:J1217)","v":0}]
[null,"F - MOMENTO DE TRANSPORTE",null,"Quantidade","Unidade","DMT",null,null,null,"Custo Unitário"]
[{"$nulls":5},"LN","RP","P"]
[null,"M2175","Tubo de concreto armado PA1 - D = 1,00 m",0.78666999999999998,"tkm"]
[null,"-",0,0,"tkm"]
[null,null,null,"Custo unitário total de transporte"]
[{"$nulls":5},"Custo unitário direto total",null,null,null,{"$f":"TRUNC(J1214+J1218,2)","v":911.85}]
[null,"Obs."]
[]
[{"$f":"A1187+1","v":30},"1ª/GRD",{"$nulls":8},{"$f":"J1264","v":2514.75}]
[null,"OBRA:"," PAVIMENTAÇÃO ASFÁLTICA EM CBUQ - ESTRADA PARA SANTO ANTÔNIO DA BOA VISTA (SÃO JOÃO DA PONTE / MG)"]
[null,"Custo Unitário de Referência",null,null,"Minas Gerais"]
[{"$nulls":4}," Janeiro/2025",null,null,"Produção da equipe ",1,{"$f":"VLOOKUP(A1227,ORÇAMENTO!$A$10:$L$66,7,1)","v":"UNID."}]
[null,2003683,"POÇO DE VISITA TIPO PVI-04 - AREIA E BRITA COMERCIAIS",{"$nulls":5},"Valores em reais (R$)"]
[null,"A - EQUIPAMENTOS",null,"Quantidade","Utilização",null,"Custo Horário",null,null,"Custo"]
[{"$nulls":4},"Operativa","Improdutiva","Produtivo","Improdutivo",null,"Horário Total"]
[null,"-",0,null,null,null,0,0,null,{"$f":"D1234*(E1234*G1234+F1234*H1234)","v":0}]
[null,"-",0,null,null,null,0,0,null,{"$f":"D1235*(E1235*G1235+F1235*H1235)","v":0}]
[{"$nulls":7},"Custo horário total de equipamentos",null,{"$f":"SUM(J1234:J1235)","v":0}]
[null,"B - MÃO DE OBRA",null,"Quantidade","Unidade",null,"Custo Horário","Custo Horário Total"]
[null,"-",0,null,0,null,0,null,null,{"$f":"D1238*G1238","v":0}]
[null,"-",0,null,0,null,0,null,null,{"$f":"D1239*G1239","v":0}]
[null,null,null,"Custo horário total de mão de obra",{"$nulls":5},{"$f":"SUM(J1238:J1239)","v":0}]
[null,null,null,"Custo horário total de execução",{"$nulls":5},{"$f":"J1236+J1240","v":0}]
[null,null,null,"Custo unitário de execução",{"$nulls":5},{"$f":"J1241/I1230","v":0}]
[{"$nulls":7},"Custo do FIC",null,0]
[{"$nulls":7},"Custo do FIT",null,0]
[null,"C - MATERIAL",null,"Quantidade","Unidade",null,"Preço Unitário","Custo Unitário"]
[null,"-",0,0,0,null,0,null,null,{"$f":"D1246*G1246","v":0},null,null,{"$f":"J1246*L1246","v":0}]
[null,"-",0,0,0,null,0,null,null,0,null,null,{"$f":"J1247*L1247","v":0}]
[null,null,null,"Custo unitário total de material",{"$nulls":5},{"$f":"SUM(J1246:J1247)","v":0}]
[null,"D - ATIVIDADES AUXILIARES",null,"Quantidade","Unidade",null,"Custo Unitário","Custo Unitário"]
[null,407820,"Armação em aço CA-60 - fornecimento, preparo e colocação",22.9,"kg",null,13.55,null,null,{"$f":"D1250*G1250","v":310.29500000000002},null,{"$f":"VLOOKUP(A$1227,ORÇAMENTO!A$11:L$66,8,FALSE)","v":2},{"$f":"J1250*L1250","v":620.59}]
[null,1107891,"Concreto fck = 20 MPa - confecção em betoneira e lançamento manual - areia extraída e brita produzida",2.48,"m³",null,290.43,null,null,{"$f":"D1251*G1251","v":720.26639999999998},null,{"$f":"L1250","v":2},{"$f":"J1251*L1251","v":1440.5328}]
[null,3103302,"Fôrmas de tábuas de pinho para dispositivos de drenagem - utilização de 3 vezes - confecção, instalação e retirada",19.64,"m²",null,75.569999999999993,null,null,{"$f":"D1252*G1252","v":1484.1948},null,{"$f":"L1251","v":2},{"$f":"J1252*L1252","v":2968.3896}]
[null,null,null,"Custo total de atividades auxiliares",{"$nulls":5},{"$f":"SUM(J1250:J1252)","v":2514.7561999999998}]
[{"$nulls":7},"Subtotal",null,{"$f":"J1242+J1248+J1253+J1243+J1244","v":2514.7561999999998}]
[null,"E - TEMPO FIXO",null,"Código","Quantidade","Unidade",null,"Custo Unitário","Custo Unitário"]
[null,"-",0,"-",0,"t",null,0,null,{"$f":"ROUNDDOWN(E1256*H1256,4)","v":0}]
[null,"-",0,"-",0,"t",null,0,null,{"$f":"ROUNDDOWN(E1257*H1257,4)","v":0}]
[null,null,null,"Custo unitário total de tempo fixo",{"$nulls":5},{"$f":"SUM(J1256:J1257)","v":0}]
[null,"F - MOMENTO DE TRANSPORTE",null,"Quantidade","Unidade","DMT",null,null,null,"Custo Unitário"]
[{"$nulls":5},"LN","RP","P"]
[null,"-",0,0,"tkm"]
[null,"-",0,0,"tkm"]
[null,null,null,"Custo unitário total de transporte"]
[{"$nulls":5},"Custo unitário direto total",null,null,null,{"$f":"TRUNC(J1254+J1258,2)","v":2514.75}]
[null,"Obs."]
[]
[{"$f":"A1227+1","v":31},"1ª/GRD",{"$nulls":8},{"$f":"J1307","v":2281.5300000000002}]
[null,"OBRA:"," PAVIMENTAÇÃO ASFÁLTICA EM CBUQ - ESTRADA PARA SANTO ANTÔNIO DA BOA VISTA (SÃO JOÃO DA PONTE / MG)"]
[null,"Custo Unitário de Referência",null,null,"Minas Gerais"]
[{"$nulls":4}," Janeiro/2025",null,null,"Produção da equipe ",1,{"$f":"VLOOKUP(A1267,ORÇAMENTO!$A$10:$L$66,7,1)","v":"UNID."}]
[null,2003720,"CHAMINÉ PARA POÇOS DE VISITA - CPVI-04 - AREIA E BRITA COMERCIAIS",{"$nulls":5},"Valores em reais (R$)"]
[null,"A - EQUIPAMENTOS",null,"Quantidade","Utilização",null,"Custo Horário",null,null,"Custo"]
[{"$nulls":4},"Operativa","Improdutiva","Produtivo","Improdutivo",null,"Horário Total"]
[null,"-",0,null,null,null,0,0,null,{"$f":"D1274*(E1274*G1274+F1274*H1274)","v":0}]
[null,"-",0,null,null,null,0,0,null,{"$f":"D1275*(E1275*G1275+F1275*H1275)","v":0}]
[{"$nulls":7},"Custo horário total de equipamentos",null,{"$f":"SUM(J1274:J1275)","v":0}]
[null,"B - MÃO DE OBRA",null,"Quantidade","Unidade",null,"Custo Horário","Custo Horário Total"]
[null,"P9824","Servente",0.1,"h",null,21.435400000000001,null,null,{"$f":"D1278*G1278","v":2.1435400000000002}]
[null,"P9821","Pedreiro",0.1,"h",null,27.132200000000001,null,null,{"$f":"D1279*G1279","v":2.7132200000000002}]
[null,null,null,"Custo horário total de mão de obra",{"$nulls":5},{"$f":"SUM(J1278:J1279)","v":4.8567600000000004}]
[null,null,null,"Custo horário total de execução",{"$nulls":5},{"$f":"J1276+J1280","v":4.8567600000000004}]
[null,null,null,"Custo unitário de execução",{"$nulls":5},{"$f":"J1281/I1270","v":4.8567600000000004}]
[{"$nulls":7},"Custo do FIC",null,0]
[{"$nulls":7},"Custo do FIT",null,0]
[null,"C - MATERIAL",null,"Quantidade","Unidade",null,"Preço Unitário","Custo Unitário"]
[null,"M1432","Tampão de ferro fundido articulado para águas pluviais - DN 600 classe 400",1,"un",null,588.13480000000004,null,null,{"$f":"D1286*G1286","v":588.13480000000004},null,{"$f":"VLOOKUP(A$1267,ORÇAMENTO!A$11:L$66,8,FALSE)","v":2},{"$f":"J1286*L1286","v":1176.2696000000001}]
[null,"-",0,0,0,null,0,null,null,0,null,{"$f":"L1286","v":2},{"$f":"J1287*L1287","v":0}]
[null,null,null,"Custo unitário total de material",{"$nulls":5},{"$f":"SUM(J1286:J1287)","v":588.13480000000004}]
[null,"D - ATIVIDADES AUXILIARES",null,"Quantidade","Unidade",null,"Custo Unitário","Custo Unitário"]
[null,2009619,"Alvenaria de blocos de concreto 19 x 19 x 39 cm com espessura de 20 cm - areia comercial",8.84,"m²",null,120.63,null,null,{"$f":"D1290*G1290","v":1066.3691999999999},null,{"$f":"$L$1286","v":2},{"$f":"J1290*L1290","v":2132.7383999999997}]
[null,1109669,"Argamassa de cimento e areia 1:3 - confecção em betoneira e lançamento manual - areia comercial",0.14000000000000001,"m³",null,488.89,null,null,{"$f":"D1291*G1291","v":68.444600000000008},null,{"$f":"$L$1286","v":2},136.88920000000002]
[null,1109680,"Argamassa para reparos e grauteamento - confecção em misturador e lançamento manual",5.4039999999999998E-2,"m³",null,3648.73,null,null,197.17736919999999,null,2,394.35473839999997]
[null,407819,"Armação em aço CA-50 - fornecimento, preparo e colocação",5.4,"kg",null,12.47,null,null,67.338000000000008,null,2,134.67600000000002]
[null,1107892,"Concreto fck = 20 MPa - confecção em betoneira e lançamento manual - areia e brita comerciais",0.19,"m³",null,474.33,null,null,{"$f":"D1294*G1294","v":90.122699999999995},null,2,180.24539999999999]
[null,3103302,"Fôrmas de tábuas de pinho para dispositivos de drenagem - utilização de 3 vezes - confecção, instalação e retirada",2.59,"m²",null,75.569999999999993,null,null,{"$f":"D1295*G1295","v":195.72629999999998},null,2,391.45259999999996]
[null,null,null,"Custo total de atividades auxiliares",{"$nulls":5},{"$f":"SUM(J1290:J1295)","v":1685.1781691999997}]
[{"$nulls":7},"Subtotal",null,{"$f":"J1282+J1288+J1296+J1283+J1284","v":2278.1697291999999}]
[null,"E - TEMPO FIXO",null,"Código","Quantidade","Unidade",null,"Custo Unitário","Custo Unitário"]
[null,"M1432","Tampão de ferro fundido articulado para águas pluviais - DN 600 classe 400",5914655,0.104,"t",null,32.39,null,{"$f":"ROUNDDOWN(E1299*H1299,4)","v":3.3685}]
[null,"-",0,"-",null,"t",null,0,null,0]
[null,null,null,"Custo unitário total de tempo fixo",{"$nulls":5},{"$f":"SUM(J1299:J1300)","v":3.3685}]
[null,"F - MOMENTO DE TRANSPORTE",null,"Quantidade","Unidade","DMT",null,null,null,"Custo Unitário"]
[{"$nulls":5},"LN","RP","P"]
[null,"M1432","Tampão de ferro fundido articulado para águas pluviais - DN 600 classe 400",0.104,"tkm"]
[null,"-",0,0,"tkm"]
[null,null,null,"Custo unitário total de transporte"]
[{"$nulls":5},"Custo unitário direto total",null,null,null,{"$f":"TRUNC(J1297+J1301,2)","v":2281.5300000000002}]
[null,"Obs."]
[]
[{"$f":"A1267+1","v":32},"1ª/GRD",{"$nulls":8},{"$f":"J1346","v":6.85}]
[null,"OBRA:"," PAVIMENTAÇÃO ASFÁLTICA EM CBUQ - ESTRADA PARA SANTO ANTÔNIO DA BOA VISTA (SÃO JOÃO DA PONTE / MG)"]
[null,"Custo Unitário de Referência",null,null,"Minas Gerais"]
[{"$nulls":4}," Janeiro/2025",null,null,"Produção da equipe ",26,{"$f":"VLOOKUP(A1310,ORÇAMENTO!$A$10:$L$66,7,1)","v":"M3"}]
[null,4805757,"ESCAVAÇÃO MECÂNICA DE VALAS EM MATERIAL DE 1ª CATEGORIA",{"$nulls":5},"Valores em reais (R$)"]
[null,"A - EQUIPAMENTOS",null,"Quantidade","Utilização",null,"Custo Horário",null,null,"Custo"]
[{"$nulls":4},"Operativa","Improdutiva","Produtivo","Improdutivo",null,"Horário Total"]
[null,"E9526","Retroescavadeira de pneus - capacidade da caçamba da pá-carregadeira de 0,76 m³ e da retroescavadeira de 0,29 m³ - 58 kW ",1,1,0,153.29499999999999,77.820300000000003,null,{"$f":"D1317*(E1317*G1317+F1317*H1317)","v":153.29499999999999}]
[null,"-",0,0,0,0,0,0,null,{"$f":"D1318*(E1318*G1318+F1318*H1318)","v":0}]
[{"$nulls":7},"Custo horário total de equipamentos",null,{"$f":"SUM(J1317:J1318)","v":153.29499999999999}]
[null,"B - MÃO DE OBRA",null,"Quantidade","Unidade",null,"Custo Horário","Custo Horário Total"]
[null,"P9824","Servente",1,"h",null,21.435400000000001,null,null,{"$f":"D1321*G1321","v":21.435400000000001}]
[null,"-",0,0,0,null,0,null,null,{"$f":"D1322*G1322","v":0}]
[null,null,null,"Custo horário total de mão de obra",{"$nulls":5},{"$f":"SUM(J1321:J1322)","v":21.435400000000001}]
[null,null,null,"Custo horário total de execução",{"$nulls":5},{"$f":"J1319+J1323","v":174.73039999999997}]
[null,null,null,"Custo unitário de execução",{"$nulls":5},{"$f":"J1324/I1313","v":6.7203999999999988}]
[{"$nulls":7},"Custo do FIC",null,0.13750000000000001]
[{"$nulls":7},"Custo do FIT",null,0]
[null,"C - MATERIAL",null,"Quantidade","Unidade",null,"Preço Unitário","Custo Unitário"]
[null,"-",0,0,0,null,0,null,null,{"$f":"D1329*G1329","v":0},null,null,{"$f":"J1329*L1329","v":0}]
[null,"-",0,0,0,null,0,null,null,0,null,null,{"$f":"J1330*L1330","v":0}]
[null,null,null,"Custo unitário total de material",{"$nulls":5},{"$f":"SUM(J1329:J1330)","v":0}]
[null,"D - ATIVIDADES AUXILIARES",null,"Quantidade","Unidade",null,"Custo Unitário","Custo Unitário"]
[null,"-",0,0,0,null,0,null,null,{"$f":"D1333*G1333","v":0}]
[null,"-",0,0,0,null,0,null,null,{"$f":"D1334*G1334","v":0}]
[null,null,null,"Custo total de atividades auxiliares",{"$nulls":5},{"$f":"SUM(J1333:J1334)","v":0}]
[{"$nulls":7},"Subtotal",null,{"$f":"J1325+J1331+J1335+J1326+J1327","v":6.857899999999999}]
[null,"E - TEMPO FIXO",null,"Código","Quantidade","Unidade",null,"Custo Unitário","Custo Unitário"]
[null,"-",0,"-",0,"t",null,0,null,{"$f":"ROUNDDOWN(E1338*H1338,4)","v":0}]
[null,"-",0,"-",0,"t",null,0,null,{"$f":"ROUNDDOWN(E1339*H1339,4)","v":0}]
[null,null,null,"Custo unitário total de tempo fixo",{"$nulls":5},{"$f":"SUM(J1338:J1339)","v":0}]
[null,"F - MOMENTO DE TRANSPORTE",null,"Quantidade","Unidade","DMT",null,null,null,"Custo Unitário"]
[{"$nulls":5},"LN","RP","P"]
[null,"-",0,0,"tkm"]
[null,"-",0,0,"tkm"]
[null,null,null,"Custo unitário total de transporte"]
[{"$nulls":5},"Custo unitário direto total",null,null,null,{"$f":"TRUNC(J1336+J1340,2)","v":6.85}]
[null,"Obs."]
[]
[{"$f":"A1310+1","v":33},"1ª/GRD",{"$nulls":8},{"$f":"J1385","v":4.82}]
[null,"OBRA:"," PAVIMENTAÇÃO ASFÁLTICA EM CBUQ - ESTRADA PARA SANTO ANTÔNIO DA BOA VISTA (SÃO JOÃO DA PONTE / MG)"]
[null,"Custo Unitário de Referência",null,null,"Minas Gerais"]
[{"$nulls":4}," Janeiro/2025",null,null,"Produção da equipe ",4.4444400000000002,{"$f":"VLOOKUP(A1349,ORÇAMENTO!$A$10:$L$66,7,1)","v":"M2"}]
[null,4805756,"APILOAMENTO MANUAL DE FUNDO DE VALA",{"$nulls":5},"Valores em reais (R$)"]
[null,"A - EQUIPAMENTOS",null,"Quantidade","Utilização",null,"Custo Horário",null,null,"Custo"]
[{"$nulls":4},"Operativa","Improdutiva","Produtivo","Improdutivo",null,"Horário Total"]
[null,"-",0,null,null,null,0,0,null,{"$f":"D1356*(E1356*G1356+F1356*H1356)","v":0}]
[null,"-",0,null,null,null,0,0,null,{"$f":"D1357*(E1357*G1357+F1357*H1357)","v":0}]
[{"$nulls":7},"Custo horário total de equipamentos",null,{"$f":"SUM(J1356:J1357)","v":0}]
[null,"B - MÃO DE OBRA",null,"Quantidade","Unidade",null,"Custo Horário","Custo Horário Total"]
[null,"P9824","Servente",1,"h",null,21.435400000000001,null,null,{"$f":"D1360*G1360","v":21.435400000000001}]
[null,"-",0,null,0,null,0,null,null,{"$f":"D1361*G1361","v":0}]
[null,null,null,"Custo horário total de mão de obra",{"$nulls":5},{"$f":"SUM(J1360:J1361)","v":21.435400000000001}]
[null,null,null,"Custo horário total de execução",{"$nulls":5},{"$f":"J1358+J1362","v":21.435400000000001}]
[null,null,null,"Custo unitário de execução",{"$nulls":5},{"$f":"J1363/I1352","v":4.8229698229698235}]
[{"$nulls":7},"Custo do FIC",null,0]
[{"$nulls":7},"Custo do FIT",null,0]
[null,"C - MATERIAL",null,"Quantidade","Unidade",null,"Preço Unitário","Custo Unitário"]
[null,"-",0,0,0,null,0,null,null,{"$f":"D1368*G1368","v":0},null,null,{"$f":"J1368*L1368","v":0}]
[null,"-",0,0,0,null,0,null,null,0,null,null,{"$f":"J1369*L1369","v":0}]
[null,null,null,"Custo unitário total de material",{"$nulls":5},{"$f":"SUM(J1368:J1369)","v":0}]
[null,"D - ATIVIDADES AUXILIARES",null,"Quantidade","Unidade",null,"Custo Unitário","Custo Unitário"]
[null,"-",0,0,0,null,0,null,null,{"$f":"D1372*G1372","v":0}]
[null,"-",0,0,0,null,0,null,null,{"$f":"D1373*G1373","v":0}]
[null,null,null,"Custo total de atividades auxiliares",{"$nulls":5},{"$f":"SUM(J1372:J1373)","v":0}]
[{"$nulls":7},"Subtotal",null,{"$f":"J1364+J1370+J1374","v":4.8229698229698235}]
[null,"E - TEMPO FIXO",null,"Código","Quantidade","Unidade",null,"Custo Unitário","Custo Unitário"]
[null,"-",0,"-",0,"t",null,0,null,{"$f":"ROUNDDOWN(E1377*H1377,4)","v":0}]
[null,"-",0,"-",0,"t",null,0,null,{"$f":"ROUNDDOWN(E1378*H1378,4)","v":0}]
[null,null,null,"Custo unitário total de tempo fixo",{"$nulls":5},{"$f":"SUM(J1377:J1378)","v":0}]
[null,"F - MOMENTO DE TRANSPORTE",null,"Quantidade","Unidade","DMT",null,null,null,"Custo Unitário"]
[{"$nulls":5},"LN","RP","P"]
[null,"-",0,0,"tkm"]
[null,"-",0,0,"tkm"]
[null,null,null,"Custo unitário total de transporte"]
[{"$nulls":5},"Custo unitário direto total",null,null,null,{"$f":"TRUNC(J1375+J1379,2)","v":4.82}]
[null,"Obs."]
[]
[{"$f":"A1349+1","v":34},"1ª/GRD",{"$nulls":8},{"$f":"J1427","v":111.57},"ajustada"]
[null,"OBRA:"," PAVIMENTAÇÃO ASFÁLTICA EM CBUQ - ESTRADA PARA SANTO ANTÔNIO DA BOA VISTA (SÃO JOÃO DA PONTE / MG)"]
[null,"Custo Unitário de Referência",null,null,"Minas Gerais"]
[{"$nulls":4}," Janeiro/2025",null,null,"Produção da equipe ",1,{"$f":"VLOOKUP(A1388,ORÇAMENTO!$A$10:$L$66,7,1)","v":"M2"}]
[null,2106292,"ESCORAMENTO CONTÍNUO DE VALAS COM TÁBUAS E LONGARINAS, PROFUNDIDADE ATÉ 4,0M - CONFECÇÃO, INSTALAÇÃO E RETIRADA",{"$nulls":5},"Valores em reais (R$)"]
[null,"A - EQUIPAMENTOS",null,"Quantidade","Utilização",null,"Custo Horário",null,null,"Custo"]
[{"$nulls":4},"Operativa","Improdutiva","Produtivo","Improdutivo",null,"Horário Total"]
[null,"-",0,null,null,null,0,0,null,{"$f":"D1395*(E1395*G1395+F1395*H1395)","v":0}]
[null,"-",0,null,null,null,0,0,null,{"$f":"D1396*(E1396*G1396+F1396*H1396)","v":0}]
[{"$nulls":7},"Custo horário total de equipamentos",null,{"$f":"SUM(J1395:J1396)","v":0}]
[null,"B - MÃO DE OBRA",null,"Quantidade","Unidade",null,"Custo Horário","Custo Horário Total"]
[null,"P9801","Ajudante",2,"h",null,23.351299999999998,null,null,{"$f":"D1399*G1399","v":46.702599999999997}]
[null,"P9808","Carpinteiro",1,"h",null,26.881399999999999,null,null,{"$f":"D1400*G1400","v":26.881399999999999}]
[null,null,null,"Custo horário total de mão de obra",{"$nulls":5},{"$f":"SUM(J1399:J1400)","v":73.584000000000003}]
[null,null,null,"Custo horário total de execução",{"$nulls":5},{"$f":"J1397+J1401","v":73.584000000000003}]
[null,null,null,"Custo unitário de execução",{"$nulls":5},{"$f":"J1402/I1391","v":73.584000000000003}]
[{"$nulls":7},"Custo do FIC",null,0]
[{"$nulls":7},"Custo do FIT",null,0]
[null,"C - MATERIAL",null,"Quantidade","Unidade",null,"Preço Unitário","Custo Unitário"]
[null,"M1811","Longarina de madeira de primeira - L = 16 cm e E = 6 cm",0.40425,"m",null,43.832000000000001,null,null,{"$f":"D1407*G1407","v":17.719086000000001},null,{"$f":"VLOOKUP(A$1388,ORÇAMENTO!A$11:L$66,8,FALSE)","v":900},{"$f":"J1407*L1407","v":15947.1774}]
[null,"M1205","Prego de ferro",8.6209999999999995E-2,"kg",null,16.771799999999999,null,null,{"$f":"D1408*G1408","v":1.4458968779999999},null,{"$f":"L1407","v":900},{"$f":"J1408*L1408","v":1301.3071901999999}]
[null,"M0286","Tábua - E = 2,5 cm e L = 30 cm",1.1594,"m",null,15.813599999999999,null,null,18.334287839999998,null,{"$f":"L1408","v":900},16500.859055999998]
[null,null,null,"Custo unitário total de material",{"$nulls":5},{"$f":"SUM(J1407:J1409)","v":37.499270717999998}]
[null,"D - ATIVIDADES AUXILIARES",null,"Quantidade","Unidade",null,"Custo Unitário","Custo Unitário"]
[null,"-",0,0,0,null,0,null,null,{"$f":"D1412*G1412","v":0}]
[null,"-",0,0,0,null,0,null,null,{"$f":"D1413*G1413","v":0}]
[null,null,null,"Custo total de atividades auxiliares",{"$nulls":5},{"$f":"SUM(J1412:J1413)","v":0}]
[{"$nulls":7},"Subtotal",null,{"$f":"J1403+J1410+J1414+J1404+J1405","v":111.08327071799999}]
[null,"E - TEMPO FIXO",null,"Código","Quantidade","Unidade",null,"Custo Unitário","Custo Unitário"]
[null,"M1811","Longarina de madeira de primeira - L = 16 cm e E = 6 cm",5914655,3.8800000000000002E-3,"t",null,32.39,null,{"$f":"ROUNDDOWN(E1417*H1417,4)","v":0.12559999999999999}]
[null,"M1205","Prego de ferro",5914655,9.0000000000000006E-5,"t",null,32.39,null,2.8999999999999998E-3]
[null,"M0286","Tábua - E = 2,5 cm e L = 30 cm",5914655,1.137E-2,"t",null,32.39,null,0.36820000000000003]
[null,null,null,"Custo unitário total de tempo fixo",{"$nulls":5},{"$f":"SUM(J1417:J1419)","v":0.49670000000000003}]
[null,"F - MOMENTO DE TRANSPORTE",null,"Quantidade","Unidade","DMT",null,null,null,"Custo Unitário"]
[{"$nulls":5},"LN","RP","P"]
[null,"M1811","Longarina de madeira de primeira - L = 16 cm e E = 6 cm",3.8800000000000002E-3,"tkm"]
[null,"M1205","Prego de ferro",9.0000000000000006E-5,"tkm"]
[null,"M0286","Tábua - E = 2,5 cm e L = 30 cm",1.137E-2,"tkm"]
[null,null,null,"Custo unitário total de transporte"]
[{"$nulls":5},"Custo unitário direto total",null,null,null,{"$f":"TRUNC(J1415+J1420,2)","v":111.57}]
[null,"Obs."]
[]
[{"$f":"A1388+1","v":35},"1ª/GRD",{"$nulls":8},{"$f":"J1466","v":16.86}]
[null,"OBRA:"," PAVIMENTAÇÃO ASFÁLTICA EM CBUQ - ESTRADA PARA SANTO ANTÔNIO DA BOA VISTA (SÃO JOÃO DA PONTE / MG)"]
[null,"Custo Unitário de Referência",null,null,"Minas Gerais"]
[{"$nulls":4}," Janeiro/2025",null,null,"Produção da equipe ",3.1124999999999998,{"$f":"VLOOKUP(A1430,ORÇAMENTO!$A$10:$L$66,7,1)","v":"M3"}]
[null,4815671,"REATERRO E COMPACTAÇÃO MANUAL DE VALAS COM SOQUETE VIBRATÓRIO",{"$nulls":5},"Valores em reais (R$)"]
[null,"A - EQUIPAMENTOS",null,"Quantidade","Utilização",null,"Custo Horário",null,null,"Custo"]
[{"$nulls":4},"Operativa","Improdutiva","Produtivo","Improdutivo",null,"Horário Total"]
[null,"E9647","Compactador manual com soquete vibratório - 4,10 kW",1,1,0,9.6329999999999991,1.0471999999999999,null,{"$f":"D1437*(E1437*G1437+F1437*H1437)","v":9.6329999999999991}]
[null,"-",0,0,0,0,0,0,null,{"$f":"D1438*(E1438*G1438+F1438*H1438)","v":0}]
[{"$nulls":7},"Custo horário total de equipamentos",null,{"$f":"SUM(J1437:J1438)","v":9.6329999999999991}]
[null,"B - MÃO DE OBRA",null,"Quantidade","Unidade",null,"Custo Horário","Custo Horário Total"]
[null,"P9824","Servente",2,"h",null,21.435400000000001,null,null,{"$f":"D1441*G1441","v":42.870800000000003}]
[null,"-",0,0,0,null,0,null,null,{"$f":"D1442*G1442","v":0}]
[null,null,null,"Custo horário total de mão de obra",{"$nulls":5},{"$f":"SUM(J1441:J1442)","v":42.870800000000003}]
[null,null,null,"Custo horário total de execução",{"$nulls":5},{"$f":"J1439+J1443","v":52.503799999999998}]
[null,null,null,"Custo unitário de execução",{"$nulls":5},{"$f":"J1444/I1433","v":16.868690763052211}]
[{"$nulls":7},"Custo do FIC",null,0]
[{"$nulls":7},"Custo do FIT",null,0]
[null,"C - MATERIAL",null,"Quantidade","Unidade",null,"Preço Unitário","Custo Unitário"]
[null,"-",0,0,0,null,0,null,null,{"$f":"D1449*G1449","v":0},null,null,{"$f":"J1449*L1449","v":0}]
[null,"-",0,0,0,null,0,null,null,0,null,null,{"$f":"J1450*L1450","v":0}]
[null,null,null,"Custo unitário total de material",{"$nulls":5},{"$f":"SUM(J1449:J1450)","v":0}]
[null,"D - ATIVIDADES AUXILIARES",null,"Quantidade","Unidade",null,"Custo Unitário","Custo Unitário"]
[null,"-",0,0,0,null,0,null,null,{"$f":"D1453*G1453","v":0}]
[null,"-",0,0,0,null,0,null,null,{"$f":"D1454*G1454","v":0}]
[null,null,null,"Custo total de atividades auxiliares",{"$nulls":5},{"$f":"SUM(J1453:J1454)","v":0}]
[{"$nulls":7},"Subtotal",null,{"$f":"J1445+J1451+J1455+J1446+J1447","v":16.868690763052211}]
[null,"E - TEMPO FIXO",null,"Código","Quantidade","Unidade",null,"Custo Unitário","Custo Unitário"]
[null,"-",0,"-",0,"t",null,0,null,{"$f":"ROUNDDOWN(E1458*H1458,4)","v":0}]
[null,"-",0,"-",0,"t",null,0,null,{"$f":"ROUNDDOWN(E1459*H1459,4)","v":0}]
[null,null,null,"Custo unitário total de tempo fixo",{"$nulls":5},{"$f":"SUM(J1458:J1459)","v":0}]
[null,"F - MOMENTO DE TRANSPORTE",null,"Quantidade","Unidade","DMT",null,null,null,"Custo Unitário"]
[{"$nulls":5},"LN","RP","P"]
[null,"-",0,0,"tkm"]
[null,"-",0,0,"tkm"]
[null,null,null,"Custo unitário total de transporte"]
[{"$nulls":5},"Custo unitário direto total",null,null,null,{"$f":"TRUNC(J1456+J1460,2)","v":16.86}]
[null,"Obs."]
[]
[{"$f":"A1430+1","v":36},"1ª/GRD",{"$nulls":8},{"$f":"J1509","v":757.11},843.93]
[null,"OBRA:"," PAVIMENTAÇÃO ASFÁLTICA EM CBUQ - ESTRADA PARA SANTO ANTÔNIO DA BOA VISTA (SÃO JOÃO DA PONTE / MG)"]
[null,"Custo Unitário de Referência",null,null,"Minas Gerais"]
[{"$nulls":4}," Janeiro/2025",null,null,"Produção da equipe ",1,{"$f":"VLOOKUP(A1469,ORÇAMENTO!$A$10:$L$66,7,1)","v":"M3"}]
[null,94990,"EXECUÇÃO DE PASSEIO (CALÇADA) OU PISO DE CONCRETO MOLDADO IN LOCO, ACABAMENTO CONVENCIONAL, NÃO ARMADO",{"$nulls":5},"Valores em reais (R$)"]
[null,"A - EQUIPAMENTOS",null,"Quantidade","Utilização",null,"Custo Horário",null,null,"Custo"]
[{"$nulls":4},"Operativa","Improdutiva","Produtivo","Improdutivo",null,"Horário Total"]
[null,"-",0,null,null,null,0,0,null,{"$f":"D1476*(E1476*G1476+F1476*H1476)","v":0}]
[null,"-",0,null,null,null,0,0,null,{"$f":"D1477*(E1477*G1477+F1477*H1477)","v":0}]
[{"$nulls":7},"Custo horário total de equipamentos",null,{"$f":"SUM(J1476:J1477)","v":0}]
[null,"B - MÃO DE OBRA",null,"Quantidade","Unidade",null,"Custo Horário","Custo Horário Total"]
[null,"P9808","Carpinteiro",1.6268,"h",null,26.881399999999999,null,null,{"$f":"D1480*G1480","v":43.730661519999998}]
[null,"P9821","Pedreiro",1.4149,"h",null,27.132200000000001,null,null,{"$f":"D1481*G1481","v":38.389349780000003}]
[null,"P9824","Servente",3.0417000000000001,"h",null,21.435400000000001,null,null,65.200056180000004]
[null,null,null,"Custo horário total de mão de obra",{"$nulls":5},{"$f":"SUM(J1480:J1482)","v":147.32006748000001}]
[null,null,null,"Custo horário total de execução",{"$nulls":5},{"$f":"J1478+J1483","v":147.32006748000001}]
[null,null,null,"Custo unitário de execução",{"$nulls":5},{"$f":"J1484/I1472","v":147.32006748000001}]
[{"$nulls":7},"Custo do FIC",null,0]
[{"$nulls":7},"Custo do FIT",null,0]
[null,"C - MATERIAL",null,"Quantidade","Unidade",null,"Preço Unitário","Custo Unitário"]
[null,"M1358","Sarrafo em madeira de terceira - E = 2,5 cm e L = 5 cm",10,"m",null,2.0291000000000001,null,null,{"$f":"D1489*G1489","v":20.291},null,{"$f":"VLOOKUP(A$1469,ORÇAMENTO!A$11:L$66,8,FALSE)","v":5},{"$f":"J1489*L1489","v":101.455}]
[null,"M1205","Prego de ferro",0.2994,"kg",null,16.771799999999999,null,null,{"$f":"D1490*G1490","v":5.0214769199999996},null,{"$f":"L1489","v":5},{"$f":"J1490*L1490","v":25.107384599999996}]
[null,"M3949","Desmoldante para fôrmas metálicas",2.1299999999999999E-2,"l",null,16.418800000000001,null,null,0.34972044000000002,null,{"$f":"L1490","v":5},1.7486022000000001]
[null,"M0451","Concreto usinado - fck = 20 MPa (comercial)",1.2315,"m³",null,474.33,null,null,584.13739499999997,null,5,2920.6869749999996]
[null,"-",0,null,0,null,0,null,null,0,null,null,{"$f":"J1493*L1493","v":0}]
[null,null,null,"Custo unitário total de material",{"$nulls":5},{"$f":"SUM(J1489:J1493)","v":609.79959236000002}]
[null,"D - ATIVIDADES AUXILIARES",null,"Quantidade","Unidade",null,"Custo Unitário","Custo Unitário"]
[null,"-",0,null,0,null,0,null,null,{"$f":"D1496*G1496","v":0}]
[null,"-",0,null,0,null,0,null,null,{"$f":"D1497*G1497","v":0}]
[null,null,null,"Custo total de atividades auxiliares",{"$nulls":5},{"$f":"SUM(J1496:J1497)","v":0}]
[{"$nulls":7},"Subtotal",null,{"$f":"J1485+J1494+J1498+J1486+J1487","v":757.11965984000005}]
[null,"E - TEMPO FIXO",null,"Código","Quantidade","Unidade",null,"Custo Unitário","Custo Unitário"]
[null,"-",0,"-",null,"t",null,0,null,{"$f":"ROUNDDOWN(E1501*H1501,4)","v":0}]
[null,"-",0,"-",null,"t",null,0,null,{"$f":"ROUNDDOWN(E1502*H1502,4)","v":0}]
[null,null,null,"Custo unitário total de tempo fixo",{"$nulls":5},{"$f":"SUM(J1501:J1502)","v":0}]
[null,"F - MOMENTO DE TRANSPORTE",null,"Quantidade","Unidade","DMT",null,null,null,"Custo Unitário"]
[{"$nulls":5},"LN","RP","P"]
[null,"-",0,null,"tkm"]
[null,"-",0,null,"tkm"]
[null,null,null,"Custo unitário total de transporte"]
[{"$nulls":5},"Custo unitário direto total",null,null,null,{"$f":"TRUNC(J1499+J1503,2)","v":757.11}]
[null,"Obs."]
[]
[{"$f":"A1469+1","v":37},"1ª/GRD",{"$nulls":8},{"$f":"J1548","v":913.45}]
[null,"OBRA:"," PAVIMENTAÇÃO ASFÁLTICA EM CBUQ - ESTRADA PARA SANTO ANTÔNIO DA BOA VISTA (SÃO JOÃO DA PONTE / MG)"]
[null,"Custo Unitário de Referência",null,null,"Minas Gerais"]
[{"$nulls":4}," Janeiro/2025",null,null,"Produção da equipe ",2,{"$f":"VLOOKUP(A1512,ORÇAMENTO!$A$10:$L$66,7,1)","v":"UN."}]
[null,5213489,"PLACA EM AÇO - 2,00X1,00M - PELÍCULA RETRORREFLETIVA - FORNECIMENTO E INSTALAÇÃO, INCLUSIVE  SUPORTE",{"$nulls":5},"Valores em reais (R$)"]
[null,"A - EQUIPAMENTOS",null,"Quantidade","Utilização",null,"Custo Horário",null,null,"Custo"]
[{"$nulls":4},"Operativa","Improdutiva","Produtivo","Improdutivo",null,"Horário Total"]
[null,"E9687","Caminhão carroceria com capacidade de 5 t - 120 kW",1,0.3,0.7,154.82689999999999,59.719900000000003,null,{"$f":"D1519*(E1519*G1519+F1519*H1519)","v":88.251999999999995}]
[null,"-",0,null,null,null,0,0,null,{"$f":"D1520*(E1520*G1520+F1520*H1520)","v":0}]
[{"$nulls":7},"Custo horário total de equipamentos",null,{"$f":"SUM(J1519:J1520)","v":88.251999999999995}]
[null,"B - MÃO DE OBRA",null,"Quantidade","Unidade",null,"Custo Horário","Custo Horário Total"]
[null,"P9830","Montador",1,"h",null,38.260300000000001,null,null,{"$f":"D1523*G1523","v":38.260300000000001}]
[null,"P9824","Servente",2,"h",null,21.435400000000001,null,null,{"$f":"D1524*G1524","v":42.870800000000003}]
[null,null,null,"Custo horário total de mão de obra",{"$nulls":5},{"$f":"SUM(J1523:J1524)","v":81.131100000000004}]
[null,null,null,"Custo horário total de execução",{"$nulls":5},{"$f":"J1521+J1525","v":169.38310000000001}]
[null,null,null,"Custo unitário de execução",{"$nulls":5},{"$f":"J1526/I1515","v":84.691550000000007}]
[{"$nulls":7},"Custo do FIC",null,0]
[{"$nulls":7},"Custo do FIT",null,0]
[null,"C - MATERIAL",null,"Quantidade","Unidade",null,"Preço Unitário","Custo Unitário"]
[null,"-",0,0,0,null,0,null,null,{"$f":"D1531*G1531","v":0},null,null,{"$f":"J1531*L1531","v":0}]
[null,"-",0,0,0,null,0,null,null,0,null,null,{"$f":"J1532*L1532","v":0}]
[null,null,null,"Custo unitário total de material",{"$nulls":5},{"$f":"SUM(J1531:J1532)","v":0}]
[null,"D - ATIVIDADES AUXILIARES",null,"Quantidade","Unidade",null,"Custo Unitário","Custo Unitário"]
[null,5213416,"Placa em aço nº 16 galvanizado com película retrorrefletiva tipo I + I - confecção",2,"m²",null,414.38,null,null,{"$f":"D1535*G1535","v":828.76},null,{"$f":"VLOOKUP(A$1512,ORÇAMENTO!A$11:L$66,8,FALSE)","v":2},{"$f":"J1535*L1535","v":1657.52}]
[null,"-",0,0,0,null,0,null,null,{"$f":"D1536*G1536","v":0},null,{"$f":"L1535","v":2},0]
[null,null,null,"Custo total de atividades auxiliares",{"$nulls":5},{"$f":"SUM(J1535:J1536)","v":828.76}]
[{"$nulls":7},"Subtotal",null,{"$f":"J1527+J1533+J1537+J1528+J1529","v":913.45155}]
[null,"E - TEMPO FIXO",null,"Código","Quantidade","Unidade",null,"Custo Unitário","Custo Unitário"]
[null,"-",0,"-",0,"t",null,0,null,{"$f":"ROUNDDOWN(E1540*H1540,4)","v":0}]
[null,"-",0,"-",0,"t",null,0,null,{"$f":"ROUNDDOWN(E1541*H1541,4)","v":0}]
[null,null,null,"Custo unitário total de tempo fixo",{"$nulls":5},{"$f":"SUM(J1540:J1541)","v":0}]
[null,"F - MOMENTO DE TRANSPORTE",null,"Quantidade","Unidade","DMT",null,null,null,"Custo Unitário"]
[{"$nulls":5},"LN","RP","P"]
[null,"-",0,0,"tkm"]
[null,"-",0,0,"tkm"]
[null,null,null,"Custo unitário total de transporte"]
[{"$nulls":5},"Custo unitário direto total",null,null,null,{"$f":"TRUNC(J1538+J1542,2)","v":913.45}]
[null,"Obs."]
[]
[{"$f":"A1512+1","v":38},"1ª/GRD",{"$nulls":8},{"$f":"J1587","v":271.91000000000003}]
[null,"OBRA:"," PAVIMENTAÇÃO ASFÁLTICA EM CBUQ - ESTRADA PARA SANTO ANTÔNIO DA BOA VISTA (SÃO JOÃO DA PONTE / MG)"]
[null,"Custo Unitário de Referência",null,null,"Minas Gerais"]
[{"$nulls":4}," Janeiro/2025",null,null,"Produção da equipe ",3,{"$f":"VLOOKUP(A1551,ORÇAMENTO!$A$10:$L$66,7,1)","v":"UN."}]
[null,5213464,"PLACA DE ADVERTÊNCIA EM AÇO, LADO DE 60CM - PELÍCULA RETRORREFLETIVA - FORNECIMENTO E INSTALAÇÃO, INCLUSIVE  SUPORTE",{"$nulls":5},"Valores em reais (R$)"]
[null,"A - EQUIPAMENTOS",null,"Quantidade","Utilização",null,"Custo Horário",null,null,"Custo"]
[{"$nulls":4},"Operativa","Improdutiva","Produtivo","Improdutivo",null,"Horário Total"]
[null,"E9687","Caminhão carroceria com capacidade de 5 t - 120 kW",1,0.3,0.7,154.82689999999999,59.719900000000003,null,{"$f":"D1558*(E1558*G1558+F1558*H1558)","v":88.251999999999995}]
[null,"-",0,null,null,null,0,0,null,{"$f":"D1559*(E1559*G1559+F1559*H1559)","v":0}]
[{"$nulls":7},"Custo horário total de equipamentos",null,{"$f":"SUM(J1558:J1559)","v":88.251999999999995}]
[null,"B - MÃO DE OBRA",null,"Quantidade","Unidade",null,"Custo Horário","Custo Horário Total"]
[null,"P9830","Montador",1,"h",null,38.260300000000001,null,null,{"$f":"D1562*G1562","v":38.260300000000001}]
[null,"P9824","Servente",2,"h",null,21.435400000000001,null,null,{"$f":"D1563*G1563","v":42.870800000000003}]
[null,null,null,"Custo horário total de mão de obra",{"$nulls":5},{"$f":"SUM(J1562:J1563)","v":81.131100000000004}]
[null,null,null,"Custo horário total de execução",{"$nulls":5},{"$f":"J1560+J1564","v":169.38310000000001}]
[null,null,null,"Custo unitário de execução",{"$nulls":5},{"$f":"J1565/I1554","v":56.46103333333334}]
[{"$nulls":7},"Custo do FIC",null,0]
[{"$nulls":7},"Custo do FIT",null,0]
[null,"C - MATERIAL",null,"Quantidade","Unidade",null,"Preço Unitário","Custo Unitário"]
[null,"-",0,null,0,null,0,null,null,{"$f":"D1570*G1570","v":0},null,null,{"$f":"J1570*L1570","v":0}]
[null,"-",0,null,0,null,0,null,null,0,null,null,{"$f":"J1571*L1571","v":0}]
[null,null,null,"Custo unitário total de material",{"$nulls":5},{"$f":"SUM(J1570:J1571)","v":0}]
[null,"D - ATIVIDADES AUXILIARES",null,"Quantidade","Unidade",null,"Custo Unitário","Custo Unitário"]
[null,5213414,"Placa em aço nº 16 galvanizado com película retrorrefletiva tipo I + SI - confecção",0.36,"m²",null,598.48,null,null,{"$f":"D1574*G1574","v":215.4528},null,{"$f":"VLOOKUP(A$1551,ORÇAMENTO!A$11:L$66,8,FALSE)","v":12},{"$f":"J1574*L1574","v":2585.4335999999998}]
[null,"-",0,null,0,null,0,null,null,{"$f":"D1575*G1575","v":0},null,null,0]
[null,null,null,"Custo total de atividades auxiliares",{"$nulls":5},{"$f":"SUM(J1574:J1575)","v":215.4528}]
[{"$nulls":7},"Subtotal",null,{"$f":"J1566+J1572+J1576+J1567+J1568","v":271.91383333333334}]
[null,"E - TEMPO FIXO",null,"Código","Quantidade","Unidade",null,"Custo Unitário","Custo Unitário"]
[null,"-",0,"-",null,"t",null,0,null,{"$f":"ROUNDDOWN(E1579*H1579,4)","v":0}]
[null,"-",0,"-",null,"t",null,0,null,{"$f":"ROUNDDOWN(E1580*H1580,4)","v":0}]
[null,null,null,"Custo unitário total de tempo fixo",{"$nulls":5},{"$f":"SUM(J1579:J1580)","v":0}]
[null,"F - MOMENTO DE TRANSPORTE",null,"Quantidade","Unidade","DMT",null,null,null,"Custo Unitário"]
[{"$nulls":5},"LN","RP","P"]
[null,"-",0,null,"tkm"]
[null,"-",0,null,"tkm"]
[null,null,null,"Custo unitário total de transporte"]
[{"$nulls":5},"Custo unitário direto total",null,null,null,{"$f":"TRUNC(J1577+J1581,2)","v":271.91000000000003}]
[null,"Obs."]
[]
[{"$f":"A1551+1","v":39},"1ª/GRD",{"$nulls":8},{"$f":"J1626","v":271.87}]
[null,"OBRA:"," PAVIMENTAÇÃO ASFÁLTICA EM CBUQ - ESTRADA PARA SANTO ANTÔNIO DA BOA VISTA (SÃO JOÃO DA PONTE / MG)"]
[null,"Custo Unitário de Referência",null,null,"Minas Gerais"]
[{"$nulls":4}," Janeiro/2025",null,null,"Produção da equipe ",3,{"$f":"VLOOKUP(A1590,ORÇAMENTO!$A$10:$L$66,7,1)","v":"UN."}]
[null,5213440,"PLACA DE REGULAMENTAÇÃO EM AÇO, D=60CM - PELÍCULA RETRORREFLETIVA - FORNECIMENTO E INSTALAÇÃO, INCLUSIVE  SUPORTE",{"$nulls":5},"Valores em reais (R$)"]
[null,"A - EQUIPAMENTOS",null,"Quantidade","Utilização",null,"Custo Horário",null,null,"Custo"]
[{"$nulls":4},"Operativa","Improdutiva","Produtivo","Improdutivo",null,"Horário Total"]
[null,"E9687","Caminhão carroceria com capacidade de 5 t - 120 kW",1,0.3,0.7,154.82689999999999,59.719900000000003,null,{"$f":"D1597*(E1597*G1597+F1597*H1597)","v":88.251999999999995}]
[null,"-",0,null,null,null,0,0,null,{"$f":"D1598*(E1598*G1598+F1598*H1598)","v":0}]
[{"$nulls":7},"Custo horário total de equipamentos",null,{"$f":"SUM(J1597:J1598)","v":88.251999999999995}]
[null,"B - MÃO DE OBRA",null,"Quantidade","Unidade",null,"Custo Horário","Custo Horário Total"]
[null,"P9830","Montador",1,"h",null,38.260300000000001,null,null,{"$f":"D1601*G1601","v":38.260300000000001}]
[null,"P9824","Servente",2,"h",null,21.435400000000001,null,null,{"$f":"D1602*G1602","v":42.870800000000003}]
[null,null,null,"Custo horário total de mão de obra",{"$nulls":5},{"$f":"SUM(J1601:J1602)","v":81.131100000000004}]
[null,null,null,"Custo horário total de execução",{"$nulls":5},{"$f":"J1599+J1603","v":169.38310000000001}]
[null,null,null,"Custo unitário de execução",{"$nulls":5},{"$f":"J1604/I1593","v":56.46103333333334}]
[{"$nulls":7},"Custo do FIC",null,0]
[{"$nulls":7},"Custo do FIT",null,0]
[null,"C - MATERIAL",null,"Quantidade","Unidade",null,"Preço Unitário","Custo Unitário"]
[null,"-",0,null,0,null,0,null,null,{"$f":"D1609*G1609","v":0},null,null,{"$f":"J1609*L1609","v":0}]
[null,"-",0,null,0,null,0,null,null,{"$f":"D1610*G1610","v":0},null,null,{"$f":"J1610*L1610","v":0}]
[null,null,null,"Custo unitário total de material",{"$nulls":5},{"$f":"SUM(J1609:J1610)","v":0}]
[null,"D - ATIVIDADES AUXILIARES",null,"Quantidade","Unidade",null,"Custo Unitário","Custo Unitário"]
[null,5213414,"Placa em aço nº 16 galvanizado com película retrorrefletiva tipo I + SI - confecção",0.35993999999999998,"m²",null,598.48,null,null,{"$f":"D1613*G1613","v":215.41689120000001},null,{"$f":"VLOOKUP(A$1590,ORÇAMENTO!A$11:L$66,8,FALSE)","v":6},{"$f":"J1613*L1613","v":1292.5013472000001}]
[null,"-",0,null,0,null,0,null,null,{"$f":"D1614*G1614","v":0},null,null,0]
[null,null,null,"Custo total de atividades auxiliares",{"$nulls":5},{"$f":"SUM(J1613:J1614)","v":215.41689120000001}]
[{"$nulls":7},"Subtotal",null,{"$f":"J1605+J1611+J1615+J1606+J1607","v":271.87792453333333}]
[null,"E - TEMPO FIXO",null,"Código","Quantidade","Unidade",null,"Custo Unitário","Custo Unitário"]
[null,"-",0,"-",null,"t",null,0,null,{"$f":"ROUNDDOWN(E1618*H1618,4)","v":0}]
[null,"-",0,"-",null,"t",null,0,null,{"$f":"ROUNDDOWN(E1619*H1619,4)","v":0}]
[null,null,null,"Custo unitário total de tempo fixo",{"$nulls":5},{"$f":"SUM(J1618:J1619)","v":0}]
[null,"F - MOMENTO DE TRANSPORTE",null,"Quantidade","Unidade","DMT",null,null,null,"Custo Unitário"]
[{"$nulls":5},"LN","RP","P"]
[null,"-",0,null,"tkm"]
[null,"-",0,null,"tkm"]
[null,null,null,"Custo unitário total de transporte"]
[{"$nulls":5},"Custo unitário direto total",null,null,null,{"$f":"TRUNC(J1616+J1620,2)","v":271.87}]
[null,"Obs."]
[]
[{"$f":"A1590+1","v":40},"1ª/GRD",{"$nulls":8},{"$f":"J1665","v":179}]
[null,"OBRA:"," PAVIMENTAÇÃO ASFÁLTICA EM CBUQ - ESTRADA PARA SANTO ANTÔNIO DA BOA VISTA (SÃO JOÃO DA PONTE / MG)"]
[null,"Custo Unitário de Referência",null,null,"Minas Gerais"]
[{"$nulls":4}," Janeiro/2025",null,null,"Produção da equipe ",3,{"$f":"VLOOKUP(A1629,ORÇAMENTO!$A$10:$L$66,7,1)","v":"UN."}]
[null,5213476,"PLACA DELINEADORA EM AÇO, 0,50 X 0,60M - PELÍCULA RETRORREFLETIVA - FORNECIMENTO E IMPLANTAÇÃO",{"$nulls":5},"Valores em reais (R$)"]
[null,"A - EQUIPAMENTOS",null,"Quantidade","Utilização",null,"Custo Horário",null,null,"Custo"]
[{"$nulls":4},"Operativa","Improdutiva","Produtivo","Improdutivo",null,"Horário Total"]
[null,"E9687","Caminhão carroceria com capacidade de 5 t - 120 kW",1,0.3,0.7,154.82689999999999,59.719900000000003,null,{"$f":"D1636*(E1636*G1636+F1636*H1636)","v":88.251999999999995}]
[null,"-",0,null,null,null,0,0,null,{"$f":"D1637*(E1637*G1637+F1637*H1637)","v":0}]
[{"$nulls":7},"Custo horário total de equipamentos",null,{"$f":"SUM(J1636:J1637)","v":88.251999999999995}]
[null,"B - MÃO DE OBRA",null,"Quantidade","Unidade",null,"Custo Horário","Custo Horário Total"]
[null,"P9830","Montador",1,"h",null,38.260300000000001,null,null,{"$f":"D1640*G1640","v":38.260300000000001}]
[null,"P9824","Servente",2,"h",null,21.435400000000001,null,null,{"$f":"D1641*G1641","v":42.870800000000003}]
[null,null,null,"Custo horário total de mão de obra",{"$nulls":5},{"$f":"SUM(J1640:J1641)","v":81.131100000000004}]
[null,null,null,"Custo horário total de execução",{"$nulls":5},{"$f":"J1638+J1642","v":169.38310000000001}]
[null,null,null,"Custo unitário de execução",{"$nulls":5},{"$f":"J1643/I1632","v":56.46103333333334}]
[{"$nulls":7},"Custo do FIC",null,0]
[{"$nulls":7},"Custo do FIT",null,0]
[null,"C - MATERIAL",null,"Quantidade","Unidade",null,"Preço Unitário","Custo Unitário"]
[null,"-",0,null,0,null,0,null,null,{"$f":"D1648*G1648","v":0},null,null,{"$f":"J1648*L1648","v":0}]
[null,"-",0,null,0,null,0,null,null,{"$f":"D1649*G1649","v":0},null,null,{"$f":"J1649*L1649","v":0}]
[null,null,null,"Custo unitário total de material",{"$nulls":5},{"$f":"SUM(J1648:J1649)","v":0}]
[null,"D - ATIVIDADES AUXILIARES",null,"Quantidade","Unidade",null,"Custo Unitário","Custo Unitário"]
[null,5213421,"Placa em aço nº 16 galvanizado com película retrorrefletiva tipo I + IV - confecção",0.3,"m²",null,408.48,null,null,{"$f":"D1652*G1652","v":122.544},null,{"$f":"VLOOKUP(A$1629,ORÇAMENTO!A$11:L$66,8,FALSE)","v":16},{"$f":"J1652*L1652","v":1960.704}]
[null,"-",0,null,0,null,0,null,null,{"$f":"D1653*G1653","v":0},null,{"$f":"L1652","v":16},0]
[null,null,null,"Custo total de atividades auxiliares",{"$nulls":5},{"$f":"SUM(J1652:J1653)","v":122.544}]
[{"$nulls":7},"Subtotal",null,{"$f":"J1644+J1650+J1654+J1645+J1646","v":179.00503333333333}]
[null,"E - TEMPO FIXO",null,"Código","Quantidade","Unidade",null,"Custo Unitário","Custo Unitário"]
[null,"-",0,"-",null,"t",null,0,null,{"$f":"ROUNDDOWN(E1657*H1657,4)","v":0}]
[null,"-",0,"-",null,"t",null,0,null,{"$f":"ROUNDDOWN(E1658*H1658,4)","v":0}]
[null,null,null,"Custo unitário total de tempo fixo",{"$nulls":5},{"$f":"SUM(J1657:J1658)","v":0}]
[null,"F - MOMENTO DE TRANSPORTE",null,"Quantidade","Unidade","DMT",null,null,null,"Custo Unitário"]
[{"$nulls":5},"LN","RP","P"]
[null,"-",0,null,"tkm"]
[null,"-",0,null,"tkm"]
[null,null,null,"Custo unitário total de transporte"]
[{"$nulls":5},"Custo unitário direto total",null,null,null,{"$f":"TRUNC(J1655+J1659,2)","v":179}]
[null,"Obs."]
[]
[{"$f":"A1629+1","v":41},"1ª/GRD",{"$nulls":8},{"$f":"J1704","v":355.64}]
[null,"OBRA:"," PAVIMENTAÇÃO ASFÁLTICA EM CBUQ - ESTRADA PARA SANTO ANTÔNIO DA BOA VISTA (SÃO JOÃO DA PONTE / MG)"]
[null,"Custo Unitário de Referência",null,null,"Minas Gerais"]
[{"$nulls":4}," Janeiro/2025",null,null,"Produção da equipe ",66.400000000000006,{"$f":"VLOOKUP(A1668,ORÇAMENTO!$A$10:$L$66,7,1)","v":"M"}]
[null,3713604,"DEFENSA SEMIMALEÁVEL SIMPLES, INCLUSIVE POSTE, ESPAÇADOR, CALÇO E ACESSÓRIOS PARA FIXAÇÃO - FORNECIMENTO E IMPLANTAÇÃO",{"$nulls":5},"Valores em reais (R$)"]
[null,"A - EQUIPAMENTOS",null,"Quantidade","Utilização",null,"Custo Horário",null,null,"Custo"]
[{"$nulls":4},"Operativa","Improdutiva","Produtivo","Improdutivo",null,"Horário Total"]
[null,"E9082","Bate-estaca hidráulico para defensas montado em caminhão guindauto com capacidade de 6,2 t e carroceria de 5 t - 152 kW",1,1,0,360.97699999999998,135.67160000000001,null,{"$f":"D1675*(E1675*G1675+F1675*H1675)","v":360.97699999999998}]
[null,"-",0,null,null,null,0,0,null,{"$f":"D1676*(E1676*G1676+F1676*H1676)","v":0}]
[{"$nulls":7},"Custo horário total de equipamentos",null,{"$f":"SUM(J1675:J1676)","v":360.97699999999998}]
[null,"B - MÃO DE OBRA",null,"Quantidade","Unidade",null,"Custo Horário","Custo Horário Total"]
[null,"P9801","Ajudante",3,"h",null,23.351299999999998,null,null,{"$f":"D1679*G1679","v":70.053899999999999}]
[null,"P9830","Montador",1,"h",null,38.260300000000001,null,null,{"$f":"D1680*G1680","v":38.260300000000001}]
[null,null,null,"Custo horário total de mão de obra",{"$nulls":5},{"$f":"SUM(J1679:J1680)","v":108.3142}]
[null,null,null,"Custo horário total de execução",{"$nulls":5},{"$f":"J1677+J1681","v":469.2912}]
[null,null,null,"Custo unitário de execução",{"$nulls":5},{"$f":"J1682/I1671","v":7.0676385542168667}]
[{"$nulls":7},"Custo do FIC",null,0]
[{"$nulls":7},"Custo do FIT",null,0]
[null,"C - MATERIAL",null,"Quantidade","Unidade",null,"Preço Unitário","Custo Unitário"]
[null,"M1968","Defensa metálica semimaleável simples",0.25,"un",null,1392.9513999999999,null,null,{"$f":"D1687*G1687","v":348.23784999999998},null,{"$f":"VLOOKUP(A$1668,ORÇAMENTO!A$11:L$66,8,FALSE)","v":86},{"$f":"J1687*L1687","v":29948.455099999999}]
[null,"-",0,0,0,null,0,null,null,{"$f":"D1688*G1688","v":0},null,null,{"$f":"J1688*L1688","v":0}]
[null,null,null,"Custo unitário total de material",{"$nulls":5},{"$f":"SUM(J1687:J1688)","v":348.23784999999998}]
[null,"D - ATIVIDADES AUXILIARES",null,"Quantidade","Unidade",null,"Custo Unitário","Custo Unitário"]
[null,"-",0,null,0,null,0,null,null,{"$f":"D1691*G1691","v":0}]
[null,"-",0,null,0,null,0,null,null,{"$f":"D1692*G1692","v":0}]
[null,null,null,"Custo total de atividades auxiliares",{"$nulls":5},{"$f":"SUM(J1691:J1692)","v":0}]
[{"$nulls":7},"Subtotal",null,{"$f":"J1683+J1689+J1693+J1684+J1685","v":355.30548855421682}]
[null,"E - TEMPO FIXO",null,"Código","Quantidade","Unidade",null,"Custo Unitário","Custo Unitário"]
[null,"M1968","Defensa metálica semimaleável simples",5915373,1.9359999999999999E-2,"t",null,17.57,null,{"$f":"ROUNDDOWN(E1696*H1696,4)","v":0.34010000000000001}]
[null,"-",0,{"$nulls":6},{"$f":"ROUNDDOWN(E1697*H1697,4)","v":0}]
[null,null,null,"Custo unitário total de tempo fixo",{"$nulls":5},{"$f":"SUM(J1696:J1697)","v":0.34010000000000001}]
[null,"F - MOMENTO DE TRANSPORTE",null,"Quantidade","Unidade","DMT",null,null,null,"Custo Unitário"]
[{"$nulls":5},"LN","RP","P"]
[null,"M1968","Defensa metálica semimaleável simples",1.9359999999999999E-2,"tkm"]
[null,"-",0]
[null,null,null,"Custo unitário total de transporte"]
[{"$nulls":5},"Custo unitário direto total",null,null,null,{"$f":"TRUNC(J1694+J1698,2)","v":355.64}]
[null,"Obs."]
[]
[{"$f":"A1668+1","v":42},"1ª/GRD",{"$nulls":8},{"$f":"J1750","v":27.24}]
[null,"OBRA:"," PAVIMENTAÇÃO ASFÁLTICA EM CBUQ - ESTRADA PARA SANTO ANTÔNIO DA BOA VISTA (SÃO JOÃO DA PONTE / MG)"]
[null,"Custo Unitário de Referência",null,null,"Minas Gerais"]
[{"$nulls":4}," Janeiro/2025",null,null,"Produção da equipe ",149.4,{"$f":"VLOOKUP(A1707,ORÇAMENTO!$A$10:$L$66,7,1)","v":"M2"}]
[null,5213401,"PINTURA DE EIXO VIÁRIO SOBRE ASFALTO COM TINTA RETRORREFLETIVA A BASE DE RESINA ACRÍLICA COM MICROESFERAS DE VIDRO, APLICAÇÃO MECÂNICA COM DEMARCADORA AUTOPROPELIDA",{"$nulls":5},"Valores em reais (R$)"]
[null,"A - EQUIPAMENTOS",null,"Quantidade","Utilização",null,"Custo Horário",null,null,"Custo"]
[{"$nulls":4},"Operativa","Improdutiva","Produtivo","Improdutivo",null,"Horário Total"]
[null,"E9644","Caminhão demarcador de faixas com sistema de pintura a frio - 28 kW/129 kW",1,1,0,403.09390000000002,159.4639,null,{"$f":"D1714*(E1714*G1714+F1714*H1714)","v":403.09390000000002}]
[null,"-",0,null,null,null,0,0,null,{"$f":"D1715*(E1715*G1715+F1715*H1715)","v":0}]
[{"$nulls":7},"Custo horário total de equipamentos",null,{"$f":"SUM(J1714:J1715)","v":403.09390000000002}]
[null,"B - MÃO DE OBRA",null,"Quantidade","Unidade",null,"Custo Horário","Custo Horário Total"]
[null,"P9853","Pré-marcador",1,"h",null,23.213999999999999,null,null,{"$f":"D1718*G1718","v":23.213999999999999}]
[null,"P9824","Servente",4,"h",null,21.435400000000001,null,null,{"$f":"D1719*G1719","v":85.741600000000005}]
[null,null,null,"Custo horário total de mão de obra",{"$nulls":5},{"$f":"SUM(J1718:J1719)","v":108.9556}]
[null,null,null,"Custo horário total de execução",{"$nulls":5},{"$f":"J1716+J1720","v":512.04950000000008}]
[null,null,null,"Custo unitário de execução",{"$nulls":5},{"$f":"J1721/I1710","v":3.4273728246318611}]
[{"$nulls":7},"Custo do FIC",null,0]
[{"$nulls":7},"Custo do FIT",null,0]
[null,"C - MATERIAL",null,"Quantidade","Unidade",null,"Preço Unitário","Custo Unitário"]
[null,"M2037","Microesferas refletivas de vidro tipo I-B",0.12,"kg",null,8.7142999999999997,null,null,{"$f":"D1726*G1726","v":1.0457159999999999},null,{"$f":"VLOOKUP(A$1707,ORÇAMENTO!A$11:L$66,8,FALSE)","v":1900},{"$f":"J1726*L1726","v":1986.8603999999998}]
[null,"M2038","Microesferas refletivas de vidro tipo II-A",0.35,"kg",null,8.8077000000000005,null,null,{"$f":"D1727*G1727","v":3.0826950000000002},null,{"$f":"L1726","v":1900},{"$f":"J1727*L1727","v":5857.1205}]
[null,"M2034","Solvente para tinta à base de resina acrílica",0.03,"l",null,16.6828,null,null,0.50048400000000004,null,{"$f":"L1727","v":1900},950.91960000000006]
[null,"M2044","Tinta à base de resina acrílica emulsionada em água para pré-marcação viária",9.7000000000000005E-4,"l",null,19.888300000000001,null,null,1.9291651000000003E-2,null,1900,36.654136900000005]
[null,"M2027","Tinta à base de resina acrílica estirenada para demarcação viária",0.6,"l",null,31.8858,null,null,19.13148,null,1900,36349.811999999998]
[null,null,null,"Custo unitário total de material",{"$nulls":5},{"$f":"SUM(J1726:J1730)","v":23.779666650999999}]
[null,"D - ATIVIDADES AUXILIARES",null,"Quantidade","Unidade",null,"Custo Unitário","Custo Unitário"]
[null,"-",0,null,0,null,0,null,null,{"$f":"D1733*G1733","v":0}]
[null,"-",0,null,0,null,0,null,null,{"$f":"D1734*G1734","v":0}]
[null,null,null,"Custo total de atividades auxiliares",{"$nulls":5},{"$f":"SUM(J1733:J1734)","v":0}]
[{"$nulls":7},"Subtotal",null,{"$f":"J1722+J1731+J1735+J1723+J1724","v":27.207039475631859}]
[null,"E - TEMPO FIXO",null,"Código","Quantidade","Unidade",null,"Custo Unitário","Custo Unitário"]
[null,"M2037","Microesferas refletivas de vidro tipo I-B",5914655,1.2E-4,"t",null,32.39,null,{"$f":"ROUNDDOWN(E1738*H1738,4)","v":3.8E-3}]
[null,"M2038","Microesferas refletivas de vidro tipo II-A",5914655,3.5E-4,"t",null,32.39,null,{"$f":"ROUNDDOWN(E1739*H1739,4)","v":1.1299999999999999E-2}]
[null,"M2034","Solvente para tinta à base de resina acrílica",5914655,3.0000000000000001E-5,"t",null,32.39,null,8.9999999999999998E-4]
[null,"M2027","Tinta à base de resina acrílica estirenada para demarcação viária",5914655,8.3000000000000001E-4,"t",null,32.39,null,2.6800000000000001E-2]
[null,null,null,"Custo unitário total de tempo fixo",{"$nulls":5},{"$f":"SUM(J1738:J1741)","v":4.2800000000000005E-2}]
[null,"F - MOMENTO DE TRANSPORTE",null,"Quantidade","Unidade","DMT",null,null,null,"Custo Unitário"]
[{"$nulls":5},"LN","RP","P"]
[null,"M2037","Microesferas refletivas de vidro tipo I-B",1.2E-4,"tkm"]
[null,"M2038","Microesferas refletivas de vidro tipo II-A",3.5E-4,"tkm"]
[null,"M2034","Solvente para tinta à base de resina acrílica",3.0000000000000001E-5,"tkm"]
[null,"M2027","Tinta à base de resina acrílica estirenada para demarcação viária",8.3000000000000001E-4,"tkm"]
[null,null,null,"Custo unitário total de transporte"]
[{"$nulls":5},"Custo unitário direto total",null,null,null,{"$f":"TRUNC(J1736+J1742,2)","v":27.24}]
[null,"Obs."]
[]
[{"$f":"A1707+1","v":43},"1ª/GRD",{"$nulls":8},{"$f":"J1791","v":32.35}]
[null,"OBRA:"," PAVIMENTAÇÃO ASFÁLTICA EM CBUQ - ESTRADA PARA SANTO ANTÔNIO DA BOA VISTA (SÃO JOÃO DA PONTE / MG)"]
[null,"Custo Unitário de Referência",null,null,"Minas Gerais"]
[{"$nulls":4}," Janeiro/2025",null,null,"Produção da equipe ",36,{"$f":"VLOOKUP(A1753,ORÇAMENTO!$A$10:$L$66,7,1)","v":"UNID."}]
[null,5213360,"TACHA REFLETIVA EM PLÁSTICO INJETADO - BIDIRECIONAL COM UM PINO - FORNECIMENTO E COLOCAÇÃO",{"$nulls":5},"Valores em reais (R$)"]
[null,"A - EQUIPAMENTOS",null,"Quantidade","Utilização",null,"Custo Horário",null,null,"Custo"]
[{"$nulls":4},"Operativa","Improdutiva","Produtivo","Improdutivo",null,"Horário Total"]
[null,"E9687","Caminhão carroceria com capacidade de 5 t - 120 kW",1,1,0,154.82689999999999,59.719900000000003,null,{"$f":"D1760*(E1760*G1760+F1760*H1760)","v":154.82689999999999}]
[null,"E9764","Grupo gerador - 7,2 kVA",1,1,0,10.884399999999999,0.49719999999999998,null,{"$f":"D1761*(E1761*G1761+F1761*H1761)","v":10.884399999999999}]
[null,"E9675","Martelete perfurador/rompedor elétrico - 1,50 kW",1,1,0,1.2970999999999999,0.71579999999999999,null,{"$f":"D1762*(E1762*G1762+F1762*H1762)","v":1.2970999999999999}]
[{"$nulls":7},"Custo horário total de equipamentos",null,{"$f":"SUM(J1760:J1762)","v":167.00839999999999}]
[null,"B - MÃO DE OBRA",null,"Quantidade","Unidade",null,"Custo Horário","Custo Horário Total"]
[null,"P9830","Montador",1,"h",null,38.260300000000001,null,null,{"$f":"D1765*G1765","v":38.260300000000001}]
[null,"P9824","Servente",5,"h",null,21.435400000000001,null,null,{"$f":"D1766*G1766","v":107.17700000000001}]
[null,null,null,"Custo horário total de mão de obra",{"$nulls":5},{"$f":"SUM(J1765:J1766)","v":145.43729999999999}]
[null,null,null,"Custo horário total de execução",{"$nulls":5},{"$f":"J1763+J1767","v":312.44569999999999}]
[null,null,null,"Custo unitário de execução",{"$nulls":5},{"$f":"J1768/I1756","v":8.6790472222222217}]
[{"$nulls":7},"Custo do FIC",null,0]
[{"$nulls":7},"Custo do FIT",null,0]
[null,"C - MATERIAL",null,"Quantidade","Unidade",null,"Preço Unitário","Custo Unitário"]
[null,"M2041","Adesivo à base de resina poliéster",0.10292,"kg",null,27.374500000000001,null,null,{"$f":"D1773*G1773","v":2.8173835400000002},null,{"$f":"VLOOKUP(A$1753,ORÇAMENTO!A$11:L$66,8,FALSE)","v":1900},{"$f":"J1773*L1773","v":5353.0287260000005}]
[null,"M1528","Broca de widia - D = 13 mm e C = 150 mm",3.4099999999999998E-3,"un",null,20.665500000000002,null,null,{"$f":"D1774*G1774","v":7.0469354999999997E-2},null,{"$f":"L1773","v":1900},{"$f":"J1774*L1774","v":133.8917745}]
[null,"M3821","Tacha refletiva em plástico injetado bidirecional com um pino - tipo I",1,"un",null,20.780799999999999,null,null,20.780799999999999,null,{"$f":"L1774","v":1900},{"$f":"J1775*L1775","v":39483.519999999997}]
[null,null,null,"Custo unitário total de material",{"$nulls":5},{"$f":"SUM(J1773:J1775)","v":23.668652895000001}]
[null,"D - ATIVIDADES AUXILIARES",null,"Quantidade","Unidade",null,"Custo Unitário","Custo Unitário"]
[null,"-",0,null,0,null,0,null,null,{"$f":"D1778*G1778","v":0}]
[null,"-",0,null,0,null,0,null,null,{"$f":"D1779*G1779","v":0}]
[null,null,null,"Custo total de atividades auxiliares",{"$nulls":5},{"$f":"SUM(J1778:J1779)","v":0}]
[{"$nulls":7},"Subtotal",null,{"$f":"J1769+J1776+J1780+J1770+J1771","v":32.347700117222224}]
[null,"E - TEMPO FIXO",null,"Código","Quantidade","Unidade",null,"Custo Unitário","Custo Unitário"]
[null,"M2041","Adesivo à base de resina poliéster",5914655,1E-4,"t",null,32.39,null,{"$f":"ROUNDDOWN(E1783*H1783,4)","v":3.2000000000000002E-3}]
[null,"M3821","Tacha refletiva em plástico injetado bidirecional com um pino - tipo I",5914655,1.6000000000000001E-4,"t",null,32.39,null,{"$f":"ROUNDDOWN(E1784*H1784,4)","v":5.1000000000000004E-3}]
[null,null,null,"Custo unitário total de tempo fixo",{"$nulls":5},{"$f":"SUM(J1783:J1784)","v":8.3000000000000001E-3}]
[null,"F - MOMENTO DE TRANSPORTE",null,"Quantidade","Unidade","DMT",null,null,null,"Custo Unitário"]
[{"$nulls":5},"LN","RP","P"]
[null,"M2041","Adesivo à base de resina poliéster",1E-4,"tkm"]
[null,"M3821","Tacha refletiva em plástico injetado bidirecional com um pino - tipo I",1.6000000000000001E-4,"tkm"]
[null,null,null,"Custo unitário total de transporte"]
[{"$nulls":5},"Custo unitário direto total",null,null,null,{"$f":"TRUNC(J1781+J1785,2)","v":32.35}]
[null,"Obs."]
[]
[{"$f":"A1753+1","v":44},"1ª/GRD",{"$nulls":8},{"$f":"J1837","v":40.78}]
[null,"OBRA:"," PAVIMENTAÇÃO ASFÁLTICA EM CBUQ - ESTRADA PARA SANTO ANTÔNIO DA BOA VISTA (SÃO JOÃO DA PONTE / MG)"]
[null,"Custo Unitário de Referência",null,null,"Minas Gerais"]
[{"$nulls":4}," Janeiro/2025",null,null,"Produção da equipe ",30.18,{"$f":"VLOOKUP(A1794,ORÇAMENTO!$A$10:$L$66,7,1)","v":"M2"}]
[null,5213405,"PINTURA DE FAIXA DE PEDESTRE OU ZEBRADA TINTA RETRORREFLETIVA A BASE DE RESINA ACRÍLICA COM MICROESFERAS DE VIDRO, APLICAÇÃO MANUAL",{"$nulls":5},"Valores em reais (R$)"]
[null,"A - EQUIPAMENTOS",null,"Quantidade","Utilização",null,"Custo Horário",null,null,"Custo"]
[{"$nulls":4},"Operativa","Improdutiva","Produtivo","Improdutivo",null,"Horário Total"]
[null,"E9644","Caminhão demarcador de faixas com sistema de pintura a frio - 28 kW/129 kW",1,1,0,403.09390000000002,159.4639,null,{"$f":"D1801*(E1801*G1801+F1801*H1801)","v":403.09390000000002}]
[null,"-",0,null,null,null,0,0,null,{"$f":"D1802*(E1802*G1802+F1802*H1802)","v":0}]
[{"$nulls":7},"Custo horário total de equipamentos",null,{"$f":"SUM(J1801:J1802)","v":403.09390000000002}]
[null,"B - MÃO DE OBRA",null,"Quantidade","Unidade",null,"Custo Horário","Custo Horário Total"]
[null,"P9853","Pré-marcador",1,"h",null,23.213999999999999,null,null,{"$f":"D1805*G1805","v":23.213999999999999}]
[null,"P9824","Servente",4,"h",null,21.435400000000001,null,null,{"$f":"D1806*G1806","v":85.741600000000005}]
[null,null,null,"Custo horário total de mão de obra",{"$nulls":5},{"$f":"SUM(J1805:J1806)","v":108.9556}]
[null,null,null,"Custo horário total de execução",{"$nulls":5},{"$f":"J1803+J1807","v":512.04950000000008}]
[null,null,null,"Custo unitário de execução",{"$nulls":5},{"$f":"J1808/I1797","v":16.966517561298875}]
[{"$nulls":7},"Custo do FIC",null,0]
[{"$nulls":7},"Custo do FIT",null,0]
[null,"C - MATERIAL",null,"Quantidade","Unidade",null,"Preço Unitário","Custo Unitário"]
[null,"M2037","Microesferas refletivas de vidro tipo I-B",0.12,"kg",null,8.7142999999999997,null,null,{"$f":"D1813*G1813","v":1.0457159999999999},null,{"$f":"VLOOKUP(A1794,ORÇAMENTO!A$11:L$66,8,FALSE)","v":100},{"$f":"J1813*L1813","v":104.57159999999999}]
[null,"M2038","Microesferas refletivas de vidro tipo II-A",0.35,"kg",null,8.8077000000000005,null,null,{"$f":"D1814*G1814","v":3.0826950000000002},null,{"$f":"L1813","v":100},{"$f":"J1814*L1814","v":308.26949999999999}]
[null,"M2034","Solvente para tinta à base de resina acrílica",0.03,"l",null,16.6828,null,null,0.50048400000000004,null,{"$f":"L1814","v":100},{"$f":"J1815*L1815","v":50.048400000000001}]
[null,"M2044","Tinta à base de resina acrílica emulsionada em água para pré-marcação viária",9.7000000000000005E-4,"l",null,19.888300000000001,null,null,1.9291651000000003E-2,null,100,1.9291651000000003]
[null,"M2027","Tinta à base de resina acrílica estirenada para demarcação viária",0.6,"l",null,31.8858,null,null,19.13148,null,100,1913.1479999999999]
[null,null,null,"Custo unitário total de material",{"$nulls":5},{"$f":"SUM(J1813:J1817)","v":23.779666650999999}]
[null,"D - ATIVIDADES AUXILIARES",null,"Quantidade","Unidade",null,"Custo Unitário","Custo Unitário"]
[null,"-",0,null,0,null,0,null,null,{"$f":"D1820*G1820","v":0}]
[null,"-",0,null,0,null,0,null,null,{"$f":"D1821*G1821","v":0}]
[null,null,null,"Custo total de atividades auxiliares",{"$nulls":5},{"$f":"SUM(J1820:J1821)","v":0}]
[{"$nulls":7},"Subtotal",null,{"$f":"J1809+J1818+J1822+J1810+J1811","v":40.746184212298871}]
[null,"E - TEMPO FIXO",null,"Código","Quantidade","Unidade",null,"Custo Unitário","Custo Unitário"]
[null,"M2037","Microesferas refletivas de vidro tipo I-B",5914655,1.2E-4,"t",null,32.39,null,{"$f":"ROUNDDOWN(E1825*H1825,4)","v":3.8E-3}]
[null,"M2038","Microesferas refletivas de vidro tipo II-A",5914655,3.5E-4,"t",null,32.39,null,{"$f":"ROUNDDOWN(E1826*H1826,4)","v":1.1299999999999999E-2}]
[null,"M2034","Solvente para tinta à base de resina acrílica",5914655,3.0000000000000001E-5,"t",null,32.39,null,8.9999999999999998E-4]
[null,"M2027","Tinta à base de resina acrílica estirenada para demarcação viária",5914655,8.3000000000000001E-4,"t",null,32.39,null,2.6800000000000001E-2]
[null,null,null,"Custo unitário total de tempo fixo",{"$nulls":5},{"$f":"SUM(J1825:J1828)","v":4.2800000000000005E-2}]
[null,"F - MOMENTO DE TRANSPORTE",null,"Quantidade","Unidade","DMT",null,null,null,"Custo Unitário"]
[{"$nulls":5},"LN","RP","P"]
[null,"M2037","Microesferas refletivas de vidro tipo I-B",1.2E-4,"tkm"]
[null,"M2038","Microesferas refletivas de vidro tipo II-A",3.5E-4,"tkm"]
[null,"M2034","Solvente para tinta à base de resina acrílica",3.0000000000000001E-5,"tkm"]
[null,"M2027","Tinta à base de resina acrílica estirenada para demarcação viária",8.3000000000000001E-4,"tkm"]
[null,null,null,"Custo unitário total de transporte"]
[{"$nulls":5},"Custo unitário direto total",null,null,null,{"$f":"TRUNC(J1823+J1829,2)","v":40.78}]
[null,"Obs."]

{"sheet":"AUX.-VEIC.","index":2,"n_rows":31,"n_cols":6,"rows_kept":31,"cut":false,"hidden":false,"merged":[[26,2,26,3],[27,2,27,3],[28,2,28,3],[29,1,30,1],[29,2,29,3],[30,2,30,3],[25,2,25,3],[1,1,1,4],[2,1,2,2],[3,1,3,4],[17,1,17,4],[18,2,18,3],[19,2,19,3],[20,2,20,3],[21,2,21,3],[22,2,22,3],[23,2,23,3],[24,2,24,3]]}
[]
[null,"CÁLCULO DO CUSTO POR MÊS DE VEÍCULOS"]
[null,"Veículo: Polo TSI, Onix Turbo, Argo 1.3, HB-20 Turbo",null,"Data:","2025-05-28"]
[null,"DADOS ELEMENTARES DO VEÍCULO"]
[null,"Dados Básicos","Preço (R$)","Quantidade","Vida Útil"]
[null,"Quilometragem média mensal",null,3000]
[null,"Valor de Aquisição (VA)",103900]
[null,"Taxa de Juros (i)%",null,14.75]
[null,"IPVA e Seguro Obrigatório (4%)",{"$f":"0.04*C7","v":4156}]
[null,"Lavagem",50,2]
[null,"Pneus",479.9,4,50000]
[null,"Combustível",6.01,14]
[null,"Óleo Lubrificante + Filtros (revisão)",{"$f":"4*(188.59+213.69+186.16+283.83+186.16)/5","v":846.74400000000003},1,10000]
[null,"Seguro Total Anual",3378.94]
[null,"Jogo de Amortecedores",1287,null,50000]
[null,"Coeficiente de Manutenção",null,4.7999999999999998E-6]
[null,"Motorista",{"$f":"5284.47/1.7393","v":3038.2740182832176},1]
[null,"CÁLCULO DO CUSTO POR MÊS"]
[null,"DEPRECIAÇÃO","D = (VA-0,60xVA) / 12 x 5",null,{"$f":"(C7-(0.6*C7))/60","v":692.66666666666663},{"$f":"E19/E$30","v":0.16243931000033615}]
[null,"JUROS","J = (VA-0,60xVA) x i / 12",null,{"$f":"ROUND(((C7-0.6*C7)*D8/100)/12,2)","v":510.84},0.11979860027031529]
[null,"LICENCIAMENTO","L = (IPVA=SEG.OBRIG.)/12",null,{"$f":"ROUND(C9/12,2)","v":346.33},8.121887329030282E-2]
[null,"SEGURO TOTAL","ST = SEGURO ANUAL/12",null,{"$f":"ROUND(C14/12,2)","v":281.58},6.6034159157691993E-2]
[null,"COMBUSTÍVEL","OD = (Comb./Consu)x Km.mês",null,{"$f":"ROUND(C12/D12*D6,2)","v":1287.8599999999999},0.30201986012083676]
[null,"ÓLEO LUBRIFICANTE","OL = ((Ol. X Quant)/Vida Útil)xKm.mês)",null,{"$f":"ROUND(((C13*D13)/E13)*D6,2)","v":254.02},5.9570981991749851E-2]
[null,"LAVAGEM","LL = Preço Lavagem x Quantidade",null,{"$f":"ROUND(C10*D10,2)","v":100},2.3451295957700121E-2]
[null,"PNEUS","P = ((P. PneusxQuant)/Vida Útil)xkm.mês)",null,{"$f":"ROUND(((C11*D11)/E11)*D6,2)","v":115.18},2.7011202684079E-2]
[null,"AMORTECEDORES","AM = (P. Amort/Vida Útil)xkm.mês",null,{"$f":"ROUND(C15/E15*D6,2)","v":77.22},1.8109090738536032E-2]
[null,"MANUTENÇÃO","M = (VA-VPxK)xkm.mês",null,{"$f":"ROUND((C7-0.6*C7)*D16*D6,2)","v":598.46},0.14034662578845214]
[null,"MOTORISTA","MOT = SALÁRIO+LEIS SOCIAIS",null,{"$f":"ROUND((C17+C17*0.7368),2)","v":5276.87}]
[null,"CUSTO POR MÊS","SEM MOTORISTA",null,{"$f":"SUM(E19:E28)","v":4264.1566666666658},{"$f":"E30-E23","v":2976.2966666666662}]
[null,null,"COM MOTORISTA",null,{"$f":"E30+E29","v":9541.0266666666648}]

{"sheet":"CPU-FORNEC","index":3,"n_rows":92,"n_cols":14,"rows_kept":92,"cut":false,"hidden":false,"merged":[[71,0,80,0],[71,1,71,3],[71,4,71,7],[72,2,72,5],[73,2,73,3],[74,1,74,7],[77,1,77,3],[77,5,77,6],[78,1,78,6],[79,1,79,6],[80,1,80,6],[0,0,26,0],[0,1,0,3],[0,4,0,7],[22,1,22,3],[49,0,58,0],[49,1,49,3],[49,4,49,7],[50,2,50,5],[51,2,51,3],[52,1,52,7],[55,1,55,3],[55,5,55,6],[56,1,56,6],[57,1,57,6],[58,1,58,6],[27,1,27,3],[27,4,27,7],[28,2,28,5],[27,0,36,0],[29,2,29,3],[30,1,30,7],[33,1,33,3],[33,5,33,6],[34,1,34,6],[35,1,35,6],[36,1,36,6],[0,10,0,11],[1,2,1,5],[1,10,1,11],[2,2,2,3],[3,1,3,7],[22,5,22,6],[23,1,23,6],[24,1,24,6],[25,1,25,6],[5,1,5,7],[9,1,9,7],[13,1,13,7],[17,1,17,7],[38,0,47,0],[38,1,38,3],[38,4,38,7],[39,2,39,5],[40,2,40,3],[41,1,41,7],[44,1,44,3],[44,5,44,6],[45,1,45,6],[46,1,46,6],[47,1,47,6],[60,0,69,0],[60,1,60,3],[60,4,60,7],[61,2,61,5],[62,2,62,3],[63,1,63,7],[66,1,66,3],[66,5,66,6],[67,1,67,6],[68,1,68,6],[69,1,69,6],[81,1,81,7],[82,0,91,0],[82,1,82,3],[82,4,82,7],[83,2,83,5],[84,2,84,3],[85,1,85,7],[88,1,88,3],[88,5,88,6],[89,1,89,6],[90,1,90,6],[91,1,91,6]]}
[1,"CODEVASF",null,null," COMPOSIÇÃO DE PREÇO UNITÁRIO",null,null,null,{"$f":"H24","v":0},{"$f":"H26","v":0},"BDI CALCULADO:",null,{"$f":"ORÇAMENTO!L6","v":15}]
[null,"OBRA:  "," PAVIMENTAÇÃO ASFÁLTICA EM CBUQ - ESTRADA PARA SANTO ANTÔNIO DA BOA VISTA (SÃO JOÃO DA PONTE / MG)",null,null,null,"DATA: ",{"$f":"ORÇAMENTO!C6","v":" AGOSTO / 2025"},null,null,"BDI DIFERENCIADO:",null,{"$f":"'BDI FORN'!D31/100","v":0.15}]
[null,"SERVIÇO:  ","CPU.1",null,"Referência:","CODEVASF","UNIDADE: ",{"$f":"VLOOKUP(A1,ORÇAMENTO!A11:L33,5)","v":"MOBILIZAÇÃO E DESMOBILIZAÇÃO"}]
[]
[null,"TIPO ITEM","CODIGO ITEM","DESCRIÇÃO ITEM","UNIDADE ITEM","COEFICIENTE","PRECO UNITARIO","CUSTO TOTAL",null,"distancia =",90,"B.DESPACHO"]
[null,"EQUIPAMENTOS",{"$nulls":7},"Pá carregadeira ",null,null,10.1," ton"]
[null,null,"E9001","E9001","E9001",null,"E9001"]
[]
[]
[null,"MÃO DE OBRA"]
[]
[]
[]
[null,"MATERIAIS"]
[]
[]
[{"$nulls":7},{"$f":"ROUNDDOWN(F17*G17,2)","v":0},null,"Motoniveladora ",null,null,12.47," ton"]
[null,"ATIVIDADES AUXILIARES",{"$nulls":7},"Trator de pneus",null,null,2.8," ton"]
[{"$nulls":7},{"$f":"ROUNDDOWN(F19*G19,2)","v":0}]
[{"$nulls":7},0]
[{"$nulls":7},0]
[{"$nulls":7},{"$f":"ROUNDDOWN(F22*G22,2)","v":0},null,"Rolo Compactador ",null,null,15.33," ton"]
[null,"PRODUÇÃO DA EQUIPE",null,null,1,"CUSTO ",null,{"$f":"SUM(H6:H22)","v":0},null,"Grade de disco",null,null,1," ton"]
[null,"TOTAL",{"$nulls":5},{"$f":"H23/E23","v":0},"OK","RETROESCAVADEIRA",null,null,6.67," ton"]
[null,"BDI                %",{"$nulls":5},{"$f":"1+$M$1","v":16}]
[null,"TOTAL DO SERVIÇO - R$",{"$nulls":5},{"$f":"ROUND(H24*H25,2)","v":0}]
[]
[45,"CODEVASF",null,null," COMPOSIÇÃO DE PREÇO UNITÁRIO",null,null,null,{"$f":"H35","v":2723.1},{"$f":"H37","v":3131.57}]
[null,"OBRA:  "," PAVIMENTAÇÃO ASFÁLTICA EM CBUQ - ESTRADA PARA SANTO ANTÔNIO DA BOA VISTA (SÃO JOÃO DA PONTE / MG)",null,null,null,"DATA: ",{"$f":"$H$2","v":" AGOSTO / 2025"}]
[null,"SERVIÇO:  ","AQUISIÇÃO DE EMULSÃO ASFÁLTICA PARA IMPRIMAÇÃO (EAI) - EXCLUSIVE TRANSPORTE",null,"Referência:","CPU.7","UNIDADE: ",{"$f":"VLOOKUP(A28,ORÇAMENTO!$A$11:$L$73,7)","v":"T"}]
[]
[null,"TIPO ITEM","CODIGO ITEM","DESCRIÇÃO ITEM","UNIDADE ITEM","COEFICIENTE","PRECO UNITARIO","CUSTO TOTAL"]
[null,"INSUMO","ANP","EMULSÃO ASFÁLTICA PARA SERVIÇO DE IMPRIMAÇÃO (MEMÓRIA EM ANEXO)","T",1,2723.1013152761834,{"$f":"ROUNDDOWN(F33*G33,2)","v":2723.1}]
[null,"PRODUÇÃO DA EQUIPE",null,null,1,"CUSTO ",null,{"$f":"SUM(H33:H33)","v":2723.1}]
[null,"TOTAL",{"$nulls":5},{"$f":"H34/E34","v":2723.1}]
[null,"BDI                %",{"$nulls":5},{"$f":"1+$M$2","v":1.1499999999999999}]
[null,"TOTAL DO SERVIÇO - R$",{"$nulls":5},{"$f":"ROUND(H35*H36,2)","v":3131.57},"OK"]
[]
[{"$f":"A28+1","v":46},"CODEVASF",null,null," COMPOSIÇÃO DE PREÇO UNITÁRIO",null,null,null,{"$f":"H46","v":466.4},{"$f":"H48","v":536.36}]
[null,"OBRA:  "," PAVIMENTAÇÃO ASFÁLTICA EM CBUQ - ESTRADA PARA SANTO ANTÔNIO DA BOA VISTA (SÃO JOÃO DA PONTE / MG)",null,null,null,"DATA: ",{"$f":"$H$2","v":" AGOSTO / 2025"}]
[null,"SERVIÇO:  ","TRANSPORTE DE EMULSÃO ASFÁLTICA PARA IMPRIMAÇÃO (EAI)",null,"Referência:","CPU.8","UNIDADE: ",{"$f":"VLOOKUP(A39,ORÇAMENTO!$A$11:$L$73,7)","v":"T"}]
[]
[null,"TIPO ITEM","CODIGO ITEM","DESCRIÇÃO ITEM","UNIDADE ITEM","COEFICIENTE","PRECO UNITARIO","CUSTO TOTAL"]
[null,"INSUMO"," - ","TRANSPORTE DE EMULSÃO ASFÁLTICA PARA IMPRIMAÇÃO (EAI), INCLUINDO CUSTO TOTAL DO TRANSPORTE (COMBUSTÍVEL, PEDÁGIOS, ETC.) E ICMS - MEMÓRIA ANEXA","T",1,466.40210526315792,{"$f":"ROUNDDOWN(F44*G44,2)","v":466.4}]
[null,"PRODUÇÃO DA EQUIPE",null,null,1,"CUSTO ",null,{"$f":"SUM(H44:H44)","v":466.4}]
[null,"TOTAL",{"$nulls":5},{"$f":"H45/E45","v":466.4}]
[null,"BDI                %",{"$nulls":5},{"$f":"1+$M$2","v":1.1499999999999999}]
[null,"TOTAL DO SERVIÇO - R$",{"$nulls":5},{"$f":"ROUND(H46*H47,2)","v":536.36},"OK"]
[]
[{"$f":"A39+1","v":47},"CODEVASF",null,null," COMPOSIÇÃO DE PREÇO UNITÁRIO",null,null,null,{"$f":"H57","v":3456.95},{"$f":"H59","v":3975.49}]
[null,"OBRA:  "," PAVIMENTAÇÃO ASFÁLTICA EM CBUQ - ESTRADA PARA SANTO ANTÔNIO DA BOA VISTA (SÃO JOÃO DA PONTE / MG)",null,null,null,"DATA: ",{"$f":"$H$2","v":" AGOSTO / 2025"}]
[null,"SERVIÇO:  ","AQUISIÇÃO DE EMULSAO ASFALTICA CATIONICA RR-1C - EXCLUSIVE TRANSPORTE",null,"Referência:","CPU.9","UNIDADE: ",{"$f":"VLOOKUP(A50,ORÇAMENTO!$A$11:$L$73,7)","v":"T"}]
[]
[null,"TIPO ITEM","CODIGO ITEM","DESCRIÇÃO ITEM","UNIDADE ITEM","COEFICIENTE","PRECO UNITARIO","CUSTO TOTAL"]
[null,"INSUMO","ANP","EMULSÃO ASFÁLTICA CATIÔNICA RR-1C(MEMÓRIA EM ANEXO)","T",1,3456.9562255014889,{"$f":"ROUNDDOWN(F55*G55,2)","v":3456.95}]
[null,"PRODUÇÃO DA EQUIPE",null,null,1,"CUSTO ",null,{"$f":"SUM(H55:H55)","v":3456.95}]
[null,"TOTAL",{"$nulls":5},{"$f":"H56/E56","v":3456.95},"OK"]
[null,"BDI                %",{"$nulls":5},{"$f":"1+$M$2","v":1.1499999999999999}]
[null,"TOTAL DO SERVIÇO - R$",{"$nulls":5},{"$f":"ROUND(H57*H58,2)","v":3975.49}]
[]
[{"$f":"A50+1","v":48},"CODEVASF",null,null," COMPOSIÇÃO DE PREÇO UNITÁRIO",null,null,null,{"$f":"H68","v":484.42},{"$f":"H70","v":557.08000000000004}]
[null,"OBRA:  "," PAVIMENTAÇÃO ASFÁLTICA EM CBUQ - ESTRADA PARA SANTO ANTÔNIO DA BOA VISTA (SÃO JOÃO DA PONTE / MG)",null,null,null,"DATA: ",{"$f":"$H$2","v":" AGOSTO / 2025"}]
[null,"SERVIÇO:  ","TRANSPORTE DE EMULSÃO ASFÁLTICA CATIONICA RR-1C",null,"Referência:","CPU.10","UNIDADE: ",{"$f":"VLOOKUP(A61,ORÇAMENTO!$A$11:$L$73,7)","v":"T"}]
[]
[null,"TIPO ITEM","CODIGO ITEM","DESCRIÇÃO ITEM","UNIDADE ITEM","COEFICIENTE","PRECO UNITARIO","CUSTO TOTAL"]
[null,"INSUMO"," - ","TRANSPORTE DE EMULSÃO ASFÁLTICA CATIONICA TIPO RR-1C, INCLUINDO CUSTO TOTAL DO TRANSPORTE (COMBUSTÍVEL, PEDÁGIOS, ETC.) E ICMS - MEMÓRIA ANEXA","T",1,484.42500000000001,{"$f":"ROUNDDOWN(F66*G66,2)","v":484.42}]
[null,"PRODUÇÃO DA EQUIPE",null,null,1,"CUSTO ",null,{"$f":"SUM(H66:H66)","v":484.42}]
[null,"TOTAL",{"$nulls":5},{"$f":"H67/E67","v":484.42},"OK"]
[null,"BDI                %",{"$nulls":5},{"$f":"1+$M$2","v":1.1499999999999999}]
[null,"TOTAL DO SERVIÇO - R$",{"$nulls":5},{"$f":"ROUND(H68*H69,2)","v":557.08000000000004}]
[]
[{"$f":"A61+1","v":49},"CODEVASF",null,null," COMPOSIÇÃO DE PREÇO UNITÁRIO",null,null,null,{"$f":"H79","v":4496.7700000000004},{"$f":"H81","v":5171.29}]
[null,"OBRA:  "," PAVIMENTAÇÃO ASFÁLTICA EM CBUQ - ESTRADA PARA SANTO ANTÔNIO DA BOA VISTA (SÃO JOÃO DA PONTE / MG)",null,null,null,"DATA: ",{"$f":"$H$2","v":" AGOSTO / 2025"}]
[null,"SERVIÇO:  ","AQUISIÇÃO DE CONCRETO ASFÁLTICO DE PETRÓLEO - CAP 50/70 - EXCLUSIVE TRANSPORTE",null,"Referência:","CPU.11","UNIDADE: ",{"$f":"VLOOKUP(A72,ORÇAMENTO!$A$11:$L$73,7)","v":"T"}]
[]
[null,"TIPO ITEM","CODIGO ITEM","DESCRIÇÃO ITEM","UNIDADE ITEM","COEFICIENTE","PRECO UNITARIO","CUSTO TOTAL"]
[null,"INSUMO",1518,"CIMENTOS ASFÁLTICO DE PETRÓLEO TIPO CAP 50/70 (MEMÓRIA EM ANEXO)","T",1,4496.7700022636054,{"$f":"ROUNDDOWN(F77*G77,2)","v":4496.7700000000004}]
[null,"PRODUÇÃO DA EQUIPE",null,null,1,"CUSTO ",null,{"$f":"SUM(H77:H77)","v":4496.7700000000004}]
[null,"TOTAL",{"$nulls":5},{"$f":"H78/E78","v":4496.7700000000004}]
[null,"BDI                %",{"$nulls":5},{"$f":"1+$M$2","v":1.1499999999999999}]
[null,"TOTAL DO SERVIÇO - R$",{"$nulls":5},{"$f":"ROUND(H79*H80,2)","v":5171.29}]
[]
[{"$f":"A72+1","v":50},"CODEVASF",null,null," COMPOSIÇÃO DE PREÇO UNITÁRIO",null,null,null,{"$f":"H90","v":754.76},{"$f":"H92","v":867.97}]
[null,"OBRA:  "," PAVIMENTAÇÃO ASFÁLTICA EM CBUQ - ESTRADA PARA SANTO ANTÔNIO DA BOA VISTA (SÃO JOÃO DA PONTE / MG)",null,null,null,"DATA: ",{"$f":"$H$2","v":" AGOSTO / 2025"}]
[null,"SERVIÇO:  ","TRANSPORTE DE CONCRETO ASFÁLTICO DE PETRÓLEO - CAP 50/70",null,"Referência:","CPU.12","UNIDADE: ",{"$f":"VLOOKUP(A83,ORÇAMENTO!$A$11:$L$73,7)","v":"T"}]
[]
[null,"TIPO ITEM","CODIGO ITEM","DESCRIÇÃO ITEM","UNIDADE ITEM","COEFICIENTE","PRECO UNITARIO","CUSTO TOTAL"]
[null,"INSUMO"," - ","TRANSPORTE DE CIMENTO ASFÁLTICO DE PETRÓLEO TIPO CAP 50-70, INCLUINDO CUSTO TOTAL DO TRANSPORTE (COMBUSTÍVEL, PEDÁGIOS, ETC.) E ICMS - MEMÓRIA ANEXA","T",1,754.76506493506497,{"$f":"ROUNDDOWN(F88*G88,2)","v":754.76}]
[null,"PRODUÇÃO DA EQUIPE",null,null,1,"CUSTO ",null,{"$f":"SUM(H88:H88)","v":754.76}]
[null,"TOTAL",{"$nulls":5},{"$f":"H89/E89","v":754.76}]
[null,"BDI                %",{"$nulls":5},{"$f":"1+$M$2","v":1.1499999999999999}]
[null,"TOTAL DO SERVIÇO - R$",{"$nulls":5},{"$f":"ROUND(H90*H91,2)","v":867.97}]

{"sheet":"BDI SERV","index":4,"n_rows":62,"n_cols":5,"rows_kept":62,"cut":false,"hidden":false,"merged":[[41,2,41,3],[2,1,4,4],[37,0,37,5],[38,0,38,5],[27,1,27,3],[28,1,28,2],[28,3,28,4],[29,3,29,4],[40,1,40,4]]}
[]
[]
[null,"DETALHAMENTO DO BDI - SERVIÇOS"]
[]
[]
[null,"Item","Descrição dos Serviços","% - PV","% - CD"]
[]
[null,1,"ADMINISTRAÇÃO CENTRAL"," ",{"$f":"SUM(E9:E11)","v":4.01}]
[null,"1.1","ESCRITÓRIO CENTRAL",null,4.01]
[null,"1.2","VIAGENS"]
[null,"1.3","OUTROS"]
[null," "," "," "," "]
[null,2,"IMPOSTOS E TAXAS",{"$f":"SUM(D14:D17)","v":6.65},{"$f":"SUM(E14:E17)","v":0}]
[null,"2.1","ISS - Proposta",{"$f":"D36*100","v":3}]
[null,"2.2","PIS",0.65]
[null,"2.3","Cofins",3]
[null,"2.4","Contribuição Previdenciaria (CPRB)"]
[]
[null,3,"TAXA DE RISCO",null,{"$f":"SUM(E20:E22)","v":0.96}]
[null,"3.1","SEGURO",null,0.2]
[null,"3.2","RISCO",null,0.56000000000000005]
[null,"3.3","GARANTIA",null,0.2]
[]
[null,4,"DESPESAS FINANCEIRAS",null,1.1100000000000001]
[]
[null,5,"LUCRO",null,7.3]
[]
[null,"BDI APRESENTADO:",null,null,{"$f":"IF($D$43=$C$45,$D$45,IF($D$43=$C$46,$D$46,IF($D$43=$C$46,$D$46,IF($D$43=$C$47,$D$47,0))))","v":22}]
[]
[null,null,"Legislação Municipal:"," Decreto nº 08, de 17 de março de 2023"]
[null,null,"Município:","São João da Ponte"]
[null,null,"Alíquota ISSQN:",0.05,"Município"]
[null,null,"Base de Cálculo:","Dedução - Material"]
[null,null,"Valor Serviço Sem BDI:",3949381.4550000001]
[null,null,"Dedução - Material (estimativa):",{"$f":"0.4*D34","v":1579752.5820000002},{"$f":"D35/D34","v":0.4}]
[null,null,"ISSQN BDI:",{"$f":"IF(D34=\"\",0,ROUND(IF(D33=D51,((1-(D35/D34))*D32),D32*D33),4))","v":0.03},"(*)"]
[]
["Acórdão nº 2.622/2013 - TCU Plenário"]
["BDI = ARRED((((((1+(AC+TR)/100)*(1+DF/100)*(1+L/100))/(1-IMP/100))-1)*100);2)"]
[]
[null,"(*) É obrigação da licitante a verificação da Legislação Tributária vigente no município, bem como o cálculo dos valores totais de serviços e materiais estimados, para apresentação de sua proposta."]
[]
[null,null,"Forma de Cálculo do BDI:","BDI - Acórdão nº 2.622/2013 - TCU"]
[]
[null,null,"BDI - Digitado",{"$f":"ROUND(E8+E13+E19+E24+E26,2)","v":13.38}]
[null,null,"BDI - Calculado",{"$f":"ROUND((((1+(E8/100+E24/100+E19/100))/(1-(D13/100+E26/100)))-1)*100,2)","v":23.28}]
[null,null,"BDI - Acórdão nº 2.622/2013 - TCU",{"$f":"ROUND((((((1+(E8+E19)/100)*(1+E24/100)*(1+E26/100))/(1-D13/100))-1)*100),2)","v":22}]
[]
[]
[]
[null,null,null,"Dedução - Material","Município"]
[null,null,null,0.1,"Simples Nacional"]
[null,null,null,0.2,"Municípios Indefinidos"]
[null,null,null,0.3]
[null,null,null,0.4]
[null,null,null,0.5]
[null,null,null,0.6]
[null,null,null,0.7]
[null,null,null,0.8]
[null,null,null,0.9]
[null,null,null,1]
[null,null,null,{"$f":"E33","v":0}]

{"sheet":"BDI FORN","index":5,"n_rows":37,"n_cols":5,"rows_kept":37,"cut":false,"hidden":false,"merged":[[31,1,31,2],[32,0,34,5],[36,0,36,5],[0,1,2,4],[3,1,4,1],[3,2,4,2],[28,0,28,5],[30,1,30,2]]}
[null,"DETALHAMENTO DO BDI - FORNECIMENTO \n(MATERIAL ASFÁLTICO)"]
[]
[]
[null,"Item","Descrição dos Serviços","%","%"]
[null,null,null,"PV","CD"]
[]
[null,1,"ADMINISTRAÇÃO CENTRAL"," ",3.45]
[null,"1.1","ESCRITÓRIO CENTRAL"," "," "]
[null,"1.2","VIAGENS"," "," "]
[null,"1.3","OUTROS"," "," "]
[null," "," "," "," "]
[null,2,"IMPOSTOS E TAXAS",{"$f":"SUM(D13:D16)","v":3.65},{"$f":"SUM(E13:E16)","v":4.5600000000000005}]
[null,"2.1","ISS (*)",null,{"$f":"ROUND(D13*1.2515,2)","v":0}]
[null,"2.2","PIS",0.65,{"$f":"ROUND(D14*1.2515,2)","v":0.81}]
[null,"2.3","Cofins",3,{"$f":"ROUND(D15*1.2515,2)","v":3.75}]
[null,"2.4","CONTRIBUIÇÃO PREVIDENCIÁRIA SOBRE A RENDA BRUTA",0,{"$f":"ROUND(D16*1.2515,2)","v":0}]
[]
[null,3,"TAXA DE RISCO"," ",{"$f":"SUM(E19:E22)","v":1.08}]
[null,"3.1","SEGURO",null,0.24]
[null,"3.2","RISCO",null,0.6]
[null,"3.3","GARANTIA",null,0.24]
[]
[null,4,"DESPESAS FINANCEIRAS"," ",0.85]
[]
[null,5,"LUCRO",null,5.1100000000000003]
[]
[null," ","BDI - CALCULADO"," ",{"$f":"ROUND((((1+(E7+E18)/100)*(1+E23/100)*(1+E25/100)/(1-D12/100)-1)*100),2)","v":15}]
[]
["BDI = ((1+((AC+S+R+G)/100))x(1+DF/100)x(1+L/100)/(1-I/100)-1)*100"]
[]
[null,"BDI (CALCULADO):",null,{"$f":"ROUND((((1+((E7+E18)/100))*(1+E23/100)*(1+E25/100))/(1-D12/100)-1)*100,2)","v":15},"%"]
[null," "]
[]
[]
[]
[]
["BDI EM CONFORMIDADE COM OS ACÓRDÃOS Nº 2369/2011 e ACÓRDÃO Nº 2.622/2013 - TCU - PLENÁRIO"]

{"sheet":"CRONOGRAMA","index":6,"n_rows":21,"n_cols":14,"rows_kept":21,"cut":false,"hidden":false,"merged":[[17,1,18,2],[20,1,24,13],[13,0,14,0],[13,1,14,1],[13,2,14,2],[15,0,16,0],[15,1,16,1],[15,2,16,2],[9,0,10,0],[9,1,10,1],[9,2,10,2],[11,0,12,0],[11,1,12,1],[11,2,12,2],[3,1,3,12],[5,0,6,0],[5,1,6,1],[5,2,6,2],[7,0,8,0],[7,1,8,1],[7,2,8,2],[0,1,0,13],[1,1,2,1],[1,2,2,4],[1,6,1,13],[2,6,2,13]]}
[null,"CRONOGRAMA FÍSICO-FINANCEIRO"]
[null,"OBRA: ",{"$f":"ORÇAMENTO!C5","v":" PAVIMENTAÇÃO ASFÁLTICA EM CBUQ - ESTRADA PARA SANTO ANTÔNIO DA BOA VISTA (SÃO JOÃO DA PONTE / MG)"},null,null,"VALOR:",{"$f":"ORÇAMENTO!L66","v":6916869.1399999997}]
[{"$nulls":5},"PRAZO: ","240 DIAS "]
[]
[null,"ITEM","ETAPAS/DESCRIÇAO","FISICO/  FINANCEIRO","TOTAL    ETAPAS","MÊS 1","MÊS 2","MÊS 3","MÊS 4","MÊS 5","MÊS 6","MÊS 7","MÊS 8","TOTAL"]
["A",{"$f":"VLOOKUP(A6,ORÇAMENTO!$A$10:$L$66,2)","v":1},{"$f":"VLOOKUP(A6,ORÇAMENTO!$A$10:$L$66,5)","v":"SERVIÇOS PRELIMINARES "},"FISICO ",{"$f":"ROUND(E7/$G$2,4)","v":6.2700000000000006E-2},0.2,0.1,0.1,0.1,0.1,0.1,0.1,0.2,{"$f":"SUM(F6:M6)","v":1}]
[null,null,null,"FINANCEIRO",{"$f":"ORÇAMENTO!L10","v":433708.52999999997},{"$f":"ROUND($E$7*F6,2)","v":86741.71},{"$f":"ROUND($E$7*G6,2)","v":43370.85},{"$f":"ROUND($E$7*H6,2)","v":43370.85},{"$f":"ROUND($E$7*I6,2)","v":43370.85},43370.85,43370.85,43370.85,86741.71,433708.52]
["B",{"$f":"VLOOKUP(A8,ORÇAMENTO!$A$10:$L$66,2)","v":2},{"$f":"VLOOKUP(A8,ORÇAMENTO!$A$10:$L$66,5)","v":"TERRAPLANAGEM E PAVIMENTAÇÃO"},"FISICO ",{"$f":"ROUND(E9/$G$2,4)","v":0.41},0.1,0.2,0.2,0.2,0.2,0.1,null,null,0.99999999999999989]
[null,null,null,"FINANCEIRO",{"$f":"ORÇAMENTO!L17","v":2835730},{"$f":"ROUND($E$9*F8,2)","v":283573},{"$f":"ROUND($E$9*G8,2)","v":567146},{"$f":"ROUND($E$9*H8,2)","v":567146},{"$f":"ROUND($E$9*I8,2)","v":567146},567146,283573,0,0,2835730]
["C",{"$f":"VLOOKUP(A10,ORÇAMENTO!$A$10:$L$66,2)","v":3},{"$f":"VLOOKUP(A10,ORÇAMENTO!$A$10:$L$66,5)","v":"TRANSPORTE DE MATERIAIS"},"FISICO ",{"$f":"ROUND(E11/$G$2,4)","v":8.6900000000000005E-2},0.15,0.2,0.2,0.2,0.15,0.1,null,null,1]
[null,null,null,"FINANCEIRO",{"$f":"ORÇAMENTO!L26","v":600840},{"$f":"ROUND($E$11*F10,2)","v":90126},{"$f":"ROUND($E$11*G10,2)","v":120168},{"$f":"ROUND($E$11*H10,2)","v":120168},{"$f":"ROUND($E$11*I10,2)","v":120168},90126,60084,0,0,600840]
["D",{"$f":"VLOOKUP(A12,ORÇAMENTO!$A$10:$L$66,2)","v":4},{"$f":"VLOOKUP(A12,ORÇAMENTO!$A$10:$L$66,5)","v":"TRANSPORTE DE MATERIAL ASFÁLTICO (BDI DIFERENCIADO)"},"FISICO ",{"$f":"ROUND(E13/$G$2,4)","v":7.0000000000000007E-2},null,0.1,0.2,0.2,0.2,0.2,0.1,null,0.99999999999999989]
[null,null,null,"FINANCEIRO",{"$f":"ORÇAMENTO!L29","v":484215},{"$f":"ROUND($E$13*F12,2)","v":0},{"$f":"ROUND($E$13*G12,2)","v":48421.5},{"$f":"ROUND($E$13*H12,2)","v":96843},{"$f":"ROUND($E$13*I12,2)","v":96843},96843,96843,48421.5,0,484215]
["E",{"$f":"VLOOKUP(A14,ORÇAMENTO!$A$10:$L$66,2)","v":5},{"$f":"VLOOKUP(A14,ORÇAMENTO!$A$10:$L$66,5)","v":"DRENAGEM E OBRAS COMPLEMENTARES"},"FISICO ",{"$f":"ROUND(E15/$G$2,4)","v":0.13639999999999999},0.2,0.2,0.1,0.1,0.1,0.1,0.1,0.1,0.99999999999999989]
[null,null,null,"FINANCEIRO",{"$f":"ORÇAMENTO!L32","v":943328.28},{"$f":"ROUND($E$15*F14,2)","v":188665.66},{"$f":"ROUND($E$15*G14,2)","v":188665.66},{"$f":"ROUND($E$15*H14,2)","v":94332.83},{"$f":"ROUND($E$15*I14,2)","v":94332.83},94332.83,94332.83,94332.83,94332.83,943328.29999999981]
["F",{"$f":"VLOOKUP(A16,ORÇAMENTO!$A$10:$L$66,2)","v":6},{"$f":"VLOOKUP(A16,ORÇAMENTO!$A$10:$L$66,5)","v":"FORNECIMENTOS - MATERIAL ASFÁLTICO (BDI DIFERENCIADO)"},"FISICO ",{"$f":"ROUND(E17/$G$2,4)","v":0.2341},null,0.1,0.2,0.2,0.2,0.2,0.1,null,0.99999999999999989]
[null,null,null,"FINANCEIRO",{"$f":"ORÇAMENTO!L59","v":1619047.33},{"$f":"ROUND($E$17*F16,2)","v":0},161904.73000000001,323809.46999999997,323809.46999999997,323809.46999999997,323809.46999999997,161904.73000000001,0,1619047.3399999999]
[null,"TOTAL",null,"FISICO ",{"$f":"SUM(F18:M18)","v":1.0000000028914815},{"$f":"F19/$E$19","v":9.3843956978489268E-2},{"$f":"G19/$E$19","v":0.16332197662481729},{"$f":"H19/$E$19","v":0.18009161728914824},{"$f":"I19/$E$19","v":0.18009161728914824},0.17574832274476138,0.13040772230078651,5.0316104433341939E-2,2.6178685230988773E-2,1.0000000028914815]
[null,null,null,"FINANCEIRO",{"$f":"E11+E9+E7+E13+E17+E15","v":6916869.1399999997},649106.37,1129676.74,1245670.1499999999,{"$f":"I11+I9+I7+I13+I17+I15","v":1245670.1499999999},{"$f":"J11+J9+J7+J13+J17+J15","v":1215628.1499999999},{"$f":"K11+K9+K7+K13+K17+K15","v":902013.14999999991},348029.91000000003,181074.54,{"$f":"SUM(F19:M19) - 0.02","v":6916869.1400000015}]
[]
[null,"OBSERVAÇÕES:"]