{"text_format":"2","workbook":"xlsx","n_sheets":7,"sheets":["ORÇAMENTO","CPU-SERV","AUX.-VEIC.","CPU-FORNEC","BDI SERV","BDI FORN","CRONOGRAMA"],"not_rendered":{"charts":0,"images":3,"macros":0,"external_links":1,"defined_names":10,"comments":2,"pivot_tables":0},"unopened":[],"bounds":{"document_bytes":16777216,"sheet_cells":100000,"run_cost":"one","rows_first":2000,"rows_last":500,"rows_between":2000,"halvings":0,"cell_chars":16384,"cell_head_chars":4096},"cells_cut":0,"cells_raw":0,"read":"whole","date_system":"1900"}

{"sheet":"ORÇAMENTO","index":0,"n_rows":66,"n_cols":12,"rows_kept":66,"cut":false,"hidden":false,"merged":[[31,15,31,16],[58,15,58,16],[6,8,6,10],[7,1,7,11],[16,15,16,16],[25,15,25,16],[28,15,28,16],[9,15,9,16],[7,13,9,13],[65,1,65,4],[0,0,8,0],[0,4,0,11],[1,4,1,11],[2,4,2,11],[6,1,6,4],[4,2,4,7],[5,2,5,7],[4,8,4,10],[5,8,5,10]]}
["<---- NUMERAR SERVIÇOS PARA CPU",null,null,null,"Ministério do Desenvolvimento Regional"]
[{"$nulls":4},"Companhia de Desenvolvimento dos Vales do São Francisco e do Parnaíba"]
[{"$nulls":4},"1ª Superintendência Regional"]
[]
[null,"OBRA: "," PAVIMENTAÇÃO ASFÁLTICA EM CBUQ - ESTRADA PARA SANTO ANTÔNIO DA BOA VISTA (SÃO JOÃO DA PONTE / MG)",{"$nulls":5},"BDI Serviços (%):",null,null,{"$f":"'BDI SERV'!E28","v":22}]
[null,"DATA:"," AGOSTO / 2025",{"$nulls":5},"BDI Diferenciado Serviços (%):",null,null,{"$f":"'BDI FORN'!D31","v":15}]
[null," PRAZO DE EXECUÇÃO:     240 DIAS",{"$nulls":6},"BDI Fornecimentos (%):",null,null,{"$f":"'BDI FORN'!D31","v":15}]
[null,"PLANILHA DE ORÇAMENTAÇÃO"]
[null,"ITEM","CÓDIGO","FONTE","DISCRIMINAÇÃO","TIPO","UNID.","QUANT.","VR.UNIT.S/BDI","PR. UNIT.C/BDI","C. TOT.S/BDI","P. TOT.C/BDI"]
["A",1,null,null,"SERVIÇOS PRELIMINARES ",{"$nulls":5},{"$f":"SUM(K11:K16)","v":355728.34},{"$f":"SUM(L11:L16)","v":433708.52999999997}]
{"$rows_left_out":57}
{"sheet":"CPU-SERV","index":1,"n_rows":1838,"n_cols":16,"rows_kept":1838,"cut":false,"hidden":false,"merged":[[1025,11,1027,13],[163,0,208,0],[164,2,164,9],[165,1,166,3],[165,4,165,5],[166,4,166,5],[167,2,167,7],[167,8,167,9],[168,1,169,2],[168,3,169,3],[168,4,168,5],[168,6,168,7],[173,7,173,9],[176,3,176,7],[177,3,177,7],[178,3,178,7],[181,7,181,9],[184,3,184,7],[185,7,185,9],[196,3,196,7],[198,8,198,9],[201,3,201,7],[202,1,203,2],[202,3,203,3],[202,4,203,4],[202,5,202,7],[202,9,203,9],[206,3,206,7],[207,5,207,7],[255,8,255,9],[256,1,257,2],[256,3,257,3],[7,13,7,15],[15,11,15,13],[39,0,81,0],[40,2,40,9],[22,7,22,9],[25,3,25,7],[2,10,2,11],[27,8,27,9],[21,3,21,7],[4,2,4,7],[4,8,4,9],[5,1,6,2],[5,3,6,3],[5,4,5,5],[5,6,5,7],[573,0,625,0],[574,2,574,9],[575,1,576,3],[575,4,575,5],[576,4,576,5],[577,2,577,7],[577,8,577,9],[578,1,579,2],[578,3,579,3],[578,4,578,5],[578,6,578,7],[586,7,586,9],[588,3,588,7],[589,3,589,7],[590,3,590,7],[593,7,593,9],[602,3,602,7],[44,3,45,3],[44,4,44,5],[44,6,44,7],[49,7,49,9],[55,3,55,7],[56,3,56,7],[41,1,42,3],[41,4,41,5],[42,4,42,5],[43,2,43,7],[43,8,43,9],[44,1,45,2],[0,0,37,0],[3,4,3,5],[0,11,0,12],[1,11,1,12],[2,4,2,5],[1,2,1,9],[2,1,3,3],[31,3,32,3],[31,4,32,4],[31,5,31,7],[31,9,32,9],[35,3,35,7],[36,5,36,7],[10,7,10,9],[13,3,13,7],[14,3,14,7],[15,3,15,7],[18,7,18,9],[30,3,30,7],[31,1,32,2],[97,3,97,7],[88,3,89,3],[88,4,88,5],[88,6,88,7],[79,3,79,7],[80,5,80,7],[85,4,85,5],[74,3,74,7],[75,1,76,2],[75,3,76,3],[75,4,76,4],[75,5,75,7],[75,9,76,9],[57,3,57,7],[60,7,60,9],[63,3,63,7],[64,7,64,9],[69,3,69,7],[71,8,71,9],[119,5,119,7],[122,0,161,0],[123,2,123,9],[124,1,125,3],[124,4,124,5],[125,4,125,5],[126,2,126,7],[126,8,126,9],[159,3,159,7],[160,5,160,7],[114,1,115,2],[114,3,115,3],[114,4,115,4],[114,5,114,7],[114,9,115,9],[118,3,118,7],[93,7,93,9],[98,3,98,7],[101,7,101,9],[104,3,104,7],[105,7,105,9],[108,3,108,7],[83,0,120,0],[84,2,84,9],[85,1,86,3],[86,4,86,5],[87,2,87,7],[87,8,87,9],[88,1,89,2],[110,8,110,9],[113,3,113,7],[96,3,96,7],[136,3,136,7],[137,3,137,7],[140,7,140,9],[145,3,145,7],[146,7,146,9],[149,3,149,7],[127,1,128,2],[127,3,128,3],[127,4,127,5],[127,6,127,7],[132,7,132,9],[135,3,135,7],[210,0,249,0],[211,2,211,9],[212,1,213,3],[212,4,212,5],[213,4,213,5],[214,2,214,7],[247,3,247,7],[248,5,248,7],[151,8,151,9],[154,3,154,7],[155,1,156,2],[155,3,156,3],[155,4,156,4],[155,5,155,7],[155,9,156,9],[242,3,242,7],[243,1,244,2],[243,3,244,3],[243,4,244,4],[243,5,243,7],[256,4,256,5],[225,3,225,7],[226,3,226,7],[227,3,227,7],[230,7,230,9],[233,3,233,7],[234,7,234,9],[214,8,214,9],[215,1,216,2],[215,3,216,3],[215,4,215,5],[215,6,215,7],[220,7,220,9],[290,0,327,0],[291,2,291,9],[292,1,293,3],[292,4,292,5],[293,4,293,5],[294,2,294,7],[325,3,325,7],[326,5,326,7],[251,0,288,0],[252,2,252,9],[253,1,254,3],[253,4,253,5],[254,4,254,5],[255,2,255,7],[237,3,237,7],[239,8,239,9],[243,9,244,9],[276,3,276,7],[278,8,278,9],[281,3,281,7],[282,1,283,2],[282,3,283,3],[282,4,283,4],[282,5,282,7],[282,9,283,9],[264,3,264,7],[265,3,265,7],[333,8,333,9],[334,1,335,2],[334,3,335,3],[334,4,334,5],[256,6,256,7],[261,7,261,9],[303,3,303,7],[304,3,304,7],[305,3,305,7],[308,7,308,9],[311,3,311,7],[312,7,312,9],[294,8,294,9],[295,1,296,2],[295,3,296,3],[295,4,295,5],[295,6,295,7],[300,7,300,9],[286,3,286,7],[287,5,287,7],[266,3,266,7],[269,7,269,9],[272,3,272,7],[273,7,273,9],[371,0,412,0],[372,2,372,9],[373,1,374,3],[373,4,373,5],[374,4,374,5],[375,2,375,7],[410,3,410,7],[411,5,411,7],[329,0,369,0],[330,2,330,9],[331,1,332,3],[331,4,331,5],[332,4,332,5],[333,2,333,7],[315,3,315,7],[317,8,317,9],[320,3,320,7],[321,1,322,2],[321,3,322,3],[321,4,322,4],[321,5,321,7],[321,9,322,9],[357,3,357,7],[359,8,359,9],[362,3,362,7],[363,1,364,2],[363,3,364,3],[363,4,364,4],[363,5,363,7],[363,9,364,9],[345,3,345,7],[346,3,346,7],[418,8,418,9],[419,1,420,2],[419,3,420,3],[419,4,419,5],[334,6,334,7],[342,7,342,9],[388,3,388,7],[389,3,389,7],[390,3,390,7],[393,7,393,9],[396,3,396,7],[397,7,397,9],[375,8,375,9],[376,1,377,2],[376,3,377,3],[376,4,376,5],[376,6,376,7],[385,7,385,9],[367,3,367,7],[368,5,368,7],[347,3,347,7],[350,7,350,9],[353,3,353,7],[354,7,354,9],[455,0,492,0],[456,2,456,9],[457,1,458,3],[457,4,457,5],[458,4,458,5],[459,2,459,7],[490,3,490,7],[491,5,491,7],[474,7,474,8],[414,0,453,0],[415,2,415,9],[416,1,417,3],[416,4,416,5],[417,4,417,5],[418,2,418,7],[400,3,400,7],[402,8,402,9],[405,3,405,7],[406,1,407,2],[406,3,407,3],[406,4,407,4],[406,5,406,7],[406,9,407,9],[441,3,441,7],[443,8,443,9],[446,3,446,7],[447,1,448,2],[447,3,448,3],[447,4,448,4],[447,5,447,7],[447,9,448,9],[429,3,429,7],[507,3,507,7],[498,8,498,9],[499,1,500,2],[499,3,500,3],[499,4,499,5],[419,6,419,7],[426,7,426,9],[468,3,468,7],[469,3,469,7],[470,3,470,7],[473,7,473,9],[476,3,476,7],[477,7,477,9],[459,8,459,9],[460,1,461,2],[460,3,461,3],[460,4,460,5],[460,6,460,7],[465,7,465,9],[451,3,451,7],[452,5,452,7],[430,3,430,7],[431,3,431,7],[434,7,434,9],[437,3,437,7],[438,7,438,9],[559,3,559,7],[533,0,571,0],[534,2,534,9],[535,1,536,3],[535,4,535,5],[536,4,536,5],[537,2,537,7],[569,3,569,7],[570,5,570,7],[513,7,513,8],[494,0,531,0],[495,2,495,9],[496,1,497,3],[496,4,496,5],[497,4,497,5],[498,2,498,7],[480,3,480,7],[482,8,482,9],[485,3,485,7],[486,1,487,2],[486,3,487,3],[486,4,487,4],[486,5,486,7],[486,9,487,9],[519,3,519,7],[521,8,521,9],[524,3,524,7],[525,1,526,2],[525,3,526,3],[525,4,526,4],[525,5,525,7],[525,9,526,9],[598,7,598,8],[624,5,624,7],[652,3,652,7],[654,8,654,9],[657,3,657,7],[658,1,659,2],[658,3,659,3],[658,4,659,4],[658,5,658,7],[658,9,659,9],[499,6,499,7],[504,7,504,9],[547,3,547,7],[548,3,548,7],[549,3,549,7],[552,7,552,9],[555,3,555,7],[556,7,556,9],[537,8,537,9],[538,1,539,2],[538,3,539,3],[538,4,538,5],[538,6,538,7],[544,7,544,9],[529,3,529,7],[530,5,530,7],[508,3,508,7],[509,3,509,7],[512,7,512,9],[515,3,515,7],[516,7,516,9],[603,7,603,9],[645,7,645,9],[648,3,648,7],[649,7,649,9],[631,8,631,9],[632,1,633,2],[632,3,633,3],[632,4,632,5],[632,6,632,7],[637,7,637,9],[679,3,679,7],[680,3,680,7],[681,3,681,7],[684,7,684,9],[687,3,687,7],[631,2,631,7],[561,8,561,9],[564,3,564,7],[565,1,566,2],[565,3,566,3],[565,4,566,4],[565,5,565,7],[565,9,566,9],[615,1,616,2],[615,3,616,3],[615,4,616,4],[615,5,615,7],[615,9,616,9],[623,3,623,7],[605,3,605,7],[607,8,607,9],[614,3,614,7],[640,3,640,7],[688,7,688,9],[670,8,670,9],[671,1,672,2],[671,3,672,3],[671,4,671,5],[671,6,671,7],[676,7,676,9],[662,3,662,7],[663,5,663,7],[666,0,703,0],[667,2,667,9],[668,1,669,3],[668,4,668,5],[669,4,669,5],[670,2,670,7],[701,3,701,7],[702,5,702,7],[627,0,664,0],[628,2,628,9],[629,1,630,3],[629,4,629,5],[630,4,630,5],[691,3,691,7],[693,8,693,9],[696,3,696,7],[697,1,698,2],[697,3,698,3],[697,4,698,4],[697,5,697,7],[697,9,698,9],[641,3,641,7],[642,3,642,7],[730,3,730,7],[732,8,732,9],[735,3,735,7],[736,1,737,2],[736,3,737,3],[736,4,737,4],[736,5,736,7],[736,9,737,9],[718,3,718,7],[719,3,719,7],[720,3,720,7],[723,7,723,9],[726,3,726,7],[727,7,727,9],[709,8,709,9],[710,1,711,2],[710,3,711,3],[710,4,710,5],[710,6,710,7],[715,7,715,9],[757,3,757,7],[758,3,758,7],[759,3,759,7],[762,7,762,9],[765,3,765,7],[766,7,766,9],[748,8,748,9],[749,1,750,2],[749,3,750,3],[749,4,749,5],[749,6,749,7],[754,7,754,9],[740,3,740,7],[741,5,741,7],[744,0,781,0],[745,2,745,9],[746,1,747,3],[746,4,746,5],[747,4,747,5],[748,2,748,7],[779,3,779,7],[780,5,780,7],[705,0,742,0],[706,2,706,9],[707,1,708,3],[707,4,707,5],[708,4,708,5],[709,2,709,7],[769,3,769,7],[771,8,771,9],[774,3,774,7],[775,1,776,2],[775,3,776,3],[775,4,776,4],[775,5,775,7],[775,9,776,9],[808,3,808,7],[810,8,810,9],[813,3,813,7],[814,1,815,2],[814,3,815,3],[814,4,815,4],[814,5,814,7],[814,9,815,9],[796,3,796,7],[797,3,797,7],[798,3,798,7],[801,7,801,9],[804,3,804,7],[805,7,805,9],[787,8,787,9],[788,1,789,2],[788,3,789,3],[788,4,788,5],[788,6,788,7],[793,7,793,9],[835,3,835,7],[836,3,836,7],[837,3,837,7],[840,7,840,9],[843,3,843,7],[844,7,844,9],[826,8,826,9],[827,1,828,2],[827,3,828,3],[827,4,827,5],[827,6,827,7],[832,7,832,9],[818,3,818,7],[819,5,819,7],[822,0,859,0],[823,2,823,9],[824,1,825,3],[824,4,824,5],[825,4,825,5],[826,2,826,7],[857,3,857,7],[858,5,858,7],[783,0,820,0],[784,2,784,9],[785,1,786,3],[785,4,785,5],[786,4,786,5],[787,2,787,7],[847,3,847,7],[849,8,849,9],[852,3,852,7],[853,1,854,2],[853,3,854,3],[853,4,854,4],[853,5,853,7],[853,9,854,9],[889,3,889,7],[891,8,891,9],[894,3,894,7],[895,1,896,2],[895,3,896,3],[895,4,896,4],[895,5,895,7],[895,9,896,9],[874,3,874,7],[875,3,875,7],[876,3,876,7],[879,7,879,9],[882,3,882,7],[883,7,883,9],[865,8,865,9],[866,1,867,2],[866,3,867,3],[866,4,866,5],[866,6,866,7],[871,7,871,9],[916,3,916,7],[917,3,917,7],[918,3,918,7],[921,7,921,9],[924,3,924,7],[925,7,925,9],[907,8,907,9],[908,1,909,2],[908,3,909,3],[908,4,908,5],[908,6,908,7],[913,7,913,9],[899,3,899,7],[900,5,900,7],[903,0,940,0],[904,2,904,9],[905,1,906,3],[905,4,905,5],[906,4,906,5],[907,2,907,7],[938,3,938,7],[939,5,939,7],[861,0,901,0],[862,2,862,9],[863,1,864,3],[863,4,863,5],[864,4,864,5],[865,2,865,7],[928,3,928,7],[930,8,930,9],[933,3,933,7],[934,1,935,2],[934,3,935,3],[934,4,935,4],[934,5,934,7],[934,9,935,9],[970,3,970,7],[972,8,972,9],[975,3,975,7],[976,1,977,2],[976,3,977,3],[976,4,977,4],[976,5,976,7],[976,9,977,9],[955,3,955,7],[956,3,956,7],[957,3,957,7],[960,7,960,9],[963,3,963,7],[964,7,964,9],[946,8,946,9],[947,1,948,2],[947,3,948,3],[947,4,947,5],[947,6,947,7],[952,7,952,9],[997,3,997,7],[998,3,998,7],[999,3,999,7],[1002,7,1002,9],[1005,3,1005,7],[1006,7,1006,9],[988,8,988,9],[989,1,990,2],[989,3,990,3],[989,4,989,5],[989,6,989,7],[994,7,994,9],[980,3,980,7],[981,5,981,7],[984,0,1023,0],[985,2,985,9],[986,1,987,3],[986,4,986,5],[987,4,987,5],[988,2,988,7],[1021,3,1021,7],[1022,5,1022,7],[942,0,982,0],[943,2,943,9],[944,1,945,3],[944,4,944,5],[945,4,945,5],[946,2,946,7],[1011,3,1011,7],[1013,8,1013,9],[1016,3,1016,7],[1017,1,1018,2],[1017,3,1018,3],[1017,4,1018,4],[1017,5,1017,7],[1017,9,1018,9],[1054,3,1054,7],[1056,8,1056,9],[1059,3,1059,7],[1060,1,1061,2],[1060,3,1061,3],[1060,4,1061,4],[1060,5,1060,7],[1060,9,1061,9],[1038,3,1038,7],[1039,3,1039,7],[1040,3,1040,7],[1043,7,1043,9],[1046,3,1046,7],[1047,7,1047,9],[1029,8,1029,9],[1030,1,1031,2],[1030,3,1031,3],[1030,4,1030,5],[1030,6,1030,7],[1035,7,1035,9],[1081,3,1081,7],[1082,3,1082,7],[1083,3,1083,7],[1086,7,1086,9],[1089,3,1089,7],[1090,7,1090,9],[1072,8,1072,9],[1073,1,1074,2],[1073,3,1074,3],[1073,4,1073,5],[1073,6,1073,7],[1078,7,1078,9],[1064,3,1064,7],[1065,5,1065,7],[1068,0,1105,0],[1069,2,1069,9],[1070,1,1071,3],[1070,4,1070,5],[1071,4,1071,5],[1072,2,1072,7],[1103,3,1103,7],[1104,5,1104,7],[1025,0,1066,0],[1026,2,1026,9],[1027,1,1028,3],[1027,4,1027,5],[1028,4,1028,5],[1029,2,1029,7],[1093,3,1093,7],[1095,8,1095,9],[1098,3,1098,7],[1099,1,1100,2],[1099,3,1100,3],[1099,4,1100,4],[1099,5,1099,7],[1099,9,1100,9],[1133,3,1133,7],[1135,8,1135,9],[1138,3,1138,7],[1139,1,1140,2],[1139,3,1140,3],[1139,4,1140,4],[1139,5,1139,7],[1139,9,1140,9],[1120,3,1120,7],[1121,3,1121,7],[1122,3,1122,7],[1125,7,1125,9],[1128,3,1128,7],[1129,7,1129,9],[1111,8,1111,9],[1112,1,1113,2],[1112,3,1113,3],[1112,4,1112,5],[1112,6,1112,7],[1117,7,1117,9],[1160,3,1160,7],[1161,3,1161,7],[1162,3,1162,7],[1165,7,1165,9],[1168,3,1168,7],[1169,7,1169,9],[1151,8,1151,9],[1152,1,1153,2],[1152,3,1153,3],[1152,4,1152,5],[1152,6,1152,7],[1157,7,1157,9],[1143,3,1143,7],[1144,5,1144,7],[1147,0,1184,0],[1148,2,1148,9],[1149,1,1150,3],[1149,4,1149,5],[1150,4,1150,5],[1151,2,1151,7],[1182,3,1182,7],[1183,5,1183,7],[1107,0,1145,0],[1108,2,1108,9],[1109,1,1110,3],[1109,4,1109,5],[1110,4,1110,5],[1111,2,1111,7],[1172,3,1172,7],[1174,8,1174,9],[1177,3,1177,7],[1178,1,1179,2],[1178,3,1179,3],[1178,4,1179,4],[1178,5,1178,7],[1178,9,1179,9],[1212,3,1212,7],[1214,8,1214,9],[1217,3,1217,7],[1218,1,1219,2],[1218,3,1219,3],[1218,4,1219,4],[1218,5,1218,7],[1218,9,1219,9],[1199,3,1199,7],[1200,3,1200,7],[1201,3,1201,7],[1204,7,1204,9],[1207,3,1207,7],[1208,7,1208,9],[1190,8,1190,9],[1191,1,1192,2],[1191,3,1192,3],[1191,4,1191,5],[1191,6,1191,7],[1196,7,1196,9],[1239,3,1239,7],[1240,3,1240,7],[1241,3,1241,7],[1244,7,1244,9],[1247,3,1247,7],[1248,7,1248,9],[1230,8,1230,9],[1231,1,1232,2],[1231,3,1232,3],[1231,4,1231,5],[1231,6,1231,7],[1236,7,1236,9],[1222,3,1222,7],[1223,5,1223,7],[1226,0,1264,0],[1227,2,1227,9],[1228,1,1229,3],[1228,4,1228,5],[1229,4,1229,5],[1230,2,1230,7],[1262,3,1262,7],[1263,5,1263,7],[1186,0,1224,0],[1187,2,1187,9],[1188,1,1189,3],[1188,4,1188,5],[1189,4,1189,5],[1190,2,1190,7],[1252,3,1252,7],[1254,8,1254,9],[1257,3,1257,7],[1258,1,1259,2],[1258,3,1259,3],[1258,4,1259,4],[1258,5,1258,7],[1258,9,1259,9],[1295,3,1295,7],[1297,8,1297,9],[1300,3,1300,7],[1301,1,1302,2],[1301,3,1302,3],[1301,4,1302,4],[1301,5,1301,7],[1301,9,1302,9],[1279,3,1279,7],[1280,3,1280,7],[1281,3,1281,7],[1284,7,1284,9],[1287,3,1287,7],[1288,7,1288,9],[1270,8,1270,9],[1271,1,1272,2],[1271,3,1272,3],[1271,4,1271,5],[1271,6,1271,7],[1276,7,1276,9],[1322,3,1322,7],[1323,3,1323,7],[1324,3,1324,7],[1327,7,1327,9],[1330,3,1330,7],[1331,7,1331,9],[1313,8,1313,9],[1314,1,1315,2],[1314,3,1315,3],[1314,4,1314,5],[1314,6,1314,7],[1319,7,1319,9],[1305,3,1305,7],[1306,5,1306,7],[1309,0,1346,0],[1310,2,1310,9],[1311,1,1312,3],[1311,4,1311,5],[1312,4,1312,5],[1313,2,1313,7],[1344,3,1344,7],[1345,5,1345,7],[1266,0,1307,0],[1267,2,1267,9],[1268,1,1269,3],[1268,4,1268,5],[1269,4,1269,5],[1270,2,1270,7],[1334,3,1334,7],[1336,8,1336,9],[1339,3,1339,7],[1340,1,1341,2],[1340,3,1341,3],[1340,4,1341,4],[1340,5,1340,7],[1340,9,1341,9],[1373,3,1373,7],[1375,8,1375,9],[1378,3,1378,7],[1379,1,1380,2],[1379,3,1380,3],[1379,4,1380,4],[1379,5,1379,7],[1379,9,1380,9],[1361,3,1361,7],[1362,3,1362,7],[1363,3,1363,7],[1366,7,1366,9],[1369,3,1369,7],[1370,7,1370,9],[1352,8,1352,9],[1353,1,1354,2],[1353,3,1354,3],[1353,4,1353,5],[1353,6,1353,7],[1358,7,1358,9],[1400,3,1400,7],[1401,3,1401,7],[1402,3,1402,7],[1405,7,1405,9],[1409,3,1409,7],[1410,7,1410,9],[1391,8,1391,9],[1392,1,1393,2],[1392,3,1393,3],[1392,4,1392,5],[1392,6,1392,7],[1397,7,1397,9],[1383,3,1383,7],[1384,5,1384,7],[1387,0,1427,0],[1388,2,1388,9],[1389,1,1390,3],[1389,4,1389,5],[1390,4,1390,5],[1391,2,1391,7],[1425,3,1425,7],[1426,5,1426,7],[1348,0,1385,0],[1349,2,1349,9],[1350,1,1351,3],[1350,4,1350,5],[1351,4,1351,5],[1352,2,1352,7],[1413,3,1413,7],[1415,8,1415,9],[1419,3,1419,7],[1420,1,1421,2],[1420,3,1421,3],[1420,4,1421,4],[1420,5,1420,7],[1420,9,1421,9],[1454,3,1454,7],[1456,8,1456,9],[1459,3,1459,7],[1460,1,1461,2],[1460,3,1461,3],[1460,4,1461,4],[1460,5,1460,7],[1460,9,1461,9],[1442,3,1442,7],[1443,3,1443,7],[1444,3,1444,7]],"merged_total":1269,"flags":["merged_cut"]}
[1,"1ª/GRD",{"$nulls":8},{"$f":"J37","v":13978.63},"Minas Gerais"]
[null,"OBRA:"," PAVIMENTAÇÃO ASFÁLTICA EM CBUQ - ESTRADA PARA SANTO ANTÔNIO DA BOA VISTA (SÃO JOÃO DA PONTE / MG)",{"$nulls":8}," Janeiro/2025"]
[null,"Custo Unitário de Referência",null,null,"Minas Gerais",{"$nulls":5},"QUANT.MATERIAL:",null,{"$f":"SUM(M20:M1839)","v":2153997.6378140883},{"$f":"M3/(ORÇAMENTO!L66-ORÇAMENTO!L59)","v":0.40658174530299812}]
[{"$nulls":4}," Janeiro/2025",null,null,"Produção da equipe ",0.5,{"$f":"VLOOKUP(A1,ORÇAMENTO!$A$10:$L$66,7,1)","v":"GL"}]
[null,"CPU.1","MOBILIZAÇÃO E DESMOBILIZAÇÃO",{"$nulls":5},"Valores em reais (R$)"]
[null,"A - EQUIPAMENTOS",null,"Quantidade","Utilização",null,"Custo Horário",null,null,"Custo"]
[{"$nulls":4},"Operativa","Improdutiva","Produtivo","Improdutivo",null,"Horário Total"]
[null,"E9687","Caminhão carroceria com capacidade de 5 t - 120 kW",8,0.5,0.5,154.82689999999999,59.719900000000003,null,{"$f":"D8*(E8*G8+F8*H8)","v":858.18719999999996},null,"distancia =",125,"MONTES CLAROS"]
[null,"E9575","Caminhão basculante com caçamba estanque com capacidade de 14 m³ - 210 kW",8,1,0,314.16070000000002,91.266099999999994,null,{"$f":"D9*(E9*G9+F9*H9)","v":2513.2856000000002},null,"Pá carregadeira ",null,null,10.1," ton"]
[{"$nulls":7},"Custo horário total de equipamentos",null,{"$f":"SUM(J8:J9)","v":3371.4728},null,"Motoniveladora ",null,null,12.47," ton"]
{"$rows_left_out":1829}
{"sheet":"AUX.-VEIC.","index":2,"n_rows":31,"n_cols":6,"rows_kept":31,"cut":false,"hidden":false,"merged":[[26,2,26,3],[27,2,27,3],[28,2,28,3],[29,1,30,1],[29,2,29,3],[30,2,30,3],[25,2,25,3],[1,1,1,4],[2,1,2,2],[3,1,3,4],[17,1,17,4],[18,2,18,3],[19,2,19,3],[20,2,20,3],[21,2,21,3],[22,2,22,3],[23,2,23,3],[24,2,24,3]]}
[]
[null,"CÁLCULO DO CUSTO POR MÊS DE VEÍCULOS"]
[null,"Veículo: Polo TSI, Onix Turbo, Argo 1.3, HB-20 Turbo",null,"Data:","2025-05-28"]
[null,"DADOS ELEMENTARES DO VEÍCULO"]
[null,"Dados Básicos","Preço (R$)","Quantidade","Vida Útil"]
[null,"Quilometragem média mensal",null,3000]
[null,"Valor de Aquisição (VA)",103900]
[null,"Taxa de Juros (i)%",null,14.75]
[null,"IPVA e Seguro Obrigatório (4%)",{"$f":"0.04*C7","v":4156}]
[null,"Lavagem",50,2]
{"$rows_left_out":22}
{"sheet":"CPU-FORNEC","index":3,"n_rows":92,"n_cols":14,"rows_kept":92,"cut":false,"hidden":false,"merged":[[71,0,80,0],[71,1,71,3],[71,4,71,7],[72,2,72,5],[73,2,73,3],[74,1,74,7],[77,1,77,3],[77,5,77,6],[78,1,78,6],[79,1,79,6],[80,1,80,6],[0,0,26,0],[0,1,0,3],[0,4,0,7],[22,1,22,3],[49,0,58,0],[49,1,49,3],[49,4,49,7],[50,2,50,5],[51,2,51,3],[52,1,52,7],[55,1,55,3],[55,5,55,6],[56,1,56,6],[57,1,57,6],[58,1,58,6],[27,1,27,3],[27,4,27,7],[28,2,28,5],[27,0,36,0],[29,2,29,3],[30,1,30,7],[33,1,33,3],[33,5,33,6],[34,1,34,6],[35,1,35,6],[36,1,36,6],[0,10,0,11],[1,2,1,5],[1,10,1,11],[2,2,2,3],[3,1,3,7],[22,5,22,6],[23,1,23,6],[24,1,24,6],[25,1,25,6],[5,1,5,7],[9,1,9,7],[13,1,13,7],[17,1,17,7],[38,0,47,0],[38,1,38,3],[38,4,38,7],[39,2,39,5],[40,2,40,3],[41,1,41,7],[44,1,44,3],[44,5,44,6],[45,1,45,6],[46,1,46,6],[47,1,47,6],[60,0,69,0],[60,1,60,3],[60,4,60,7],[61,2,61,5],[62,2,62,3],[63,1,63,7],[66,1,66,3],[66,5,66,6],[67,1,67,6],[68,1,68,6],[69,1,69,6],[81,1,81,7],[82,0,91,0],[82,1,82,3],[82,4,82,7],[83,2,83,5],[84,2,84,3],[85,1,85,7],[88,1,88,3],[88,5,88,6],[89,1,89,6],[90,1,90,6],[91,1,91,6]]}
[1,"CODEVASF",null,null," COMPOSIÇÃO DE PREÇO UNITÁRIO",null,null,null,{"$f":"H24","v":0},{"$f":"H26","v":0},"BDI CALCULADO:",null,{"$f":"ORÇAMENTO!L6","v":15}]
[null,"OBRA:  "," PAVIMENTAÇÃO ASFÁLTICA EM CBUQ - ESTRADA PARA SANTO ANTÔNIO DA BOA VISTA (SÃO JOÃO DA PONTE / MG)",null,null,null,"DATA: ",{"$f":"ORÇAMENTO!C6","v":" AGOSTO / 2025"},null,null,"BDI DIFERENCIADO:",null,{"$f":"'BDI FORN'!D31/100","v":0.15}]
[null,"SERVIÇO:  ","CPU.1",null,"Referência:","CODEVASF","UNIDADE: ",{"$f":"VLOOKUP(A1,ORÇAMENTO!A11:L33,5)","v":"MOBILIZAÇÃO E DESMOBILIZAÇÃO"}]
[]
[null,"TIPO ITEM","CODIGO ITEM","DESCRIÇÃO ITEM","UNIDADE ITEM","COEFICIENTE","PRECO UNITARIO","CUSTO TOTAL",null,"distancia =",90,"B.DESPACHO"]
[null,"EQUIPAMENTOS",{"$nulls":7},"Pá carregadeira ",null,null,10.1," ton"]
[null,null,"E9001","E9001","E9001",null,"E9001"]
[]
[]
[null,"MÃO DE OBRA"]
{"$rows_left_out":83}
{"sheet":"BDI SERV","index":4,"n_rows":62,"n_cols":5,"rows_kept":62,"cut":false,"hidden":false,"merged":[[41,2,41,3],[2,1,4,4],[37,0,37,5],[38,0,38,5],[27,1,27,3],[28,1,28,2],[28,3,28,4],[29,3,29,4],[40,1,40,4]]}
[]
[]
[null,"DETALHAMENTO DO BDI - SERVIÇOS"]
[]
[]
[null,"Item","Descrição dos Serviços","% - PV","% - CD"]
[]
[null,1,"ADMINISTRAÇÃO CENTRAL"," ",{"$f":"SUM(E9:E11)","v":4.01}]
[null,"1.1","ESCRITÓRIO CENTRAL",null,4.01]
[null,"1.2","VIAGENS"]
{"$rows_left_out":53}
{"sheet":"BDI FORN","index":5,"n_rows":37,"n_cols":5,"rows_kept":37,"cut":false,"hidden":false,"merged":[[31,1,31,2],[32,0,34,5],[36,0,36,5],[0,1,2,4],[3,1,4,1],[3,2,4,2],[28,0,28,5],[30,1,30,2]]}
[null,"DETALHAMENTO DO BDI - FORNECIMENTO \n(MATERIAL ASFÁLTICO)"]
[]
[]
[null,"Item","Descrição dos Serviços","%","%"]
[null,null,null,"PV","CD"]
[]
[null,1,"ADMINISTRAÇÃO CENTRAL"," ",3.45]
[null,"1.1","ESCRITÓRIO CENTRAL"," "," "]
[null,"1.2","VIAGENS"," "," "]
[null,"1.3","OUTROS"," "," "]
{"$rows_left_out":28}
{"sheet":"CRONOGRAMA","index":6,"n_rows":21,"n_cols":14,"rows_kept":21,"cut":false,"hidden":false,"merged":[[17,1,18,2],[20,1,24,13],[13,0,14,0],[13,1,14,1],[13,2,14,2],[15,0,16,0],[15,1,16,1],[15,2,16,2],[9,0,10,0],[9,1,10,1],[9,2,10,2],[11,0,12,0],[11,1,12,1],[11,2,12,2],[3,1,3,12],[5,0,6,0],[5,1,6,1],[5,2,6,2],[7,0,8,0],[7,1,8,1],[7,2,8,2],[0,1,0,13],[1,1,2,1],[1,2,2,4],[1,6,1,13],[2,6,2,13]]}
[null,"CRONOGRAMA FÍSICO-FINANCEIRO"]
[null,"OBRA: ",{"$f":"ORÇAMENTO!C5","v":" PAVIMENTAÇÃO ASFÁLTICA EM CBUQ - ESTRADA PARA SANTO ANTÔNIO DA BOA VISTA (SÃO JOÃO DA PONTE / MG)"},null,null,"VALOR:",{"$f":"ORÇAMENTO!L66","v":6916869.1399999997}]
[{"$nulls":5},"PRAZO: ","240 DIAS "]
[]
[null,"ITEM","ETAPAS/DESCRIÇAO","FISICO/  FINANCEIRO","TOTAL    ETAPAS","MÊS 1","MÊS 2","MÊS 3","MÊS 4","MÊS 5","MÊS 6","MÊS 7","MÊS 8","TOTAL"]
["A",{"$f":"VLOOKUP(A6,ORÇAMENTO!$A$10:$L$66,2)","v":1},{"$f":"VLOOKUP(A6,ORÇAMENTO!$A$10:$L$66,5)","v":"SERVIÇOS PRELIMINARES "},"FISICO ",{"$f":"ROUND(E7/$G$2,4)","v":6.2700000000000006E-2},0.2,0.1,0.1,0.1,0.1,0.1,0.1,0.2,{"$f":"SUM(F6:M6)","v":1}]
[null,null,null,"FINANCEIRO",{"$f":"ORÇAMENTO!L10","v":433708.52999999997},{"$f":"ROUND($E$7*F6,2)","v":86741.71},{"$f":"ROUND($E$7*G6,2)","v":43370.85},{"$f":"ROUND($E$7*H6,2)","v":43370.85},{"$f":"ROUND($E$7*I6,2)","v":43370.85},43370.85,43370.85,43370.85,86741.71,433708.52]
["B",{"$f":"VLOOKUP(A8,ORÇAMENTO!$A$10:$L$66,2)","v":2},{"$f":"VLOOKUP(A8,ORÇAMENTO!$A$10:$L$66,5)","v":"TERRAPLANAGEM E PAVIMENTAÇÃO"},"FISICO ",{"$f":"ROUND(E9/$G$2,4)","v":0.41},0.1,0.2,0.2,0.2,0.2,0.1,null,null,0.99999999999999989]
[null,null,null,"FINANCEIRO",{"$f":"ORÇAMENTO!L17","v":2835730},{"$f":"ROUND($E$9*F8,2)","v":283573},{"$f":"ROUND($E$9*G8,2)","v":567146},{"$f":"ROUND($E$9*H8,2)","v":567146},{"$f":"ROUND($E$9*I8,2)","v":567146},567146,283573,0,0,2835730]
["C",{"$f":"VLOOKUP(A10,ORÇAMENTO!$A$10:$L$66,2)","v":3},{"$f":"VLOOKUP(A10,ORÇAMENTO!$A$10:$L$66,5)","v":"TRANSPORTE DE MATERIAIS"},"FISICO ",{"$f":"ROUND(E11/$G$2,4)","v":8.6900000000000005E-2},0.15,0.2,0.2,0.2,0.15,0.1,null,null,1]
{"$rows_left_out":11}