{"text_format":"2","workbook":"xlsx","n_sheets":6,"sheets":["ORÇAMENTO","CPU-SERV","CPU-FORNEC","BDI SERV","BDI FORN","CRONOGRAMA"],"not_rendered":{"charts":0,"images":3,"macros":0,"external_links":0,"defined_names":7,"comments":2,"pivot_tables":0},"unopened":[],"bounds":{"document_bytes":16777216,"sheet_cells":100000,"run_cost":"one","rows_first":2000,"rows_last":500,"rows_between":2000,"halvings":0,"cell_chars":16384,"cell_head_chars":4096},"cells_cut":0,"cells_raw":0,"read":"whole","date_system":"1900"}

{"sheet":"ORÇAMENTO","index":0,"n_rows":46,"n_cols":16,"rows_kept":46,"cut":false,"hidden":false,"merged":[[6,8,6,10],[9,16,9,18],[45,1,45,4],[0,0,8,0],[0,4,0,11],[1,4,1,11],[2,4,2,11],[6,1,6,4],[9,14,9,15],[7,1,7,11],[4,2,4,8],[5,2,5,7],[4,9,4,10],[5,8,5,10]]}
["<---- NUMERAR SERVIÇOS PARA CPU",null,null,null,"Ministério do Desenvolvimento Regional"]
[{"$nulls":4},"Companhia de Desenvolvimento dos Vales do São Francisco e do Parnaíba"]
[{"$nulls":4},"1ª Superintendência Regional",{"$nulls":7},"VALOR SERVIÇO"," = ",{"$f":"TRUNC(SUMPRODUCT(H11:H25,I11:I25)+SUMPRODUCT(H27:H38,I27:I38),2)","v":783955.16},{"$f":"(L10+L16+L21+L26)/(1+L5)","v":38055.269964939616}]
[]
[null,"OBRA: "," EXECUÇÃO DE RECAPEAMENTO ASFÁLTICO EM CBUQ - ESTRADA MUNICIPAL DA COMUNIDADE OLHOS D'ÁGUA - MONTES CLAROS - MG",{"$nulls":6},"BDI Serviços (%):",null,{"$f":"'BDI SERV'!E26","v":24.67}]
[null,"DATA:"," JULHO / 2026 ",{"$nulls":5},"BDI Diferenciado Serviços (%):",null,null,{"$f":"'BDI FORN'!D31","v":15}]
[null,"PRAZO DE EXECUÇÃO:     150 DIAS",{"$nulls":6},"BDI Fornecimentos (%):",null,null,{"$f":"'BDI FORN'!D31","v":15}]
[null,"PLANILHA DE ORÇAMENTAÇÃO"]
[null,"ITEM","CÓDIGO","FONTE","DISCRIMINAÇÃO","TIPO","UNID.","QUANT.","VR.UNIT.S/BDI","PR. UNIT.C/BDI","C. TOT.S/BDI","P. TOT.C/BDI"]
["A",1,null,null,"SERVIÇOS PRELIMINARES ",{"$nulls":5},{"$f":"SUM(K11:K15)","v":91181.560000000012},{"$f":"SUM(L11:L15)","v":113660.3}]
[1,"1.1","CPU.1","CODEVASF","MOBILIZAÇÃO E DESMOBILIZAÇÃO","SERV","GL",1,{"$f":"VLOOKUP(A11,'CPU-SERV'!A:K,11,0)","v":7066.91},{"$f":"TRUNC(_xlfn.IFS(F11=\"SERV\",I11*(1+$L$5/100),F11=\"SERV DIF\",I11*(1+$L$6/100),F11=\"FORN\",I11*(1+$L$7/100)),2)","v":8810.31},{"$f":"TRUNC(H11*I11,2)","v":7066.91},{"$f":"TRUNC(H11*J11,2)","v":8810.31}]
[2,"1.2","CPU.2","CODEVASF","ADMINISTRAÇÃO LOCAL ","SERV","GL",1,{"$f":"VLOOKUP(A12,'CPU-SERV'!A:K,11,0)","v":74744.98},{"$f":"TRUNC(_xlfn.IFS(F12=\"SERV\",I12*(1+$L$5/100),F12=\"SERV DIF\",I12*(1+$L$6/100),F12=\"FORN\",I12*(1+$L$7/100)),2)","v":93184.56},{"$f":"TRUNC(H12*I12,2)","v":74744.98},{"$f":"TRUNC(H12*J12,2)","v":93184.56}]
[3,"1.3","CPU.3","CODEVASF","CANTEIRO DE OBRAS ","SERV","GL",1,{"$f":"VLOOKUP(A13,'CPU-SERV'!A:K,11,0)","v":7197.85},{"$f":"TRUNC(_xlfn.IFS(F13=\"SERV\",I13*(1+$L$5/100),F13=\"SERV DIF\",I13*(1+$L$6/100),F13=\"FORN\",I13*(1+$L$7/100)),2)","v":8973.5499999999993},7197.85,8973.5499999999993]
[4,"1.4",103689,"SINAPI","PLACA DE OBRA EM CHAPA DE AÇO GALVANIZADO","SERV","M2",2,{"$f":"VLOOKUP(A14,'CPU-SERV'!A:K,11,0)","v":437.91},{"$f":"TRUNC(_xlfn.IFS(F14=\"SERV\",I14*(1+$L$5/100),F14=\"SERV DIF\",I14*(1+$L$6/100),F14=\"FORN\",I14*(1+$L$7/100)),2)","v":545.94000000000005},875.82,1091.8800000000001]
[5,"1.5",5502985,"SICRO","LIMPEZA MECANIZADA DE CAMADA VEGETAL","SERV","M2",1600,{"$f":"VLOOKUP(A15,'CPU-SERV'!A:K,11,0)","v":0.81},{"$f":"TRUNC(_xlfn.IFS(F15=\"SERV\",I15*(1+$L$5/100),F15=\"SERV DIF\",I15*(1+$L$6/100),F15=\"FORN\",I15*(1+$L$7/100)),2)","v":1},1296,1600]
["B",2,null,null,"TERRAPLANAGEM E PAVIMENTAÇÃO",{"$nulls":5},{"$f":"SUM(K17:K20)","v":276768},{"$f":"SUM(L17:L20)","v":345005.5}]
[10,"2.1",4915656,"SICRO","FRESAGEM CONTÍNUA DE REVESTIMENTO ASFÁLTICO - ESPESSURA ATÉ 4CM","SERV","M3",400,{"$f":"VLOOKUP(A17,'CPU-SERV'!A:K,11,0)","v":91.31},{"$f":"TRUNC(_xlfn.IFS(F17=\"SERV\",I17*(1+$L$5/100),F17=\"SERV DIF\",I17*(1+$L$6/100),F17=\"FORN\",I17*(1+$L$7/100)),2)","v":113.83},{"$f":"TRUNC(H17*I17,2)","v":36524},{"$f":"TRUNC(H17*J17,2)","v":45532}]
[11,"2.2",4915631,"SICRO","REMENDO PROFUNDO COM IMPRIMAÇÃO - DEMOLIÇÃO MECÂNICA E CORTE COM SERRA","SERV","M3",50,{"$f":"VLOOKUP(A18,'CPU-SERV'!A:K,11,0)","v":323.44},{"$f":"TRUNC(_xlfn.IFS(F18=\"SERV\",I18*(1+$L$5/100),F18=\"SERV DIF\",I18*(1+$L$6/100),F18=\"FORN\",I18*(1+$L$7/100)),2)","v":403.23},16172,20161.5]
[13,"2.3",4011353,"SICRO","PINTURA DE LIGAÇÃO COM EMULSÃO ASFÁLTICA RR-1C","SERV","M2",9600,{"$f":"VLOOKUP(A19,'CPU-SERV'!A:K,11,0)","v":0.42},{"$f":"TRUNC(_xlfn.IFS(F19=\"SERV\",I19*(1+$L$5/100),F19=\"SERV DIF\",I19*(1+$L$6/100),F19=\"FORN\",I19*(1+$L$7/100)),2)","v":0.52},4032,4992]
[14,"2.4",4011463,"SICRO","EXECUÇÃO DE PAVIMENTO COM APLICAÇÃO DE CONCRETO ASFÁLTICO USINADO A QUENTE (CBUQ), CAMADA DE ROLAMENTO - EXCLUSIVE TRANSPORTE","SERV","T",1000,{"$f":"VLOOKUP(A20,'CPU-SERV'!A:K,11,0)","v":220.04},{"$f":"TRUNC(_xlfn.IFS(F20=\"SERV\",I20*(1+$L$5/100),F20=\"SERV DIF\",I20*(1+$L$6/100),F20=\"FORN\",I20*(1+$L$7/100)),2)","v":274.32},220040,274320]
["C",3,null,null,"TRANSPORTE DE MATERIAIS",{"$nulls":5},{"$f":"SUM(K22:K25)","v":76144},{"$f":"SUM(L22:L25)","v":94564}]
[15,"3.1",5915321,"SICRO","TRANSPORTE COM CAMINHÃO BASCULANTE, EM VIA URBANA PAVIMENTADA","SERV","TXKM",29999.999999999996,{"$f":"VLOOKUP(A22,'CPU-SERV'!A:K,11,0)","v":0.76},{"$f":"TRUNC(_xlfn.IFS(F22=\"SERV\",I22*(1+$L$5/100),F22=\"SERV DIF\",I22*(1+$L$6/100),F22=\"FORN\",I22*(1+$L$7/100)),2)","v":0.94},{"$f":"TRUNC(H22*I22,2)","v":22800},{"$f":"TRUNC(H22*J22,2)","v":28200}]
[16,"3.2",5914434,"SICRO","TRANSPORTE COM CAMINHÃO CARROCERIA 9T, EM VIA URBANA PAVIMENTADA","SERV","TXKM",15000,{"$f":"VLOOKUP(A23,'CPU-SERV'!A:K,11,0)","v":0.91},{"$f":"TRUNC(_xlfn.IFS(F23=\"SERV\",I23*(1+$L$5/100),F23=\"SERV DIF\",I23*(1+$L$6/100),F23=\"FORN\",I23*(1+$L$7/100)),2)","v":1.1299999999999999},13650,16950]
[17,"3.3",5914612,"SICRO","TRANSPORTE DE MASSA ASFÁLTICA COM CAMINHÃO BASCULANTE, EM VIA URBANA PAVIMENTADA ","SERV","TXKM",40000,{"$f":"VLOOKUP(A24,'CPU-SERV'!A:K,11,0)","v":0.98},{"$f":"TRUNC(_xlfn.IFS(F24=\"SERV\",I24*(1+$L$5/100),F24=\"SERV DIF\",I24*(1+$L$6/100),F24=\"FORN\",I24*(1+$L$7/100)),2)","v":1.22},39200,48800]
[18,"3.4",5914622,"SICRO","TRANSPORTE COM CAMINHÃO TANQUE DE TRANSPORTE DE MATERIAL ASFÁLTICO DE 30000 L, EM VIA URBANA PAVIMENTADA ","SERV","TXKM",200,{"$f":"VLOOKUP(A25,'CPU-SERV'!A:K,11,0)","v":2.4700000000000002},{"$f":"TRUNC(_xlfn.IFS(F25=\"SERV\",I25*(1+$L$5/100),F25=\"SERV DIF\",I25*(1+$L$6/100),F25=\"FORN\",I25*(1+$L$7/100)),2)","v":3.07},494,614]
["E",4,null,null,"DRENAGEM E OBRAS COMPLEMENTARES",{"$nulls":5},{"$f":"SUM(K27:K38)","v":339861.6},{"$f":"SUM(L27:L38)","v":423648.98}]
[19,"4.1",94273,"SINAPI","ASSENTAMENTO DE GUIA (MEIO-FIO) PRÉ-MOLDADO DE CONCRETO - 100X15X13X30 CM (COMPRIMENTO X BASE INFERIOR X BASE SUPERIOR X ALTURA) - USO VIÁRIO","SERV","M",3200,{"$f":"VLOOKUP(A27,'CPU-SERV'!A:K,11,0)","v":39.880000000000003},{"$f":"TRUNC(_xlfn.IFS(F27=\"SERV\",I27*(1+$L$5/100),F27=\"SERV DIF\",I27*(1+$L$6/100),F27=\"FORN\",I27*(1+$L$7/100)),2)","v":49.71},{"$f":"TRUNC(H27*I27,2)","v":127616},{"$f":"TRUNC(H27*J27,2)","v":159072}]
[20,"4.2","94287a","SINAPI","EXECUÇÃO DE SARJETA EM CONCRETO USINADO, MOLDADO IN LOCO - 30CM DE BASE X 5CM DE ALTURA","SERV","M",3200,{"$f":"VLOOKUP(A28,'CPU-SERV'!A:K,11,0)","v":25.6},{"$f":"TRUNC(_xlfn.IFS(F28=\"SERV\",I28*(1+$L$5/100),F28=\"SERV DIF\",I28*(1+$L$6/100),F28=\"FORN\",I28*(1+$L$7/100)),2)","v":31.91},81920,102112]
[21,"4.3",4915724,"SICRO","CAIAÇÃO COM FIXADOR DE CAL","SERV","M2",1000,{"$f":"VLOOKUP(A29,'CPU-SERV'!A:K,11,0)","v":2.25},{"$f":"TRUNC(_xlfn.IFS(F29=\"SERV\",I29*(1+$L$5/100),F29=\"SERV DIF\",I29*(1+$L$6/100),F29=\"FORN\",I29*(1+$L$7/100)),2)","v":2.8},2250,2800]
[22,"4.4",2003103,"SICRO","ENTRADA PARA DESCIDA D'ÁGUA - EDA 01 - AREIA E BRITA COMERCIAIS","SERV","UNID.",30,{"$f":"VLOOKUP(A30,'CPU-SERV'!A:K,11,0)","v":200.92},{"$f":"TRUNC(_xlfn.IFS(F30=\"SERV\",I30*(1+$L$5/100),F30=\"SERV DIF\",I30*(1+$L$6/100),F30=\"FORN\",I30*(1+$L$7/100)),2)","v":250.48},6027.6,7514.4]
[23,"4.5",2003389,"SICRO","DESCIDA D'ÁGUA DE ATERRO TIPO RÁPIDO - DAR 01 - AREIA E BRITA COMERCIAIS","SERV","M",90,{"$f":"VLOOKUP(A31,'CPU-SERV'!A:K,11,0)","v":238.45},{"$f":"TRUNC(_xlfn.IFS(F31=\"SERV\",I31*(1+$L$5/100),F31=\"SERV DIF\",I31*(1+$L$6/100),F31=\"FORN\",I31*(1+$L$7/100)),2)","v":297.27},21460.5,26754.3]
[24,"4.6",2003453,"SICRO","DISSIPADOR DE ENERGIA - DEB 03 - AREIA, BRITA E PEDRA DE MÃO COMERCIAIS","SERV","UNID.",30,{"$f":"VLOOKUP(A32,'CPU-SERV'!A:K,11,0)","v":995.45},{"$f":"TRUNC(_xlfn.IFS(F32=\"SERV\",I32*(1+$L$5/100),F32=\"SERV DIF\",I32*(1+$L$6/100),F32=\"FORN\",I32*(1+$L$7/100)),2)","v":1241.02},29863.5,37230.6]
[25,"4.7",2003626,"SICRO","BOCA DE LOBO SIMPLES - GRELHA DE CONCRETO - AREIA E BRITA COMERCIAIS","SERV","UNID.",6,{"$f":"VLOOKUP(A33,'CPU-SERV'!A:K,11,0)","v":982.6},{"$f":"TRUNC(_xlfn.IFS(F33=\"SERV\",I33*(1+$L$5/100),F33=\"SERV DIF\",I33*(1+$L$6/100),F33=\"FORN\",I33*(1+$L$7/100)),2)","v":1225},5895.6,7350]
[36,"4.8",2003365,"SICRO","TRANSPOSIÇÃO DE SEGMENTO DE SARJETA - TSS 01 - AREIA E BRITA COMERCIAIS","SERV","M",12,{"$f":"VLOOKUP(A34,'CPU-SERV'!A:K,11,0)","v":1062.2},{"$f":"TRUNC(_xlfn.IFS(F34=\"SERV\",I34*(1+$L$5/100),F34=\"SERV DIF\",I34*(1+$L$6/100),F34=\"FORN\",I34*(1+$L$7/100)),2)","v":1324.24},12746.4,15890.88]
[48,"4.9",5213401,"SICRO","PINTURA DE EIXO VIÁRIO SOBRE ASFALTO COM TINTA RETRORREFLETIVA A BASE DE RESINA ACRÍLICA COM MICROESFERAS DE VIDRO, APLICAÇÃO MECÂNICA COM DEMARCADORA AUTOPROPELIDA","SERV","M2",700,{"$f":"VLOOKUP(A35,'CPU-SERV'!A:K,11,0)","v":28.99},{"$f":"TRUNC(_xlfn.IFS(F35=\"SERV\",I35*(1+$L$5/100),F35=\"SERV DIF\",I35*(1+$L$6/100),F35=\"FORN\",I35*(1+$L$7/100)),2)","v":36.14},20293,25298]
[49,"4.10",5213360,"SICRO","TACHA REFLETIVA EM PLÁSTICO INJETADO - BIDIRECIONAL COM UM PINO - FORNECIMENTO E COLOCAÇÃO","SERV","UNID.",600,{"$f":"VLOOKUP(A36,'CPU-SERV'!A:K,11,0)","v":35.94},{"$f":"TRUNC(_xlfn.IFS(F36=\"SERV\",I36*(1+$L$5/100),F36=\"SERV DIF\",I36*(1+$L$6/100),F36=\"FORN\",I36*(1+$L$7/100)),2)","v":44.8},21564,26880]
[50,"4.11",5213405,"SICRO","PINTURA DE FAIXA DE PEDESTRE OU ZEBRADA TINTA RETRORREFLETIVA A BASE DE RESINA ACRÍLICA COM MICROESFERAS DE VIDRO, APLICAÇÃO MANUAL","SERV","M2",100,{"$f":"VLOOKUP(A37,'CPU-SERV'!A:K,11,0)","v":45.3},{"$f":"TRUNC(_xlfn.IFS(F37=\"SERV\",I37*(1+$L$5/100),F37=\"SERV DIF\",I37*(1+$L$6/100),F37=\"FORN\",I37*(1+$L$7/100)),2)","v":56.47},4530,5647]
[51,0,5213440,"SICRO","PLACA DE REGULAMENTAÇÃO EM AÇO - PELÍCULA RETRORREFLETIVA TIPO I + SI - FORNECIMENTO E IMPLANTAÇÃO","SERV","UNID",20,{"$f":"VLOOKUP(A38,'CPU-SERV'!A:K,11,0)","v":284.75},{"$f":"TRUNC(_xlfn.IFS(F38=\"SERV\",I38*(1+$L$5/100),F38=\"SERV DIF\",I38*(1+$L$6/100),F38=\"FORN\",I38*(1+$L$7/100)),2)","v":354.99},{"$f":"TRUNC(H38*I38,2)","v":5695},{"$f":"TRUNC(H38*J38,2)","v":7099.8}]
["F",5,null,null,"FORNECIMENTOS - MATERIAL ASFÁLTICO (BDI DIFERENCIADO)",{"$nulls":5},{"$f":"SUM(K40:K45)","v":280975.39},{"$f":"SUM(L40:L45)","v":323121.22000000003}]
["F1","5.1","CPU.7","ANP","AQUISIÇÃO DE EMULSÃO ASFÁLTICA PARA IMPRIMAÇÃO (EAI) - EXCLUSIVE TRANSPORTE","FORN","T",0.50333333333333341,{"$f":"VLOOKUP(A40,'CPU-FORNEC'!A:J,9,0)","v":2592.23},{"$f":"TRUNC(_xlfn.IFS(F40=\"SERV\",I40*(1+$L$5/100),F40=\"SERV DIF\",I40*(1+$L$6/100),F40=\"FORN\",I40*(1+$L$7/100)),2)","v":2981.06},{"$f":"TRUNC(H40*I40,2)","v":1304.75},{"$f":"TRUNC(H40*J40,2)","v":1500.46}]
["F2","5.2","CPU.8","CODEVASF","TRANSPORTE DE EMULSÃO ASFÁLTICA PARA IMPRIMAÇÃO (EAI)","SERV DIF","T",0.50333333333333341,{"$f":"VLOOKUP(A41,'CPU-FORNEC'!A:J,9,0)","v":740.26},{"$f":"TRUNC(_xlfn.IFS(F41=\"SERV\",I41*(1+$L$5/100),F41=\"SERV DIF\",I41*(1+$L$6/100),F41=\"FORN\",I41*(1+$L$7/100)),2)","v":851.29},372.59,428.48]
["F3","5.3","CPU.9","ANP","AQUISIÇÃO DE EMULSAO ASFALTICA CATIONICA RR-1C - EXCLUSIVE TRANSPORTE","FORN","T",4.5,{"$f":"VLOOKUP(A42,'CPU-FORNEC'!A:J,9,0)","v":2977.88},{"$f":"TRUNC(_xlfn.IFS(F42=\"SERV\",I42*(1+$L$5/100),F42=\"SERV DIF\",I42*(1+$L$6/100),F42=\"FORN\",I42*(1+$L$7/100)),2)","v":3424.56},13400.46,15410.52]
["F4","5.4","CPU.10","CODEVASF","TRANSPORTE DE EMULSÃO ASFÁLTICA CATIONICA RR-1C","SERV DIF","T",4.5,{"$f":"VLOOKUP(A43,'CPU-FORNEC'!A:J,9,0)","v":565.02},{"$f":"TRUNC(_xlfn.IFS(F43=\"SERV\",I43*(1+$L$5/100),F43=\"SERV DIF\",I43*(1+$L$6/100),F43=\"FORN\",I43*(1+$L$7/100)),2)","v":649.77},2542.59,2923.96]
["F5","5.5","CPU.11","ANP","AQUISIÇÃO DE CONCRETO ASFÁLTICO DE PETRÓLEO - CAP 50/70 - EXCLUSIVE TRANSPORTE","FORN","T",60,{"$f":"VLOOKUP(A44,'CPU-FORNEC'!A:J,9,0)","v":3968.3},{"$f":"TRUNC(_xlfn.IFS(F44=\"SERV\",I44*(1+$L$5/100),F44=\"SERV DIF\",I44*(1+$L$6/100),F44=\"FORN\",I44*(1+$L$7/100)),2)","v":4563.54},238098,273812.40000000002]
["F6","5.6","CPU.12","CODEVASF","TRANSPORTE DE CONCRETO ASFÁLTICO DE PETRÓLEO - CAP 50/70","SERV DIF","T",60,{"$f":"VLOOKUP(A45,'CPU-FORNEC'!A:J,9,0)","v":420.95},{"$f":"TRUNC(_xlfn.IFS(F45=\"SERV\",I45*(1+$L$5/100),F45=\"SERV DIF\",I45*(1+$L$6/100),F45=\"FORN\",I45*(1+$L$7/100)),2)","v":484.09},25257,29045.4]
[null,"TOTAL GERAL DA OBRA COM BDI ",{"$nulls":8},{"$f":"SUM(K10,K16,K21,K26,K39)","v":1064930.5499999998},{"$f":"SUM(L10,L16,L21,L26,L39)","v":1300000}]

{"sheet":"CPU-SERV","index":1,"n_rows":1110,"n_cols":16,"rows_kept":1110,"cut":false,"hidden":false,"merged":[[1103,3,1104,3],[1103,4,1104,4],[1103,5,1103,7],[1103,9,1104,9],[1107,3,1107,7],[1108,5,1108,7],[39,0,81,0],[40,2,40,9],[1072,0,1109,0],[1073,2,1073,9],[1074,1,1075,3],[1074,4,1074,5],[1075,4,1075,5],[1076,2,1076,7],[1076,8,1076,9],[1077,1,1078,2],[1077,3,1078,3],[1077,4,1077,5],[1077,6,1077,7],[1082,7,1082,9],[1085,3,1085,7],[1086,3,1086,7],[1087,3,1087,7],[1090,7,1090,9],[1093,3,1093,7],[1094,7,1094,9],[1097,3,1097,7],[1099,8,1099,9],[1102,3,1102,7],[1103,1,1104,2],[362,0,411,0],[363,2,363,9],[364,1,365,3],[364,4,364,5],[365,4,365,5],[366,2,366,7],[366,8,366,9],[367,1,368,2],[367,3,368,3],[367,4,367,5],[367,6,367,7],[375,7,375,9],[377,3,377,7],[378,3,378,7],[379,3,379,7],[382,7,382,9],[390,3,390,7],[409,3,409,7],[30,3,30,7],[31,1,32,2],[7,13,7,15],[15,11,15,13],[22,7,22,9],[25,3,25,7],[2,10,2,11],[27,8,27,9],[21,3,21,7],[4,2,4,7],[4,8,4,9],[5,1,6,2],[5,3,6,3],[5,4,5,5],[5,6,5,7],[41,1,42,3],[41,4,41,5],[42,4,42,5],[43,2,43,7],[43,8,43,9],[44,1,45,2],[0,0,37,0],[3,4,3,5],[0,11,0,12],[1,11,1,12],[2,4,2,5],[1,2,1,9],[2,1,3,3],[31,3,32,3],[31,4,32,4],[31,5,31,7],[31,9,32,9],[35,3,35,7],[36,5,36,7],[10,7,10,9],[13,3,13,7],[14,3,14,7],[15,3,15,7],[18,7,18,9],[57,3,57,7],[60,7,60,9],[63,3,63,7],[64,7,64,9],[69,3,69,7],[71,8,71,9],[44,3,45,3],[44,4,44,5],[44,6,44,7],[49,7,49,9],[55,3,55,7],[56,3,56,7],[79,3,79,7],[80,5,80,7],[85,4,85,5],[74,3,74,7],[75,1,76,2],[75,3,76,3],[75,4,76,4],[75,5,75,7],[75,9,76,9],[114,1,115,2],[114,3,115,3],[114,4,115,4],[114,5,114,7],[114,9,115,9],[118,3,118,7],[93,7,93,9],[98,3,98,7],[101,7,101,9],[104,3,104,7],[105,7,105,9],[108,3,108,7],[110,8,110,9],[113,3,113,7],[96,3,96,7],[97,3,97,7],[119,5,119,7],[122,0,161,0],[123,2,123,9],[124,1,125,3],[124,4,124,5],[125,4,125,5],[126,2,126,7],[126,8,126,9],[159,3,159,7],[160,5,160,7],[83,0,120,0],[84,2,84,9],[85,1,86,3],[86,4,86,5],[87,2,87,7],[87,8,87,9],[88,1,89,2],[88,3,89,3],[88,4,88,5],[88,6,88,7],[136,3,136,7],[137,3,137,7],[140,7,140,9],[145,3,145,7],[146,7,146,9],[149,3,149,7],[127,1,128,2],[127,3,128,3],[127,4,127,5],[127,6,127,7],[132,7,132,9],[135,3,135,7],[151,8,151,9],[154,3,154,7],[155,1,156,2],[155,3,156,3],[155,4,156,4],[155,5,155,7],[155,9,156,9],[188,3,188,7],[190,8,190,9],[176,3,176,7],[177,3,177,7],[178,3,178,7],[167,8,167,9],[168,1,169,2],[168,3,169,3],[168,4,168,5],[168,6,168,7],[173,7,173,9],[198,3,198,7],[199,5,199,7],[181,7,181,9],[184,3,184,7],[185,7,185,9],[163,0,200,0],[164,2,164,9],[165,1,166,3],[165,4,165,5],[166,4,166,5],[167,2,167,7],[193,3,193,7],[194,1,195,2],[194,3,195,3],[194,4,195,4],[194,5,194,7],[194,9,195,9],[203,2,203,9],[204,1,205,3],[204,4,204,5],[205,4,205,5],[206,2,206,7],[239,3,239,7],[240,5,240,7],[247,8,247,9],[248,1,249,2],[248,3,249,3],[248,4,248,5],[217,3,217,7],[218,3,218,7],[219,3,219,7],[222,7,222,9],[225,3,225,7],[226,7,226,9],[206,8,206,9],[207,1,208,2],[207,3,208,3],[207,4,207,5],[207,6,207,7],[214,7,214,9],[248,6,248,7],[243,0,285,0],[244,2,244,9],[245,1,246,3],[245,4,245,5],[246,4,246,5],[247,2,247,7],[229,3,229,7],[231,8,231,9],[234,3,234,7],[235,1,236,2],[235,3,236,3],[235,4,236,4],[235,5,235,7],[235,9,236,9],[273,3,273,7],[275,8,275,9],[278,3,278,7],[279,1,280,2],[279,3,280,3],[279,4,280,4],[279,5,279,7],[279,9,280,9],[260,3,260,7],[202,0,241,0],[257,7,257,9],[283,3,283,7],[284,5,284,7],[261,3,261,7],[262,3,262,7],[265,7,265,9],[269,3,269,7],[270,7,270,9],[318,3,319,3],[318,4,319,4],[318,5,318,7],[318,9,319,9],[300,3,300,7],[291,8,291,9],[314,8,314,9],[317,3,317,7],[302,3,302,7],[292,1,293,2],[292,3,293,3],[292,4,292,5],[305,7,305,9],[308,3,308,7],[309,7,309,9],[391,7,391,9],[350,3,350,7],[326,0,360,0],[327,2,327,9],[328,1,329,3],[328,4,328,5],[329,4,329,5],[330,2,330,7],[358,3,358,7],[359,5,359,7],[306,7,306,8],[287,0,324,0],[288,2,288,9],[289,1,290,3],[289,4,289,5],[290,4,290,5],[291,2,291,7],[312,3,312,7],[318,1,319,2],[443,3,443,7],[444,1,445,2],[444,3,445,3],[444,4,445,4],[444,5,444,7],[444,9,445,9],[292,6,292,7],[297,7,297,9],[339,3,339,7],[340,3,340,7],[341,3,341,7],[344,7,344,9],[347,3,347,7],[348,7,348,9],[330,8,330,9],[331,1,332,2],[331,3,332,3],[331,4,331,5],[331,6,331,7],[337,7,337,9],[322,3,322,7],[323,5,323,7],[301,3,301,7],[352,8,352,9],[354,3,354,7],[428,3,428,7],[431,7,431,9],[434,3,434,7],[435,7,435,9],[417,8,417,9],[417,2,417,7],[427,3,427,7],[355,1,356,2],[355,3,356,3],[355,4,356,4],[355,5,355,7],[355,9,356,9],[402,1,403,2],[402,3,403,3],[402,4,403,4],[402,5,402,7],[402,9,403,9],[393,3,393,7],[395,8,395,9],[401,3,401,7],[387,7,387,8],[410,5,410,7],[418,1,419,2],[418,3,419,3],[418,4,418,5],[418,6,418,7],[423,7,423,9],[448,3,448,7],[449,5,449,7],[438,3,438,7],[440,8,440,9],[452,0,489,0],[453,2,453,9],[454,1,455,3],[454,4,454,5],[455,4,455,5],[456,2,456,7],[487,3,487,7],[488,5,488,7],[413,0,450,0],[414,2,414,9],[415,1,416,3],[415,4,415,5],[416,4,416,5],[477,3,477,7],[479,8,479,9],[482,3,482,7],[426,3,426,7],[501,7,501,9],[474,7,474,9],[456,8,456,9],[457,1,458,2],[457,3,458,3],[457,4,457,5],[457,6,457,7],[462,7,462,9],[465,3,465,7],[466,3,466,7],[467,3,467,7],[470,7,470,9],[473,3,473,7],[483,1,484,2],[483,3,484,3],[483,4,484,4],[483,5,483,7],[483,9,484,9],[495,8,495,9],[496,1,497,2],[496,3,497,3],[496,4,496,5],[496,6,496,7],[522,3,523,3],[522,4,523,4],[522,5,522,7],[522,9,523,9],[504,3,504,7],[505,3,505,7],[506,3,506,7],[509,7,509,9],[512,3,512,7],[513,7,513,9],[526,3,526,7],[527,5,527,7],[530,0,567,0],[531,2,531,9],[532,1,533,3],[532,4,532,5],[533,4,533,5],[534,2,534,7],[565,3,565,7],[566,5,566,7],[491,0,528,0],[492,2,492,9],[493,1,494,3],[493,4,493,5],[494,4,494,5],[495,2,495,7],[555,3,555,7],[557,8,557,9],[560,3,560,7],[561,1,562,2],[516,3,516,7],[518,8,518,9],[521,3,521,7],[522,1,523,2],[543,3,543,7],[544,3,544,7],[545,3,545,7],[548,7,548,9],[551,3,551,7],[552,7,552,9],[534,8,534,9],[535,1,536,2],[535,3,536,3],[535,4,535,5],[535,6,535,7],[540,7,540,9],[561,3,562,3],[561,4,562,4],[561,5,561,7],[561,9,562,9],[594,3,594,7],[596,8,596,9],[599,3,599,7],[600,1,601,2],[600,3,601,3],[600,4,601,4],[600,5,600,7],[600,9,601,9],[582,3,582,7],[583,3,583,7],[584,3,584,7],[587,7,587,9],[590,3,590,7],[591,7,591,9],[573,8,573,9],[574,1,575,2],[574,3,575,3],[574,4,574,5],[574,6,574,7],[579,7,579,9],[604,3,604,7],[605,5,605,7],[608,0,647,0],[609,2,609,9],[610,1,611,3],[610,4,610,5],[611,4,611,5],[612,2,612,7],[645,3,645,7],[646,5,646,7],[569,0,606,0],[570,2,570,9],[571,1,572,3],[571,4,571,5],[572,4,572,5],[573,2,573,7],[635,3,635,7],[637,8,637,9],[640,3,640,7],[641,1,642,2],[621,3,621,7],[622,3,622,7],[623,3,623,7],[626,7,626,9],[631,3,631,7],[632,7,632,9],[612,8,612,9],[613,1,614,2],[613,3,614,3],[613,4,613,5],[613,6,613,7],[618,7,618,9],[641,3,642,3],[641,4,642,4],[641,5,641,7],[641,9,642,9],[676,3,676,7],[678,8,678,9],[681,3,681,7],[682,1,683,2],[682,3,683,3],[682,4,683,4],[682,5,682,7],[682,9,683,9],[663,3,663,7],[664,3,664,7],[665,3,665,7],[668,7,668,9],[672,3,672,7],[673,7,673,9],[653,8,653,9],[654,1,655,2],[654,3,655,3],[654,4,654,5],[654,6,654,7],[660,7,660,9],[686,3,686,7],[687,5,687,7],[690,0,729,0],[691,2,691,9],[692,1,693,3],[692,4,692,5],[693,4,693,5],[694,2,694,7],[727,3,727,7],[728,5,728,7],[649,0,688,0],[650,2,650,9],[651,1,652,3],[651,4,651,5],[652,4,652,5],[653,2,653,7],[717,3,717,7],[719,8,719,9],[722,3,722,7],[723,1,724,2],[703,3,703,7],[704,3,704,7],[705,3,705,7],[708,7,708,9],[711,3,711,7],[712,7,712,9],[694,8,694,9],[695,1,696,2],[695,3,696,3],[695,4,695,5],[695,6,695,7],[700,7,700,9],[723,3,724,3],[723,4,724,4],[723,5,723,7],[723,9,724,9],[758,3,758,7],[760,8,760,9],[763,3,763,7],[764,1,765,2],[764,3,765,3],[764,4,765,4],[764,5,764,7],[764,9,765,9],[744,3,744,7],[745,3,745,7],[746,3,746,7],[749,7,749,9],[751,3,751,7],[752,7,752,9],[735,8,735,9],[736,1,737,2],[736,3,737,3],[736,4,736,5],[736,6,736,7],[741,7,741,9],[768,3,768,7],[769,5,769,7],[772,0,811,0],[773,2,773,9],[774,1,775,3],[774,4,774,5],[775,4,775,5],[776,2,776,7],[809,3,809,7],[810,5,810,7],[731,0,770,0],[732,2,732,9],[733,1,734,3],[733,4,733,5],[734,4,734,5],[735,2,735,7],[799,3,799,7],[801,8,801,9],[804,3,804,7],[805,1,806,2],[785,3,785,7],[786,3,786,7],[787,3,787,7],[790,7,790,9],[793,3,793,7],[794,7,794,9],[776,8,776,9],[777,1,778,2],[777,3,778,3],[777,4,777,5],[777,6,777,7],[782,7,782,9],[805,3,806,3],[805,4,806,4],[805,5,805,7],[805,9,806,9],[861,1,862,2],[861,3,862,3],[861,4,861,5],[861,6,861,7],[842,3,842,7],[844,8,844,9],[847,3,847,7],[848,1,849,2],[848,3,849,3],[848,4,849,4],[848,5,848,7],[848,9,849,9],[813,0,854,0],[814,2,814,9],[815,1,816,3],[815,4,815,5],[816,4,816,5],[817,2,817,7],[817,8,817,9],[818,1,819,2],[818,3,819,3],[818,4,818,5],[818,6,818,7],[823,7,823,9],[826,3,826,7],[827,3,827,7],[828,3,828,7],[831,7,831,9],[834,3,834,7],[835,7,835,9],[869,3,869,7],[870,3,870,7],[871,3,871,7],[874,7,874,9],[877,3,877,7],[878,7,878,9],[866,7,866,9],[852,3,852,7],[853,5,853,7],[860,8,860,9],[931,1,932,2],[882,3,882,7],[884,8,884,9],[887,3,887,7],[888,1,889,2],[888,3,889,3],[888,4,889,4],[888,5,888,7],[888,9,889,9],[900,8,900,9],[901,1,902,2],[901,3,902,3],[901,4,901,5],[901,6,901,7],[906,7,906,9],[892,3,892,7],[893,5,893,7],[917,3,917,7],[918,7,918,9],[930,3,930,7],[896,0,937,0],[897,2,897,9],[898,1,899,3],[898,4,898,5],[899,4,899,5],[900,2,900,7],[935,3,935,7],[936,5,936,7],[856,0,894,0],[857,2,857,9],[858,1,859,3],[858,4,858,5],[859,4,859,5],[860,2,860,7],[925,3,925,7],[927,8,927,9],[931,3,932,3],[931,4,932,4],[931,5,931,7],[931,9,932,9],[909,3,909,7],[910,3,910,7],[911,3,911,7],[914,7,914,9],[939,0,983,0],[940,2,940,9],[941,1,942,3],[941,4,941,5],[942,4,942,5],[943,2,943,7],[981,3,981,7],[982,5,982,7],[967,3,967,7],[969,8,969,9],[974,3,974,7],[975,1,976,2],[952,3,952,7],[953,3,953,7],[954,3,954,7],[957,7,957,9],[963,3,963,7],[964,7,964,9],[943,8,943,9],[944,1,945,2],[944,3,945,3],[944,4,944,5],[944,6,944,7],[949,7,949,9],[975,3,976,3],[975,4,976,4],[975,5,975,7],[975,9,976,9],[1012,3,1012,7],[1014,8,1014,9],[1017,3,1017,7],[1018,1,1019,2],[1018,3,1019,3],[1018,4,1019,4],[1018,5,1018,7],[1018,9,1019,9],[999,3,999,7],[1000,3,1000,7],[1001,3,1001,7],[1004,7,1004,9],[1008,3,1008,7],[1009,7,1009,9],[989,8,989,9],[990,1,991,2],[990,3,991,3],[990,4,990,5],[990,6,990,7],[996,7,996,9],[1030,8,1030,9],[1031,1,1032,2],[1031,3,1032,3],[1031,4,1031,5],[1031,6,1031,7],[1036,7,1036,9],[1022,3,1022,7],[1023,5,1023,7],[1026,0,1070,0],[1027,2,1027,9],[1028,1,1029,3],[1028,4,1028,5],[1029,4,1029,5],[1030,2,1030,7],[1068,3,1068,7],[1069,5,1069,7],[985,0,1024,0],[986,2,986,9],[987,1,988,3],[987,4,987,5],[988,4,988,5],[989,2,989,7],[1054,3,1054,7],[1056,8,1056,9],[1061,3,1061,7],[1062,1,1063,2],[1062,3,1063,3],[1062,4,1063,4],[1062,5,1062,7],[1062,9,1063,9],[1039,3,1039,7],[1040,3,1040,7],[1041,3,1041,7],[1044,7,1044,9],[1050,3,1050,7],[1051,7,1051,9]]}
[1,"1ª/GRD",{"$nulls":8},{"$f":"J37","v":7066.91}]
[null,"OBRA:"," EXECUÇÃO DE RECAPEAMENTO ASFÁLTICO EM CBUQ - ESTRADA MUNICIPAL DA COMUNIDADE OLHOS D'ÁGUA - MONTES CLAROS - MG"]
[null,"Custo Unitário de Referência",null,null,"Minas Gerais"]
[{"$nulls":4}," Abril/2026",null,null,"Produção da equipe ",0.5,{"$f":"VLOOKUP(A1,ORÇAMENTO!$A$10:$L$46,7,1)","v":"GL"}]
[null,"CPU.1","MOBILIZAÇÃO E DESMOBILIZAÇÃO",{"$nulls":5},"Valores em reais (R$)"]
[null,"A - EQUIPAMENTOS",null,"Quantidade","Utilização",null,"Custo Horário",null,null,"Custo"]
[{"$nulls":4},"Operativa","Improdutiva","Produtivo","Improdutivo",null,"Horário Total"]
[null,"E9687","Caminhão carroceria com capacidade de 5 t - 120 kW",4,0.5,0.5,186.67019999999999,69.418999999999997,null,{"$f":"D8*(E8*G8+F8*H8)","v":512.17840000000001},null,"distancia =",30,"MONTES CLAROS"]
[null,"E9575","Caminhão basculante com caçamba estanque com capacidade de 14 m³ - 210 kW",4,1,0,361.291,100.32389999999999,null,{"$f":"D9*(E9*G9+F9*H9)","v":1445.164},null,"Pá carregadeira ",null,null,null," ton"]
[{"$nulls":7},"Custo horário total de equipamentos",null,{"$f":"SUM(J8:J9)","v":1957.3424},null,"Motoniveladora ",null,null,12.47," ton"]
[null,"B - MÃO DE OBRA",null,"Quantidade","Unidade",null,"Custo Horário","Custo Horário Total",null,null,null,"Trator de pneus",null,null,null," ton"]
[null,"P9824","Servente",8,"h",null,22.6355,null,null,{"$f":"D12*G12","v":181.084},null,"Rolo Compactador ",null,null,27," ton"]
[{"$nulls":9},{"$f":"D13*G13","v":0},null,"Rolo Tandem",null,null,10.4," ton"]
[null,null,null,"Custo horário total de mão de obra",{"$nulls":5},{"$f":"SUM(J12:J13)","v":181.084},null,"Retroescavadeira ",null,null,6.67," ton"]
[null,null,null,"Custo horário total de execução",{"$nulls":5},{"$f":"J10+J14","v":2138.4263999999998},null,"Fresadora",null,null,15,"ton"]
[null,null,null,"Custo unitário de execução",{"$nulls":5},{"$f":"J15/I4","v":4276.8527999999997},null,"MOBILIZAÇÃO + DESMOBILIZAÇÃO DOS EQUIPTOS",null,null,{"$f":"SUM(O9:O15)*M8*2","v":4292.3999999999996},"ton.km"]
[{"$nulls":7},"Custo do FIC",null,0]
[{"$nulls":7},"Custo do FIT",null,0]
[null,"C - MATERIAL",null,"Quantidade","Unidade",null,"Preço Unitário","Custo Unitário"]
[null,"-","-",null,"-",null,0,null,null,{"$f":"D20*G20","v":0}]
[null,"-","-",null,"-",null,0,null,null,{"$f":"D21*G21","v":0}]
[null,null,null,"Custo unitário total de material",{"$nulls":5},{"$f":"SUM(J20:J21)","v":0}]
[null,"D - ATIVIDADES AUXILIARES",null,"Quantidade","Unidade",null,"Custo Unitário","Custo Unitário"]
[null,5914640,"Transporte com cavalo mecânico com semirreboque com capacidade de 32 t - rodovia pavimentada",4292.3999999999996,"tkm",null,0.65,null,null,{"$f":"D24*G24","v":2790.06}]
[null,"-","-",0,"-",null,0,null,null,{"$f":"D25*G25","v":0}]
[null,null,null,"Custo total de atividades auxiliares",{"$nulls":5},{"$f":"SUM(J24:J25)","v":2790.06}]
[{"$nulls":7},"Subtotal",null,{"$f":"J16+J22+J26+J17+J18","v":7066.9128000000001}]
[null,"E - TEMPO FIXO",null,"Código","Quantidade","Unidade",null,"Custo Unitário","Custo Unitário"]
[null,"-","-","-",null,"-",null,0,null,{"$f":"ROUNDDOWN(E29*H29,4)","v":0}]
[null,"-","-","-",null,"-",null,0,null,{"$f":"ROUNDDOWN(E30*H30,4)","v":0}]
[null,null,null,"Custo unitário total de tempo fixo",{"$nulls":5},{"$f":"SUM(J29:J30)","v":0}]
[null,"F - MOMENTO DE TRANSPORTE",null,"Quantidade","Unidade","DMT",null,null,null,"Custo Unitário"]
[{"$nulls":5},"LN","RP","P"]
[null,"-","-",null,"tkm"]
[null,"-","-",null,"tkm"]
[null,null,null,"Custo unitário total de transporte"]
[{"$nulls":5},"Custo unitário direto total",null,null,null,{"$f":"TRUNC(J27+J31,2)","v":7066.91}]
[null,"Obs."]
[]
[2,"1ª/GRD",{"$nulls":8},{"$f":"J81","v":74744.98}]
[null,"OBRA:"," EXECUÇÃO DE RECAPEAMENTO ASFÁLTICO EM CBUQ - ESTRADA MUNICIPAL DA COMUNIDADE OLHOS D'ÁGUA - MONTES CLAROS - MG"]
[null,"Custo Unitário de Referência",null,null,"Minas Gerais"]
[{"$nulls":4}," Abril/2026",null,null,"Produção da equipe ",0.33333333333333331,{"$f":"VLOOKUP(A40,ORÇAMENTO!$A$10:$L$46,7,1)","v":"GL"},"3 MESES"]
[null,"CPU.2","ADMINISTRAÇÃO LOCAL ",{"$nulls":5},"Valores em reais (R$)"]
[null,"A - EQUIPAMENTOS",null,"Quantidade","Utilização",null,"Custo Horário",null,null,"Custo"]
[{"$nulls":4},"Operativa","Improdutiva","Produtivo","Improdutivo",null,"Horário Total"]
[null,"-","-",null,null,null,0,0,null,{"$f":"D47*(E47*G47+F47*H47)","v":0}]
[null,"-","-",null,null,null,0,0,null,{"$f":"D48*(E48*G48+F48*H48)","v":0}]
[{"$nulls":7},"Custo horário total de equipamentos",null,{"$f":"SUM(J47:J48)","v":0}]
[null,"B - MÃO DE OBRA",null,"Quantidade","Unidade",null,"Custo Horário","Custo Horário Total"]
[null,"P9812","Engenheiro - mensalista",0.24440081354185184,"mês",null,27738.482,null,null,{"$f":"D51*G51","v":6779.307567216013}]
[null,"P9840","Encarregado geral - mensalista",1,"mês",null,10356.602660251199,null,null,{"$f":"D52*G52","v":10356.602660251199}]
[null,"P9876","Técnico de segurança do trabalho - mensalista",0.5,"mês",null,6020.5919899999999,null,null,3010.2959949999999]
[null,"P9858","Laboratorista - mensalista",0.5,"mês",null,4749.5067200000003,null,null,2374.7533600000002]
[null,"P9806","Auxiliar administrativo - mensalista",0.5,"mês",null,3372.4828199999997,null,null,1686.2414099999999]
[null,null,null,"Custo horário total de mão de obra",{"$nulls":5},{"$f":"SUM(J51:J55)","v":24207.200992467209}]
[null,null,null,"Custo horário total de execução",{"$nulls":5},{"$f":"J49+J56","v":24207.200992467209}]
[null,null,null,"Custo unitário de execução",{"$nulls":5},{"$f":"J57/I43","v":72621.602977401635}]
[{"$nulls":7},"Custo do FIC",null,"-"]
[{"$nulls":7},"Custo do FIT",null,"-"]
[null,"C - MATERIAL",null,"Quantidade","Unidade",null,"Preço Unitário","Custo Unitário"]
[null,"-","-",0,"-",null,0,null,null,{"$f":"D62*G62","v":0}]
[null,"-","-",0,"-",null,0,null,null,0]
[null,null,null,"Custo unitário total de material",{"$nulls":5},{"$f":"SUM(J62:J63)","v":0}]
[null,"D - ATIVIDADES AUXILIARES",null,"Quantidade","Unidade",null,"Custo Unitário","Custo Unitário"]
[null,14250,"Energia Elétrica",240,"kwh",null,1.2,null,null,{"$f":"D66*G66","v":288}]
[null,44480,"Tarifa A - Água e Esgoto",18,"m³",null,22.7,null,null,{"$f":"D67*G67","v":408.59999999999997}]
[null,5212560,"Placa de advertência para sinalização de obras montada em suporte metálico móvel, lado 1,00 m - utilização de 600 ciclos - fornecimento, 01 implantação e 01 retirada diária",264,"un.dia",null,4.2699999999999996,null,null,{"$f":"D68*G68","v":1127.28}]
[null,"Cotação","Telefone",5,"mês",null,59.9,null,null,{"$f":"D69*G69","v":299.5}]
[null,null,null,"Custo total de atividades auxiliares",{"$nulls":5},{"$f":"SUM(J66:J69)","v":2123.38}]
[{"$nulls":7},"Subtotal",null,{"$f":"J58+J64+J70","v":74744.98297740164}]
[null,"E - TEMPO FIXO",null,"Código","Quantidade","Unidade",null,"Custo Unitário","Custo Unitário"]
[null,"-","-","-",0,"t",null,0,null,{"$f":"ROUNDDOWN(E73*H73,4)","v":0}]
[null,"-","-","-",0,"t",null,0,null,{"$f":"ROUNDDOWN(E74*H74,4)","v":0}]
[null,null,null,"Custo unitário total de tempo fixo",{"$nulls":5},{"$f":"SUM(J73:J74)","v":0}]
[null,"F - MOMENTO DE TRANSPORTE",null,"Quantidade","Unidade","DMT",null,null,null,"Custo Unitário"]
[{"$nulls":5},"LN","RP","P"]
[null,"-","-",null,"tkm"]
[null,"-","-",null,"tkm"]
[null,null,null,"Custo unitário total de transporte"]
[{"$nulls":5},"Custo unitário direto total",null,null,null,{"$f":"TRUNC(J71+J75,2)","v":74744.98}]
[null,"Obs."]
[]
[3,"1ª/GRD",{"$nulls":8},{"$f":"J120","v":7197.85}]
[null,"OBRA:"," EXECUÇÃO DE RECAPEAMENTO ASFÁLTICO EM CBUQ - ESTRADA MUNICIPAL DA COMUNIDADE OLHOS D'ÁGUA - MONTES CLAROS - MG"]
[null,"Custo Unitário de Referência",null,null,"Minas Gerais"]
[{"$nulls":4}," Abril/2026",null,null,"Produção da equipe ",1,{"$f":"VLOOKUP(A84,ORÇAMENTO!$A$10:$L$46,7,1)","v":"GL"}]
[null,"CPU.3","CANTEIRO DE OBRAS ",{"$nulls":5},"Valores em reais (R$)"]
[null,"A - EQUIPAMENTOS",null,"Quantidade","Utilização",null,"Custo Horário",null,null,"Custo"]
[{"$nulls":4},"Operativa","Improdutiva","Produtivo","Improdutivo",null,"Horário Total"]
[null,"-","-",null,null,null,0,0,null,{"$f":"D91*(E91*G91+F91*H91)","v":0}]
[null,"-","-",null,null,null,0,0,null,{"$f":"D92*(E92*G92+F92*H92)","v":0}]
[{"$nulls":7},"Custo horário total de equipamentos",null,{"$f":"SUM(J91:J92)","v":0}]
[null,"B - MÃO DE OBRA",null,"Quantidade","Unidade",null,"Custo Horário","Custo Horário Total"]
[null,"P9824","Servente",8,"h",null,22.6355,null,null,{"$f":"D95*G95","v":181.084}]
[null,"P9808","Carpinteiro",8,"h",null,28.754899999999999,null,null,{"$f":"D96*G96","v":230.03919999999999}]
[null,null,null,"Custo horário total de mão de obra",{"$nulls":5},{"$f":"SUM(J95:J96)","v":411.1232}]
[null,null,null,"Custo horário total de execução",{"$nulls":5},{"$f":"J93+J97","v":411.1232}]
[null,null,null,"Custo unitário de execução",{"$nulls":5},{"$f":"J98/I87","v":411.1232}]
[{"$nulls":7},"Custo do FIC",null,"-"]
[{"$nulls":7},"Custo do FIT",null,"-"]
[null,"C - MATERIAL",null,"Quantidade","Unidade",null,"Preço Unitário","Custo Unitário"]
[null,"M0053","Tela plástica em polipropileno na cor laranja para tapume - L = 1,2 m",100,"m",null,1.7173,null,null,{"$f":"D103*G103","v":171.73000000000002}]
[null,"-","-",0,"-",null,0,null,null,{"$f":"D104*G104","v":0}]
[null,null,null,"Custo unitário total de material",{"$nulls":5},{"$f":"SUM(J103:J104)","v":171.73000000000002}]
[null,"D - ATIVIDADES AUXILIARES",null,"Quantidade","Unidade",null,"Custo Unitário","Custo Unitário"]
[null,10775,"Locação de container 2,30 X 6,00 m, alt. 2,50 m, com 1 sanitário, para escritório, completo, sem divisórias internas",3,"mês",null,980,null,null,{"$f":"D107*G107","v":2940}]
[null,10779,"Locação de container 2,30 X 4,30 m, alt. 2,50 M, p/ sanitário, c/ 5 bacias, 1 lavatório e 4 mictórios",3,"mês",null,1225,null,null,{"$f":"D108*G108","v":3675}]
[null,null,null,"Custo total de atividades auxiliares",{"$nulls":5},{"$f":"SUM(J107:J108)","v":6615}]
[{"$nulls":7},"Subtotal",null,{"$f":"J99+J105+J109","v":7197.8531999999996}]
[null,"E - TEMPO FIXO",null,"Código","Quantidade","Unidade",null,"Custo Unitário","Custo Unitário"]
[null,"-","-","-",0,"t",null,0,null,{"$f":"ROUNDDOWN(E112*H112,4)","v":0}]
[null,"-","-","-",0,"t",null,0,null,{"$f":"ROUNDDOWN(E113*H113,4)","v":0}]
[null,null,null,"Custo unitário total de tempo fixo",{"$nulls":5},{"$f":"SUM(J112:J113)","v":0}]
[null,"F - MOMENTO DE TRANSPORTE",null,"Quantidade","Unidade","DMT",null,null,null,"Custo Unitário"]
[{"$nulls":5},"LN","RP","P"]
[null,"-","-",0,"tkm"]
[null,"-","-",0,"tkm"]
[null,null,null,"Custo unitário total de transporte"]
[{"$nulls":5},"Custo unitário direto total",null,null,null,{"$f":"TRUNC(J110+J114,2)","v":7197.85}]
[null,"Obs."]
[]
[4,"1ª/GRD",{"$nulls":8},{"$f":"J161","v":437.91}]
[null,"OBRA:"," EXECUÇÃO DE RECAPEAMENTO ASFÁLTICO EM CBUQ - ESTRADA MUNICIPAL DA COMUNIDADE OLHOS D'ÁGUA - MONTES CLAROS - MG"]
[null,"Custo Unitário de Referência",null,null,"Minas Gerais"]
[{"$nulls":4}," Abril/2026",null,null,"Produção da equipe ",1,{"$f":"VLOOKUP(A123,ORÇAMENTO!$A$10:$L$46,7,1)","v":"M2"}]
[null,103689,"PLACA DE OBRA EM CHAPA DE AÇO GALVANIZADO",{"$nulls":5},"Valores em reais (R$)"]
[null,"A - EQUIPAMENTOS",null,"Quantidade","Utilização",null,"Custo Horário",null,null,"Custo"]
[{"$nulls":4},"Operativa","Improdutiva","Produtivo","Improdutivo",null,"Horário Total"]
[null,"-","-",null,null,null,0,0,null,{"$f":"D130*(E130*G130+F130*H130)","v":0}]
[null,"-","-",null,null,null,0,0,null,{"$f":"D131*(E131*G131+F131*H131)","v":0}]
[{"$nulls":7},"Custo horário total de equipamentos",null,{"$f":"SUM(J130:J131)","v":0}]
[null,"B - MÃO DE OBRA",null,"Quantidade","Unidade",null,"Custo Horário","Custo Horário Total"]
[null,"P9824","Servente",1.1186,"h",null,22.6355,null,null,{"$f":"D134*G134","v":25.320070300000001}]
[null,"P9808","Carpinteiro",0.37290000000000001,"h",null,28.754899999999999,null,null,{"$f":"D135*G135","v":10.72270221}]
[null,null,null,"Custo horário total de mão de obra",{"$nulls":5},{"$f":"SUM(J134:J135)","v":36.042772509999999}]
[null,null,null,"Custo horário total de execução",{"$nulls":5},{"$f":"J132+J136","v":36.042772509999999}]
[null,null,null,"Custo unitário de execução",{"$nulls":5},{"$f":"J137/I126","v":36.042772509999999}]
[{"$nulls":7},"Custo do FIC",null,"-"]
[{"$nulls":7},"Custo do FIT",null,"-"]
[null,"C - MATERIAL",null,"Quantidade","Unidade",null,"Preço Unitário","Custo Unitário"]
[null,"M1358","Sarrafo em madeira de terceira - E = 2,5 cm e L = 5 cm",6.4165999999999999,"m",null,2.08,null,null,{"$f":"D142*G142","v":13.346527999999999}]
[null,"M1205","Prego de ferro",2.4500000000000001E-2,"kg",null,14.941700000000001,null,null,{"$f":"D143*G143","v":0.36607165000000003}]
[null,"M0998","Madeira estrutural de eucalipto",2.2608E-2,"m³",null,3070.34,null,null,{"$f":"D144*G144","v":69.414246720000008}]
[null,4813,"Placa de obra (para construção civil) em chapa galvanizada *N. 22*, adesivada, de *2,4 X 1,2* m (sem postes para fixação)",1,"m²",null,318.75,null,null,318.75]
[null,null,null,"Custo unitário total de material",{"$nulls":5},{"$f":"SUM(J142:J145)","v":401.87684637000001}]
[null,"D - ATIVIDADES AUXILIARES",null,"Quantidade","Unidade",null,"Custo Unitário","Custo Unitário"]
[null,"-","-",0,"-",null,0,null,null,{"$f":"D148*G148","v":0}]
[null,"-","-",0,"-",null,0,null,null,{"$f":"D149*G149","v":0}]
[null,null,null,"Custo total de atividades auxiliares",{"$nulls":5},{"$f":"SUM(J148:J149)","v":0}]
[{"$nulls":7},"Subtotal",null,{"$f":"J138+J146+J150","v":437.91961888000003}]
[null,"E - TEMPO FIXO",null,"Código","Quantidade","Unidade",null,"Custo Unitário","Custo Unitário"]
[null,"-","-","-",0,"t",null,0,null,{"$f":"ROUNDDOWN(E153*H153,4)","v":0}]
[null,"-","-","-",0,"t",null,0,null,{"$f":"ROUNDDOWN(E154*H154,4)","v":0}]
[null,null,null,"Custo unitário total de tempo fixo",{"$nulls":5},{"$f":"SUM(J153:J154)","v":0}]
[null,"F - MOMENTO DE TRANSPORTE",null,"Quantidade","Unidade","DMT",null,null,null,"Custo Unitário"]
[{"$nulls":5},"LN","RP","P"]
[null,"-","-",0,"tkm"]
[null,"-","-",0,"tkm"]
[null,null,null,"Custo unitário total de transporte"]
[{"$nulls":5},"Custo unitário direto total",null,null,null,{"$f":"TRUNC(J151+J155,2)","v":437.91}]
[null,"Obs."]
[]
[5,"1ª/GRD",{"$nulls":8},{"$f":"J200","v":0.81}]
[null,"OBRA:"," EXECUÇÃO DE RECAPEAMENTO ASFÁLTICO EM CBUQ - ESTRADA MUNICIPAL DA COMUNIDADE OLHOS D'ÁGUA - MONTES CLAROS - MG"]
[null,"Custo Unitário de Referência",null,null,"Minas Gerais"]
[{"$nulls":4}," Abril/2026",null,null,"Produção da equipe ",622.95000000000005,{"$f":"VLOOKUP(A164,ORÇAMENTO!$A$10:$L$46,7,1)","v":"M2"}]
[null,5502985,"LIMPEZA MECANIZADA DE CAMADA VEGETAL",{"$nulls":5},"Valores em reais (R$)"]
[null,"A - EQUIPAMENTOS",null,"Quantidade","Utilização",null,"Custo Horário",null,null,"Custo"]
[{"$nulls":4},"Operativa","Improdutiva","Produtivo","Improdutivo",null,"Horário Total"]
[null,"E9540","Trator sobre esteiras com lâmina - 127 kW",1,1,0,455.81740000000002,179.18170000000001,null,{"$f":"D171*(E171*G171+F171*H171)","v":455.81740000000002}]
[null,"-","-",null,null,null,0,0,null,{"$f":"D172*(E172*G172+F172*H172)","v":0}]
[{"$nulls":7},"Custo horário total de equipamentos",null,{"$f":"SUM(J171:J172)","v":455.81740000000002}]
[null,"B - MÃO DE OBRA",null,"Quantidade","Unidade",null,"Custo Horário","Custo Horário Total"]
[null,"P9824","Servente",1,"h",null,22.6355,null,null,{"$f":"D175*G175","v":22.6355}]
[null,"-","-",0,"-",null,0,null,null,{"$f":"D176*G176","v":0}]
[null,null,null,"Custo horário total de mão de obra",{"$nulls":5},{"$f":"SUM(J175:J176)","v":22.6355}]
[null,null,null,"Custo horário total de execução",{"$nulls":5},{"$f":"J173+J177","v":478.4529}]
[null,null,null,"Custo unitário de execução",{"$nulls":5},{"$f":"J178/I167","v":0.7680438237418733}]
[{"$nulls":7},"Custo do FIC",null,4.41E-2]
[{"$nulls":7},"Custo do FIT",null,0]
[null,"C - MATERIAL",null,"Quantidade","Unidade",null,"Preço Unitário","Custo Unitário"]
[null,"-","-",null,"-",null,0,null,null,{"$f":"D183*G183","v":0}]
[null,"-","-",null,"-",null,0,null,null,{"$f":"D184*G184","v":0}]
[null,null,null,"Custo unitário total de material",{"$nulls":5},{"$f":"SUM(J183:J184)","v":0}]
[null,"D - ATIVIDADES AUXILIARES",null,"Quantidade","Unidade",null,"Custo Unitário","Custo Unitário"]
[null,"-","-",0,"-",null,0,null,null,{"$f":"D187*G187","v":0}]
[null,"-","-",0,"-",null,0,null,null,{"$f":"D188*G188","v":0}]
[null,null,null,"Custo total de atividades auxiliares",{"$nulls":5},{"$f":"SUM(J187:J188)","v":0}]
[{"$nulls":7},"Subtotal",null,{"$f":"J179+J185+J189+J180+J181","v":0.81214382374187333}]
[null,"E - TEMPO FIXO",null,"Código","Quantidade","Unidade",null,"Custo Unitário","Custo Unitário"]
[null,"-","-","-",0,"t",null,0,null,{"$f":"ROUNDDOWN(E192*H192,4)","v":0}]
[null,"-","-","-",0,"t",null,0,null,{"$f":"ROUNDDOWN(E193*H193,4)","v":0}]
[null,null,null,"Custo unitário total de tempo fixo",{"$nulls":5},{"$f":"SUM(J192:J193)","v":0}]
[null,"F - MOMENTO DE TRANSPORTE",null,"Quantidade","Unidade","DMT",null,null,null,"Custo Unitário"]
[{"$nulls":5},"LN","RP","P"]
[null,"-","-"]
[null,"-","-"]
[null,null,null,"Custo unitário total de transporte"]
[{"$nulls":5},"Custo unitário direto total",null,null,null,{"$f":"TRUNC(J190+J194,2)","v":0.81}]
[null,"Obs."]
[]
[10,"1ª/GRD",{"$nulls":8},{"$f":"J241","v":91.31}]
[null,"OBRA:"," EXECUÇÃO DE RECAPEAMENTO ASFÁLTICO EM CBUQ - ESTRADA MUNICIPAL DA COMUNIDADE OLHOS D'ÁGUA - MONTES CLAROS - MG"]
[null,"Custo Unitário de Referência",null,null,"Minas Gerais"]
[{"$nulls":4}," Abril/2026",null,null,"Produção da equipe ",77.900000000000006,{"$f":"VLOOKUP(A203,ORÇAMENTO!$A$10:$L$46,7,1)","v":"M3"}]
[null,4915656,"FRESAGEM CONTÍNUA DE REVESTIMENTO ASFÁLTICO - ESPESSURA ATÉ 4CM",{"$nulls":5},"Valores em reais (R$)"]
[null,"A - EQUIPAMENTOS",null,"Quantidade","Utilização",null,"Custo Horário",null,null,"Custo"]
[{"$nulls":4},"Operativa","Improdutiva","Produtivo","Improdutivo",null,"Horário Total"]
[null,"E9571","Caminhão tanque com capacidade de 10.000 l - 188 kW",1,0.33,0.67,401.09660000000002,98.643000000000001,null,{"$f":"D210*(E210*G210+F210*H210)","v":198.45268800000002}]
[null,"E9678","Fresadora a frio - 455 kW",1,1,0,2926.5009,1104.3747000000001,null,{"$f":"D211*(E211*G211+F211*H211)","v":2926.5009}]
[null,"E9697","Minicarregadeira de pneus com vassoura de 1,68 m - 45,50 kW",2,0.97,0.03,194.99600000000001,83.113900000000001,null,383.27907399999998]
[null,"E9156","Soprador de ar costal - 2,6 kW",2,1,0,5.9191000000000003,0.49049999999999999,null,11.838200000000001]
[{"$nulls":7},"Custo horário total de equipamentos",null,{"$f":"SUM(J210:J213)","v":3520.070862}]
[null,"B - MÃO DE OBRA",null,"Quantidade","Unidade",null,"Custo Horário","Custo Horário Total"]
[null,"P9824","Servente",5,"h",null,22.6355,null,null,{"$f":"D216*G216","v":113.17750000000001}]
[null,"-",null,0,"-",null,0,null,null,{"$f":"D217*G217","v":0}]
[null,null,null,"Custo horário total de mão de obra",{"$nulls":5},{"$f":"SUM(J216:J217)","v":113.17750000000001}]
[null,null,null,"Custo horário total de execução",{"$nulls":5},{"$f":"J214+J218","v":3633.2483620000003}]
[null,null,null,"Custo unitário de execução",{"$nulls":5},{"$f":"J219/I206","v":46.639901951219514}]
[{"$nulls":7},"Custo do FIC",null,0]
[{"$nulls":7},"Custo do FIT",null,0]
[null,"C - MATERIAL",null,"Quantidade","Unidade",null,"Preço Unitário","Custo Unitário"]
[null,"M1974","Dente de corte para fresadora de 455 kW",0.81,"un",null,42.361499999999999,null,null,{"$f":"D224*G224","v":34.312815000000001}]
[null,"M2148","Porta-dente de corte para fresadora e recicladora a frio",1.2999999999999999E-3,"un",null,547.97709999999995,null,null,{"$f":"D225*G225","v":0.71237022999999988}]
[null,null,null,"Custo unitário total de material",{"$nulls":5},{"$f":"SUM(J224:J225)","v":35.025185229999998}]
[null,"D - ATIVIDADES AUXILIARES",null,"Quantidade","Unidade",null,"Custo Unitário","Custo Unitário"]
[null,"-","-",0,"-",null,0,null,null,{"$f":"D228*G228","v":0}]
[null,"-","-",0,"-",null,0,null,null,{"$f":"D229*G229","v":0}]
[null,null,null,"Custo total de atividades auxiliares",{"$nulls":5},{"$f":"SUM(J228:J229)","v":0}]
[{"$nulls":7},"Subtotal",null,{"$f":"J220+J226+J230+J221+J222","v":81.665087181219519}]
[null,"E - TEMPO FIXO",null,"Código","Quantidade","Unidade",null,"Custo Unitário","Custo Unitário"]
[null,"M3507","Revestimento asfáltico",5914305,2.4,"t",null,4.0199999999999996,null,{"$f":"ROUNDDOWN(E233*H233,4)","v":9.6479999999999997}]
[null,"-","-","-",null,"t",null,0,null,{"$f":"ROUNDDOWN(E234*H234,4)","v":0}]
[null,null,null,"Custo unitário total de tempo fixo",{"$nulls":5},{"$f":"SUM(J233:J234)","v":9.6479999999999997}]
[null,"F - MOMENTO DE TRANSPORTE",null,"Quantidade","Unidade","DMT",null,null,null,"Custo Unitário"]
[{"$nulls":5},"LN","RP","P"]
[null,"-","-",null,"tkm","5914449","5914464","5914479"]
[null,"-","-",null,"tkm","5914449","5914464","5914479"]
[null,null,null,"Custo unitário total de transporte"]
[{"$nulls":5},"Custo unitário direto total",null,null,null,{"$f":"TRUNC(J231+J235,2)","v":91.31}]
[null,"Obs."]
[]
[11,"1ª/GRD",{"$nulls":8},{"$f":"J285","v":323.44}]
[null,"OBRA:"," EXECUÇÃO DE RECAPEAMENTO ASFÁLTICO EM CBUQ - ESTRADA MUNICIPAL DA COMUNIDADE OLHOS D'ÁGUA - MONTES CLAROS - MG"]
[null,"Custo Unitário de Referência",null,null,"Minas Gerais"]
[{"$nulls":4}," Abril/2026",null,null,"Produção da equipe ",1,{"$f":"VLOOKUP(A244,ORÇAMENTO!$A$10:$L$46,7,1)","v":"M3"}]
[null,4915631,"REMENDO PROFUNDO COM IMPRIMAÇÃO - DEMOLIÇÃO MECÂNICA E CORTE COM SERRA",{"$nulls":5},"Valores em reais (R$)"]
[null,"A - EQUIPAMENTOS",null,"Quantidade","Utilização",null,"Custo Horário",null,null,"Custo"]
[{"$nulls":4},"Operativa","Improdutiva","Produtivo","Improdutivo",null,"Horário Total"]
[null,"E9155","Caldeira de asfalto rebocável com capacidade de 600 l - 5,20 kW",1,0.01,0.99,36.6815,24.650600000000001,null,{"$f":"D251*(E251*G251+F251*H251)","v":24.770909}]
[null,"E9647","Compactador manual com soquete vibratório - 4,10 kW",1,0.28000000000000003,0.72,13.199199999999999,2.7606999999999999,null,{"$f":"D252*(E252*G252+F252*H252)","v":5.6834800000000003}]
[null,"E9556","Compactador manual de placa vibratória - 3,00 kW",1,0.09,0.91,10.0562,2.23,null,{"$f":"D253*(E253*G253+F253*H253)","v":2.934358}]
[null,"E9646","Compressor de ar portátil de 58,52 l/s (124 PCM) - 27 kW",1,0.19,0.81,52.5276,12.269500000000001,null,{"$f":"D254*(E254*G254+F254*H254)","v":19.918539000000003}]
[null,"E9527","Martelete perfurador/rompedor a ar comprimido de 25 kg para rocha com capacidade de 2.040 gpm",1,0.19,0.81,31.840800000000002,29.5641,null,29.996673000000001]
[null,"E9591","Serra para corte de concreto e asfalto - 10 kW",1,0.12,0.88,23.341699999999999,2.2280000000000002,null,4.7616440000000004]
[{"$nulls":7},"Custo horário total de equipamentos",null,{"$f":"SUM(J251:J256)","v":88.06560300000001}]
[null,"B - MÃO DE OBRA",null,"Quantidade","Unidade",null,"Custo Horário","Custo Horário Total"]
[null,"P9824","Servente",6,"h",null,22.6355,null,null,{"$f":"D259*G259","v":135.81299999999999}]
[null,"-","-",0,"-",null,0,null,null,{"$f":"D260*G260","v":0}]
[null,null,null,"Custo horário total de mão de obra",{"$nulls":5},{"$f":"SUM(J259:J260)","v":135.81299999999999}]
[null,null,null,"Custo horário total de execução",{"$nulls":5},{"$f":"J257+J261","v":223.878603}]
[null,null,null,"Custo unitário de execução",{"$nulls":5},{"$f":"J262/I247","v":223.878603}]
[{"$nulls":7},"Custo do FIC",null,5.5773000000000001]
[{"$nulls":7},"Custo do FIT",null,0]
[null,"C - MATERIAL",null,"Quantidade","Unidade",null,"Preço Unitário","Custo Unitário"]
[null,"M1385","Disco de corte diamantado para concreto e asfalto - D = 350 mm",2.9669999999999998E-2,"un",null,461.38,null,null,{"$f":"D267*G267","v":13.689144599999999}]
[null,"M2092","Emulsão asfáltica para imprimação",5.1999999999999998E-3,"t",null,"-",null,null,0]
[null,"M1391","Ponteiro para martelete - D = 22 mm e C = 1,00 m",0.02,"un",null,491.53570000000002,null,null,{"$f":"D269*G269","v":9.8307140000000004}]
[null,null,null,"Custo unitário total de material",{"$nulls":5},{"$f":"SUM(J267:J269)","v":23.519858599999999}]
[null,"D - ATIVIDADES AUXILIARES",null,"Quantidade","Unidade",null,"Custo Unitário","Custo Unitário"]
[null,4900001,"Material de base",0.8,"m³",null,0,null,null,{"$f":"D272*G272","v":0}]
[null,4915801,"Mistura betuminosa",0.2,"m³",null,0,null,null,{"$f":"D273*G273","v":0}]
[null,null,null,"Custo total de atividades auxiliares",{"$nulls":5},{"$f":"SUM(J272:J273)","v":0}]
[{"$nulls":7},"Subtotal",null,{"$f":"J263+J270+J274+J264+J265","v":252.9757616}]
[null,"E - TEMPO FIXO",null,"Código","Quantidade","Unidade",null,"Custo Unitário","Custo Unitário"]
[null,"M3509","Material demolido - remendo profundo",5915476,2.1303999999999998,"t",null,33.08,null,{"$f":"ROUNDDOWN(E277*H277,4)","v":70.473600000000005}]
[null,"-","-","-",null,"t",null,0,null,{"$f":"ROUNDDOWN(E278*H278,4)","v":0}]
[null,null,null,"Custo unitário total de tempo fixo",{"$nulls":5},{"$f":"SUM(J277:J278)","v":70.473600000000005}]
[null,"F - MOMENTO DE TRANSPORTE",null,"Quantidade","Unidade","DMT",null,null,null,"Custo Unitário"]
[{"$nulls":5},"LN","RP","P"]
[null,4900001,"Material de base",2.1303999999999998,"tkm","5914359","5914374","5914389"]
[null,"-","-",0,"tkm"]
[null,null,null,"Custo unitário total de transporte"]
[{"$nulls":5},"Custo unitário direto total",null,null,null,{"$f":"TRUNC(J275+J279,2)","v":323.44}]
[null,"Obs."]
[]
[13,"1ª/GRD",{"$nulls":8},{"$f":"J324","v":0.42}]
[null,"OBRA:"," EXECUÇÃO DE RECAPEAMENTO ASFÁLTICO EM CBUQ - ESTRADA MUNICIPAL DA COMUNIDADE OLHOS D'ÁGUA - MONTES CLAROS - MG"]
[null,"Custo Unitário de Referência",null,null,"Minas Gerais"]
[{"$nulls":4}," Abril/2026",null,null,"Produção da equipe ",1500,{"$f":"VLOOKUP(A288,ORÇAMENTO!$A$10:$L$46,7,1)","v":"M2"}]
[null,4011353,"PINTURA DE LIGAÇÃO COM EMULSÃO ASFÁLTICA RR-1C",{"$nulls":5},"Valores em reais (R$)"]
[null,"A - EQUIPAMENTOS",null,"Quantidade","Utilização",null,"Custo Horário",null,null,"Custo"]
[{"$nulls":4},"Operativa","Improdutiva","Produtivo","Improdutivo",null,"Horário Total"]
[null,"E9509","Caminhão tanque distribuidor de asfalto com capacidade de 6.000 l - 7 kW/136 kW",1,1,0,369.22500000000002,112.145,null,{"$f":"D295*(E295*G295+F295*H295)","v":369.22500000000002}]
[null,"E9558","Tanque de estocagem de asfalto com capacidade de 30.000 l",2,1,0,97.122,63.005800000000001,null,{"$f":"D296*(E296*G296+F296*H296)","v":194.244}]
[{"$nulls":7},"Custo horário total de equipamentos",null,{"$f":"SUM(J295:J296)","v":563.46900000000005}]
[null,"B - MÃO DE OBRA",null,"Quantidade","Unidade",null,"Custo Horário","Custo Horário Total"]
[null,"P9824","Servente",2,"h",null,22.6355,null,null,{"$f":"D299*G299","v":45.271000000000001}]
[null,"-",{"$nulls":7},{"$f":"D300*G300","v":0}]
[null,null,null,"Custo horário total de mão de obra",{"$nulls":5},{"$f":"SUM(J299:J300)","v":45.271000000000001}]
[null,null,null,"Custo horário total de execução",{"$nulls":5},{"$f":"J297+J301","v":608.74}]
[null,null,null,"Custo unitário de execução",{"$nulls":5},{"$f":"J302/I291","v":0.40582666666666667}]
[{"$nulls":7},"Custo do FIC",null,2.23E-2]
[{"$nulls":7},"Custo do FIT",null,0]
[null,"C - MATERIAL",null,"Quantidade","Unidade",null,"Preço Unitário","Custo Unitário"]
[null,"M1946","Emulsão asfáltica - RR-1C",4.4999999999999999E-4,"t",null,0,"FORNECIMENTO COM BDI DIFERENCIADO",null,{"$f":"D307*G307","v":0}]
[null,"-","-",null,"-",null,0,null,null,{"$f":"D308*G308","v":0}]
[null,null,null,"Custo unitário total de material",{"$nulls":5},{"$f":"SUM(J307:J308)","v":0}]
[null,"D - ATIVIDADES AUXILIARES",null,"Quantidade","Unidade",null,"Custo Unitário","Custo Unitário"]
[null,"-","-",0,"-",null,0,null,null,{"$f":"D311*G311","v":0}]
[null,"-","-",0,"-",null,0,null,null,{"$f":"D312*G312","v":0}]
[null,null,null,"Custo total de atividades auxiliares",{"$nulls":5},{"$f":"SUM(J311:J312)","v":0}]
[{"$nulls":7},"Subtotal",null,{"$f":"J303+J309+J313+J304+J305","v":0.42812666666666666}]
[null,"E - TEMPO FIXO",null,"Código","Quantidade","Unidade",null,"Custo Unitário","Custo Unitário"]
[null,"-","-","-",0,"t",null,0,null,{"$f":"ROUNDDOWN(E316*H316,4)","v":0}]
[null,"-","-","-",0,"t",null,0,null,{"$f":"ROUNDDOWN(E317*H317,4)","v":0}]
[null,null,null,"Custo unitário total de tempo fixo",{"$nulls":5},{"$f":"SUM(J316:J317)","v":0}]
[null,"F - MOMENTO DE TRANSPORTE",null,"Quantidade","Unidade","DMT",null,null,null,"Custo Unitário"]
[{"$nulls":5},"LN","RP","P"]
[null,"-","-",null,"tkm"]
[null,"-","-",null,"tkm"]
[null,null,null,"Custo unitário total de transporte"]
[{"$nulls":5},"Custo unitário direto total",null,null,null,{"$f":"TRUNC(J314+J318,2)","v":0.42}]
[null,"Obs."]
[]
[14,"1ª/GRD",{"$nulls":8},{"$f":"J360","v":220.04}]
[null,"OBRA:"," EXECUÇÃO DE RECAPEAMENTO ASFÁLTICO EM CBUQ - ESTRADA MUNICIPAL DA COMUNIDADE OLHOS D'ÁGUA - MONTES CLAROS - MG"]
[null,"Custo Unitário de Referência",null,null,"Minas Gerais"]
[{"$nulls":4}," Abril/2026",null,null,"Produção da equipe ",99.6,{"$f":"VLOOKUP(A327,ORÇAMENTO!$A$10:$L$46,7,1)","v":"T"}]
[null,4011463,"EXECUÇÃO DE PAVIMENTO COM APLICAÇÃO DE CONCRETO ASFÁLTICO USINADO A QUENTE (CBUQ), CAMADA DE ROLAMENTO - EXCLUSIVE TRANSPORTE",{"$nulls":5},"Valores em reais (R$)"]
[null,"A - EQUIPAMENTOS",null,"Quantidade","Utilização",null,"Custo Horário",null,null,"Custo"]
[{"$nulls":4},"Operativa","Improdutiva","Produtivo","Improdutivo",null,"Horário Total"]
[null,"E9762","Rolo compactador de pneus autopropelido de 27 t - 85 kW",1,0.71,0.28999999999999998,292.39060000000001,136.79759999999999,null,{"$f":"D334*(E334*G334+F334*H334)","v":247.26862999999997}]
[null,"E9681","Rolo compactador liso tandem vibratório autopropelido de 10,4 t - 82 kW",1,0.82,0.18,372.97789999999998,140.8193,null,{"$f":"D335*(E335*G335+F335*H335)","v":331.18935199999993}]
[null,"E9545","Vibroacabadora de asfalto sobre esteiras - 97 kW",1,1,0,529.16279999999995,223.6472,null,{"$f":"D336*(E336*G336+F336*H336)","v":529.16279999999995}]
[{"$nulls":7},"Custo horário total de equipamentos",null,{"$f":"SUM(J334:J336)","v":1107.620782}]
[null,"B - MÃO DE OBRA",null,"Quantidade","Unidade",null,"Custo Horário","Custo Horário Total"]
[null,"P9824","Servente",8,"h",null,22.6355,null,null,{"$f":"D339*G339","v":181.084}]
[null,null,null,"Custo horário total de mão de obra",{"$nulls":5},{"$f":"SUM(J339:J339)","v":181.084}]
[null,null,null,"Custo horário total de execução",{"$nulls":5},{"$f":"J337+J340","v":1288.704782}]
[null,null,null,"Custo unitário de execução",{"$nulls":5},{"$f":"J341/I330","v":12.938803032128515}]
[{"$nulls":7},"Custo do FIC",null,0.65249999999999997]
[{"$nulls":7},"Custo do FIT",null,0]
[null,"C - MATERIAL",null,"Quantidade","Unidade",null,"Preço Unitário","Custo Unitário"]
[null,"-","-",null,"-",null,0,null,null,{"$f":"D346*G346","v":0}]
[null,"-","-",null,"-",null,0,null,null,{"$f":"D347*G347","v":0}]
[null,null,null,"Custo unitário total de material",{"$nulls":5},{"$f":"SUM(J346:J347)","v":0}]
[null,"D - ATIVIDADES AUXILIARES",null,"Quantidade","Unidade",null,"Custo Unitário","Custo Unitário"]
[null,6416078,"Usinagem de concreto asfáltico - faixa C-12,5 - areia e brita comerciais",1,"t",null,197.36500557310441,"CPU-AUXILIAR",null,{"$f":"D350*G350","v":197.36500557310441}]
[null,null,null,"Custo total de atividades auxiliares",{"$nulls":5},{"$f":"SUM(J350:J350)","v":197.36500557310441}]
[{"$nulls":7},"Subtotal",null,{"$f":"J342+J348+J351+J343+J344","v":210.95630860523292}]
[null,"E - TEMPO FIXO",null,"Código","Quantidade","Unidade",null,"Custo Unitário","Custo Unitário"]
[null,6416078,"Usinagem de concreto asfáltico - faixa C-12,5 - areia e brita comerciais",5914649,1,"t",null,9.09,null,{"$f":"ROUNDDOWN(E354*H354,4)","v":9.09}]
[null,null,null,"Custo unitário total de tempo fixo",{"$nulls":5},{"$f":"SUM(J354:J354)","v":9.09}]
[null,"F - MOMENTO DE TRANSPORTE",null,"Quantidade","Unidade","DMT",null,null,null,"Custo Unitário"]
[{"$nulls":5},"LN","RP","P"]
[null,6416078,"Usinagem de concreto asfáltico - faixa C-12,5 - areia e brita comerciais",1,"tkm"]
[null,null,null,"Custo unitário total de transporte"]
[{"$nulls":5},"Custo unitário direto total",null,null,null,{"$f":"TRUNC(J352+J355,2)","v":220.04}]
[null,"Obs."]
[]
[null,"1ª/GRD",{"$nulls":8},{"$f":"J411","v":197.36500557310441}]
[null,"OBRA:"," EXECUÇÃO DE RECAPEAMENTO ASFÁLTICO EM CBUQ - ESTRADA MUNICIPAL DA COMUNIDADE OLHOS D'ÁGUA - MONTES CLAROS - MG"]
[null,"Custo Unitário de Referência - Auxiliar",null,null,"Minas Gerais"]
[{"$nulls":4}," Abril/2026",null,null,"Produção da equipe ",99.6,"t"]
[null,6416078,"Usinagem de concreto asfáltico - faixa C - areia e brita comerciais",{"$nulls":5},"Valores em reais (R$)"]
[null,"A - EQUIPAMENTOS",null,"Quantidade","Utilização",null,"Custo Horário",null,null,"Custo"]
[{"$nulls":4},"Operativa","Improdutiva","Produtivo","Improdutivo",null,"Horário Total"]
[null,"E9559","Aquecedor de fluido térmico - 12 kW",1,1,0,168.81729999999999,98.934100000000001,null,{"$f":"D370*(E370*G370+F370*H370)","v":168.81729999999999}]
[null,"E9584","Carregadeira de pneus com capacidade de 1,72 m³ - 113 kW",1,0.86,0.14000000000000001,214.67230000000001,103.0484,null,{"$f":"D371*(E371*G371+F371*H371)","v":199.04495399999999}]
[null,"E9021","Grupo gerador - 456 kVA",1,1,0,503.22019999999998,29.081700000000001,null,503.22019999999998]
[null,"E9558","Tanque de estocagem de asfalto com capacidade de 30.000 l",2,1,0,97.122,63.005800000000001,null,194.244]
[null,"E9689","Usina de asfalto a quente gravimétrica com capacidade de 100/140 t/h - 260 kW",1,1,0,1911.4376999999999,955.99300000000005,null,{"$f":"D374*(E374*G374+F374*H374)","v":1911.4376999999999}]
[{"$nulls":7},"Custo horário total de equipamentos",null,{"$f":"SUM(J370:J374)","v":2976.764154}]
[null,"B - MÃO DE OBRA",null,"Quantidade","Unidade",null,"Custo Horário","Custo Horário Total"]
[null,"P9824","Servente",4,"h",null,22.6355,null,null,{"$f":"D377*G377","v":90.542000000000002}]
[null,null,null,"Custo horário total de mão de obra",{"$nulls":5},{"$f":"SUM(J377:J377)","v":90.542000000000002}]
[null,null,null,"Custo horário total de execução",{"$nulls":5},{"$f":"J375+J378","v":3067.3061539999999}]
[null,null,null,"Custo unitário de execução",{"$nulls":5},{"$f":"J379/I366","v":30.796246526104419}]
[{"$nulls":7},"Custo do FIC",null,1.3423]
[{"$nulls":7},"Custo do FIT",null,0]
[null,"C - MATERIAL",null,"Quantidade","Unidade",null,"Preço Unitário","Custo Unitário"]
[null,"M0028","Areia média",2.7009999999999999E-2,"m³",null,144.4665,null,null,{"$f":"D384*G384","v":3.9020401649999998}]
[null,"M1098","Brita 0 (pedrisco) ",0.1479,"m³",null,204.2012,null,null,{"$f":"D385*G385","v":30.201357480000002}]
[null,"M0191","Brita 1",0.12218,"m³",null,145.6,null,null,17.789407999999998]
[null,"M0344","Cal hidratada - a granel",14.4636,"kg",null,0.63200000000000001,null,null,9.140995199999999]
[null,"M1943","Cimento asfáltico de petróleo - CAP 50/70",5.5449999999999999E-2,"t",null,0,"FORNECIMENTO COM BDI DIFERENCIADO",null,0]
[null,"M1941","Óleo tipo A1",8,"l",null,6.0781000000000001,null,null,48.6248]
[null,"M1135","Pó de pedra",0.33631,"m³",null,158.4742,null,null,53.296458201999997]
[null,null,null,"Custo unitário total de material",{"$nulls":5},{"$f":"SUM(J384:J390)","v":162.95505904699999}]
[null,"D - ATIVIDADES AUXILIARES",null,"Quantidade","Unidade",null,"Custo Unitário","Custo Unitário"]
[null,"-","-",0,"-",null,0,null,null,{"$f":"D393*G393","v":0}]
[null,null,null,"Custo total de atividades auxiliares",{"$nulls":5},{"$f":"SUM(J393:J393)","v":0}]
[{"$nulls":7},"Subtotal",null,{"$f":"J380+J391+J394+J381+J382","v":195.09360557310441}]
[null,"E - TEMPO FIXO",null,"Código","Quantidade","Unidade",null,"Custo Unitário","Custo Unitário"]
[null,"M0028","Areia média",5914647,4.052E-2,"t",null,2.06,null,{"$f":"ROUNDDOWN(E397*H397,4)","v":8.3400000000000002E-2}]
[null,"M1098","Brita 0 (pedrisco) ",5914647,0.22184999999999999,"t",null,2.06,null,0.45700000000000002]
[null,"M0191","Brita 1",5914647,0.18326999999999999,"t",null,2.06,null,0.3775]
[null,"M0344","Cal hidratada - a granel",5914363,1.4460000000000001E-2,"t",null,21.74,null,0.31430000000000002]
[null,"M1135","Pó de pedra",5914647,0.50446999999999997,"t",null,2.06,null,{"$f":"ROUNDDOWN(E401*H401,4)","v":1.0391999999999999}]
[null,null,null,"Custo unitário total de tempo fixo",{"$nulls":5},{"$f":"SUM(J397:J401)","v":2.2713999999999999}]
[null,"F - MOMENTO DE TRANSPORTE",null,"Quantidade","Unidade","DMT",null,null,null,"Custo Unitário"]
[{"$nulls":5},"LN","RP","P"]
[null,"M0028","Areia média",4.052E-2,"tkm"]
[null,"M1098","Brita 0 (pedrisco) ",0.22184999999999999,"tkm"]
[null,"M0191","Brita 1",0.18326999999999999,"tkm"]
[null,"M0344","Cal hidratada - a granel",1.4460000000000001E-2,"tkm"]
[null,"M1135","Pó de pedra",0.50446999999999997,"tkm"]
[null,null,null,"Custo unitário total de transporte"]
[{"$nulls":5},"Custo unitário direto total",null,null,null,{"$f":"J395+J402","v":197.36500557310441}]
[null,"Obs."]
[]
[15,"1ª/GRD",{"$nulls":8},{"$f":"J450","v":0.76}]
[null,"OBRA:"," EXECUÇÃO DE RECAPEAMENTO ASFÁLTICO EM CBUQ - ESTRADA MUNICIPAL DA COMUNIDADE OLHOS D'ÁGUA - MONTES CLAROS - MG"]
[null,"Custo Unitário de Referência",null,null,"Minas Gerais"]
[{"$nulls":4}," Abril/2026",null,null,"Produção da equipe ",470.61,{"$f":"VLOOKUP(A414,ORÇAMENTO!$A$10:$L$46,7,1)","v":"TXKM"}]
[null,5915321,"TRANSPORTE COM CAMINHÃO BASCULANTE, EM VIA URBANA PAVIMENTADA",{"$nulls":5},"Valores em reais (R$)"]
[null,"A - EQUIPAMENTOS",null,"Quantidade","Utilização",null,"Custo Horário",null,null,"Custo"]
[{"$nulls":4},"Operativa","Improdutiva","Produtivo","Improdutivo",null,"Horário Total"]
[null,"E9667","Caminhão basculante com capacidade de 14 m³ - 210 kW",1,1,0,360.00439999999998,99.661799999999999,null,{"$f":"D421*(E421*G421+F421*H421)","v":360.00439999999998}]
[null,"-","-",null,null,null,0,0,null,{"$f":"D422*(E422*G422+F422*H422)","v":0}]
[{"$nulls":7},"Custo horário total de equipamentos",null,{"$f":"SUM(J421:J422)","v":360.00439999999998}]
[null,"B - MÃO DE OBRA",null,"Quantidade","Unidade",null,"Custo Horário","Custo Horário Total"]
[null,"-","-",null,"-",null,0,null,null,{"$f":"D425*G425","v":0}]
[null,"-","-",null,"-",null,0,null,null,{"$f":"D426*G426","v":0}]
[null,null,null,"Custo horário total de mão de obra",{"$nulls":5},{"$f":"SUM(J425:J426)","v":0}]
[null,null,null,"Custo horário total de execução",{"$nulls":5},{"$f":"J423+J427","v":360.00439999999998}]
[null,null,null,"Custo unitário de execução",{"$nulls":5},{"$f":"J428/I417","v":0.76497396995388955}]
[{"$nulls":7},"Custo do FIC",null,0]
[{"$nulls":7},"Custo do FIT",null,0]
[null,"C - MATERIAL",null,"Quantidade","Unidade",null,"Preço Unitário","Custo Unitário"]
[null,"-","-",0,"-",null,0,null,null,{"$f":"D433*G433","v":0}]
[null,"-","-",0,"-",null,0,null,null,{"$f":"D434*G434","v":0}]
[null,null,null,"Custo unitário total de material",{"$nulls":5},{"$f":"SUM(J433:J434)","v":0}]
[null,"D - ATIVIDADES AUXILIARES",null,"Quantidade","Unidade",null,"Custo Unitário","Custo Unitário"]
[null,"-","-",0,"-",null,0,null,null,{"$f":"D437*G437","v":0}]
[null,"-","-",0,"-",null,0,null,null,{"$f":"D438*G438","v":0}]
[null,null,null,"Custo total de atividades auxiliares",{"$nulls":5},{"$f":"SUM(J437:J438)","v":0}]
[{"$nulls":7},"Subtotal",null,{"$f":"J429+J435+J439+J430+J431","v":0.76497396995388955}]
[null,"E - TEMPO FIXO",null,"Código","Quantidade","Unidade",null,"Custo Unitário","Custo Unitário"]
[null,"-","-","-",0,"t",null,0,null,{"$f":"ROUNDDOWN(E442*H442,4)","v":0}]
[null,"-","-","-",0,"t",null,0,null,{"$f":"ROUNDDOWN(E443*H443,4)","v":0}]
[null,null,null,"Custo unitário total de tempo fixo",{"$nulls":5},{"$f":"SUM(J442:J443)","v":0}]
[null,"F - MOMENTO DE TRANSPORTE",null,"Quantidade","Unidade","DMT",null,null,null,"Custo Unitário"]
[{"$nulls":5},"LN","RP","P"]
[null,"-","-",0,"tkm"]
[null,"-","-",0,"tkm"]
[null,null,null,"Custo unitário total de transporte"]
[{"$nulls":5},"Custo unitário direto total",null,null,null,{"$f":"TRUNC(J440+J444,2)","v":0.76}]
[null,"Obs."]
[]
[16,"1ª/GRD",{"$nulls":8},{"$f":"J489","v":0.91}]
[null,"OBRA:"," EXECUÇÃO DE RECAPEAMENTO ASFÁLTICO EM CBUQ - ESTRADA MUNICIPAL DA COMUNIDADE OLHOS D'ÁGUA - MONTES CLAROS - MG"]
[null,"Custo Unitário de Referência",null,null,"Minas Gerais"]
[{"$nulls":4}," Abril/2026",null,null,"Produção da equipe ",231.3,{"$f":"VLOOKUP(A453,ORÇAMENTO!$A$10:$L$46,7,1)","v":"TXKM"}]
[null,5914434,"TRANSPORTE COM CAMINHÃO CARROCERIA 9T, EM VIA URBANA PAVIMENTADA",{"$nulls":5},"Valores em reais (R$)"]
[null,"A - EQUIPAMENTOS",null,"Quantidade","Utilização",null,"Custo Horário",null,null,"Custo"]
[{"$nulls":4},"Operativa","Improdutiva","Produtivo","Improdutivo",null,"Horário Total"]
[null,"E9508","Caminhão carroceria com capacidade de 9 t - 136 kW",1,1,0,212.36160000000001,77.965900000000005,null,{"$f":"D460*(E460*G460+F460*H460)","v":212.36160000000001}]
[null,"-","-",null,null,null,0,0,null,{"$f":"D461*(E461*G461+F461*H461)","v":0}]
[{"$nulls":7},"Custo horário total de equipamentos",null,{"$f":"SUM(J460:J461)","v":212.36160000000001}]
[null,"B - MÃO DE OBRA",null,"Quantidade","Unidade",null,"Custo Horário","Custo Horário Total"]
[null,"-","-",0,"-",null,0,null,null,{"$f":"D464*G464","v":0}]
[null,"-","-",0,"-",null,0,null,null,{"$f":"D465*G465","v":0}]
[null,null,null,"Custo horário total de mão de obra",{"$nulls":5},{"$f":"SUM(J464:J465)","v":0}]
[null,null,null,"Custo horário total de execução",{"$nulls":5},{"$f":"J462+J466","v":212.36160000000001}]
[null,null,null,"Custo unitário de execução",{"$nulls":5},{"$f":"J467/I456","v":0.91812191958495459}]
[{"$nulls":7},"Custo do FIC",null,0]
[{"$nulls":7},"Custo do FIT",null,0]
[null,"C - MATERIAL",null,"Quantidade","Unidade",null,"Preço Unitário","Custo Unitário"]
[null,"-","-",0,"-",null,0,null,null,{"$f":"D472*G472","v":0}]
[null,"-","-",0,"-",null,0,null,null,{"$f":"D473*G473","v":0}]
[null,null,null,"Custo unitário total de material",{"$nulls":5},{"$f":"SUM(J472:J473)","v":0}]
[null,"D - ATIVIDADES AUXILIARES",null,"Quantidade","Unidade",null,"Custo Unitário","Custo Unitário"]
[null,"-","-",0,"-",null,0,null,null,{"$f":"D476*G476","v":0}]
[null,"-","-",0,"-",null,0,null,null,{"$f":"D477*G477","v":0}]
[null,null,null,"Custo total de atividades auxiliares",{"$nulls":5},{"$f":"SUM(J476:J477)","v":0}]
[{"$nulls":7},"Subtotal",null,{"$f":"J468+J474+J478+J469+J470","v":0.91812191958495459}]
[null,"E - TEMPO FIXO",null,"Código","Quantidade","Unidade",null,"Custo Unitário","Custo Unitário"]
[null,"-","-","-",0,"t",null,0,null,{"$f":"ROUNDDOWN(E481*H481,4)","v":0}]
[null,"-","-","-",0,"t",null,0,null,{"$f":"ROUNDDOWN(E482*H482,4)","v":0}]
[null,null,null,"Custo unitário total de tempo fixo",{"$nulls":5},{"$f":"SUM(J481:J482)","v":0}]
[null,"F - MOMENTO DE TRANSPORTE",null,"Quantidade","Unidade","DMT",null,null,null,"Custo Unitário"]
[{"$nulls":5},"LN","RP","P"]
[null,"-","-",0,"tkm"]
[null,"-","-",0,"tkm"]
[null,null,null,"Custo unitário total de transporte"]
[{"$nulls":5},"Custo unitário direto total",null,null,null,{"$f":"TRUNC(J479+J483,2)","v":0.91}]
[null,"Obs."]
[]
[17,"1ª/GRD",{"$nulls":8},{"$f":"J528","v":0.98}]
[null,"OBRA:"," EXECUÇÃO DE RECAPEAMENTO ASFÁLTICO EM CBUQ - ESTRADA MUNICIPAL DA COMUNIDADE OLHOS D'ÁGUA - MONTES CLAROS - MG"]
[null,"Custo Unitário de Referência",null,null,"Minas Gerais"]
[{"$nulls":4}," Abril/2026",null,null,"Produção da equipe ",224.1,{"$f":"VLOOKUP(A492,ORÇAMENTO!$A$10:$L$46,7,1)","v":"TXKM"}]
[null,5914612,"TRANSPORTE DE MASSA ASFÁLTICA COM CAMINHÃO BASCULANTE, EM VIA URBANA PAVIMENTADA ",{"$nulls":5},"Valores em reais (R$)"]
[null,"A - EQUIPAMENTOS",null,"Quantidade","Utilização",null,"Custo Horário",null,null,"Custo"]
[{"$nulls":4},"Operativa","Improdutiva","Produtivo","Improdutivo",null,"Horário Total"]
[null,"E9520","Caminhão com caçamba térmica com capacidade de 6 m³ - 136 kW",1,1,0,221.13939999999999,82.288300000000007,null,{"$f":"D499*(E499*G499+F499*H499)","v":221.13939999999999}]
[null,"-","-",null,null,null,0,0,null,{"$f":"D500*(E500*G500+F500*H500)","v":0}]
[{"$nulls":7},"Custo horário total de equipamentos",null,{"$f":"SUM(J499:J500)","v":221.13939999999999}]
[null,"B - MÃO DE OBRA",null,"Quantidade","Unidade",null,"Custo Horário","Custo Horário Total"]
[null,"-","-",0,"-",null,0,null,null,{"$f":"D503*G503","v":0}]
[null,"-","-",0,"-",null,0,null,null,{"$f":"D504*G504","v":0}]
[null,null,null,"Custo horário total de mão de obra",{"$nulls":5},{"$f":"SUM(J503:J504)","v":0}]
[null,null,null,"Custo horário total de execução",{"$nulls":5},{"$f":"J501+J505","v":221.13939999999999}]
[null,null,null,"Custo unitário de execução",{"$nulls":5},{"$f":"J506/I495","v":0.98678893351182506}]
[{"$nulls":7},"Custo do FIC",null,0]
[{"$nulls":7},"Custo do FIT",null,0]
[null,"C - MATERIAL",null,"Quantidade","Unidade",null,"Preço Unitário","Custo Unitário"]
[null,"-","-",0,"-",null,0,null,null,{"$f":"D511*G511","v":0}]
[null,"-","-",0,"-",null,0,null,null,{"$f":"D512*G512","v":0}]
[null,null,null,"Custo unitário total de material",{"$nulls":5},{"$f":"SUM(J511:J512)","v":0}]
[null,"D - ATIVIDADES AUXILIARES",null,"Quantidade","Unidade",null,"Custo Unitário","Custo Unitário"]
[null,"-","-",0,"-",null,0,null,null,{"$f":"D515*G515","v":0}]
[null,"-","-",0,"-",null,0,null,null,{"$f":"D516*G516","v":0}]
[null,null,null,"Custo total de atividades auxiliares",{"$nulls":5},{"$f":"SUM(J515:J516)","v":0}]
[{"$nulls":7},"Subtotal",null,{"$f":"J507+J513+J517+J508+J509","v":0.98678893351182506}]
[null,"E - TEMPO FIXO",null,"Código","Quantidade","Unidade",null,"Custo Unitário","Custo Unitário"]
[null,"-","-","-",0,"t",null,0,null,{"$f":"ROUNDDOWN(E520*H520,4)","v":0}]
[null,"-","-","-",0,"t",null,0,null,{"$f":"ROUNDDOWN(E521*H521,4)","v":0}]
[null,null,null,"Custo unitário total de tempo fixo",{"$nulls":5},{"$f":"SUM(J520:J521)","v":0}]
[null,"F - MOMENTO DE TRANSPORTE",null,"Quantidade","Unidade","DMT",null,null,null,"Custo Unitário"]
[{"$nulls":5},"LN","RP","P"]
[null,"-","-",0,"tkm"]
[null,"-","-",0,"tkm"]
[null,null,null,"Custo unitário total de transporte"]
[{"$nulls":5},"Custo unitário direto total",null,null,null,{"$f":"TRUNC(J518+J522,2)","v":0.98}]
[null,"Obs."]
[]
[18,"1ª/GRD",{"$nulls":8},{"$f":"J567","v":2.4700000000000002}]
[null,"OBRA:"," EXECUÇÃO DE RECAPEAMENTO ASFÁLTICO EM CBUQ - ESTRADA MUNICIPAL DA COMUNIDADE OLHOS D'ÁGUA - MONTES CLAROS - MG"]
[null,"Custo Unitário de Referência",null,null,"Minas Gerais"]
[{"$nulls":4}," Abril/2026",null,null,"Produção da equipe ",149.4,{"$f":"VLOOKUP(A531,ORÇAMENTO!$A$10:$L$46,7,1)","v":"TXKM"}]
[null,5914622,"TRANSPORTE COM CAMINHÃO TANQUE DE TRANSPORTE DE MATERIAL ASFÁLTICO DE 30000 L, EM VIA URBANA PAVIMENTADA ",{"$nulls":5},"Valores em reais (R$)"]
[null,"A - EQUIPAMENTOS",null,"Quantidade","Utilização",null,"Custo Horário",null,null,"Custo"]
[{"$nulls":4},"Operativa","Improdutiva","Produtivo","Improdutivo",null,"Horário Total"]
[null,"E9509","Caminhão tanque distribuidor de asfalto com capacidade de 6.000 l - 7 kW/136 kW",1,1,0,369.22500000000002,112.145,null,{"$f":"D538*(E538*G538+F538*H538)","v":369.22500000000002}]
[null,"-","-",null,null,null,0,0,null,{"$f":"D539*(E539*G539+F539*H539)","v":0}]
[{"$nulls":7},"Custo horário total de equipamentos",null,{"$f":"SUM(J538:J539)","v":369.22500000000002}]
[null,"B - MÃO DE OBRA",null,"Quantidade","Unidade",null,"Custo Horário","Custo Horário Total"]
[null,"-","-",0,"-",null,0,null,null,{"$f":"D542*G542","v":0}]
[null,"-","-",0,"-",null,0,null,null,{"$f":"D543*G543","v":0}]
[null,null,null,"Custo horário total de mão de obra",{"$nulls":5},{"$f":"SUM(J542:J543)","v":0}]
[null,null,null,"Custo horário total de execução",{"$nulls":5},{"$f":"J540+J544","v":369.22500000000002}]
[null,null,null,"Custo unitário de execução",{"$nulls":5},{"$f":"J545/I534","v":2.4713855421686746}]
[{"$nulls":7},"Custo do FIC",null,0]
[{"$nulls":7},"Custo do FIT",null,0]
[null,"C - MATERIAL",null,"Quantidade","Unidade",null,"Preço Unitário","Custo Unitário"]
[null,"-","-",996,"-",null,0,null,null,{"$f":"D550*G550","v":0}]
[null,"-","-",89.28,"-",null,0,null,null,{"$f":"D551*G551","v":0}]
[null,null,null,"Custo unitário total de material",{"$nulls":5},{"$f":"SUM(J550:J551)","v":0}]
[null,"D - ATIVIDADES AUXILIARES",null,"Quantidade","Unidade",null,"Custo Unitário","Custo Unitário"]
[null,"-","-",0,"-",null,0,null,null,{"$f":"D554*G554","v":0}]
[null,"-","-",0,"-",null,0,null,null,{"$f":"D555*G555","v":0}]
[null,null,null,"Custo total de atividades auxiliares",{"$nulls":5},{"$f":"SUM(J554:J555)","v":0}]
[{"$nulls":7},"Subtotal",null,{"$f":"J546+J552+J556+J547+J548","v":2.4713855421686746}]
[null,"E - TEMPO FIXO",null,"Código","Quantidade","Unidade",null,"Custo Unitário","Custo Unitário"]
[null,"-","-","-",0,"t",null,0,null,{"$f":"ROUNDDOWN(E559*H559,4)","v":0}]
[null,"-","-","-",0,"t",null,0,null,{"$f":"ROUNDDOWN(E560*H560,4)","v":0}]
[null,null,null,"Custo unitário total de tempo fixo",{"$nulls":5},{"$f":"SUM(J559:J560)","v":0}]
[null,"F - MOMENTO DE TRANSPORTE",null,"Quantidade","Unidade","DMT",null,null,null,"Custo Unitário"]
[{"$nulls":5},"LN","RP","P"]
[null,"-","-",0,"tkm"]
[null,"-","-",0,"tkm"]
[null,null,null,"Custo unitário total de transporte"]
[{"$nulls":5},"Custo unitário direto total",null,null,null,{"$f":"TRUNC(J557+J561,2)","v":2.4700000000000002}]
[null,"Obs."]
[]
[19,"1ª/GRD",{"$nulls":8},{"$f":"J606","v":39.880000000000003}]
[null,"OBRA:"," EXECUÇÃO DE RECAPEAMENTO ASFÁLTICO EM CBUQ - ESTRADA MUNICIPAL DA COMUNIDADE OLHOS D'ÁGUA - MONTES CLAROS - MG"]
[null,"Custo Unitário de Referência",null,null,"Minas Gerais"]
[{"$nulls":4}," Abril/2026",null,null,"Produção da equipe ",4.3554006968641117,{"$f":"VLOOKUP(A570,ORÇAMENTO!$A$10:$L$46,7,1)","v":"M"}]
[null,94273,"ASSENTAMENTO DE GUIA (MEIO-FIO) PRÉ-MOLDADO DE CONCRETO - 100X15X13X30 CM (COMPRIMENTO X BASE INFERIOR X BASE SUPERIOR X ALTURA) - USO VIÁRIO",{"$nulls":5},"Valores em reais (R$)"]
[null,"A - EQUIPAMENTOS",null,"Quantidade","Utilização",null,"Custo Horário",null,null,"Custo"]
[{"$nulls":4},"Operativa","Improdutiva","Produtivo","Improdutivo",null,"Horário Total"]
[null,"-","-",null,null,null,0,0,null,{"$f":"D577*(E577*G577+F577*H577)","v":0}]
[null,"-","-",null,null,null,0,0,null,{"$f":"D578*(E578*G578+F578*H578)","v":0}]
[{"$nulls":7},"Custo horário total de equipamentos",null,{"$f":"SUM(J577:J578)","v":0}]
[null,"B - MÃO DE OBRA",null,"Quantidade","Unidade",null,"Custo Horário","Custo Horário Total"]
[null,"P9824","Servente",1,"h",null,22.6355,null,null,{"$f":"D581*G581","v":22.6355}]
[null,"P9821","Pedreiro",1,"h",null,28.9117,null,null,{"$f":"D582*G582","v":28.9117}]
[null,null,null,"Custo horário total de mão de obra",{"$nulls":5},{"$f":"SUM(J581:J582)","v":51.547200000000004}]
[null,null,null,"Custo horário total de execução",{"$nulls":5},{"$f":"J579+J583","v":51.547200000000004}]
[null,null,null,"Custo unitário de execução",{"$nulls":5},{"$f":"J584/I573","v":11.83523712}]
[{"$nulls":7},"Custo do FIC",null,0]
[{"$nulls":7},"Custo do FIT",null,0]
[null,"C - MATERIAL",null,"Quantidade","Unidade",null,"Preço Unitário","Custo Unitário"]
[null,"M0082","Areia média lavada",6.6E-3,"m³",null,151.07210000000001,null,null,{"$f":"D589*G589","v":0.99707586000000004}]
[null,4059,"Meio-fio ou guia de concreto, pré-moldado, comp.1,0m x 30 x 12/15 cm (H X L1/L2)",1.0049999999999999,"m",null,26,"COTAÇÃO PREBOC",null,26.129999999999995]
[null,null,null,"Custo unitário total de material",{"$nulls":5},{"$f":"SUM(J589:J590)","v":27.127075859999994}]
[null,"D - ATIVIDADES AUXILIARES",null,"Quantidade","Unidade",null,"Custo Unitário","Custo Unitário"]
[null,1109669,"Argamassa de cimento e areia 1:3 - confecção em betoneira e lançamento manual - areia comercial",1.8E-3,"m³",null,511.74,null,null,{"$f":"D593*G593","v":0.92113199999999995}]
[null,"-","-",0,"-",null,0,null,null,{"$f":"D594*G594","v":0}]
[null,null,null,"Custo total de atividades auxiliares",{"$nulls":5},{"$f":"SUM(J593:J594)","v":0.92113199999999995}]
[{"$nulls":7},"Subtotal",null,{"$f":"J585+J591+J595+J586+J587","v":39.883444979999993}]
[null,"E - TEMPO FIXO",null,"Código","Quantidade","Unidade",null,"Custo Unitário","Custo Unitário"]
[null,"-","-","-",null,"t",null,0,null,{"$f":"ROUNDDOWN(E598*H598,4)","v":0}]
[null,"-","-","-",null,"t",null,0,null,{"$f":"ROUNDDOWN(E599*H599,4)","v":0}]
[null,null,null,"Custo unitário total de tempo fixo",{"$nulls":5},{"$f":"SUM(J598:J599)","v":0}]
[null,"F - MOMENTO DE TRANSPORTE",null,"Quantidade","Unidade","DMT",null,null,null,"Custo Unitário"]
[{"$nulls":5},"LN","RP","P"]
[null,"-","-",0,"tkm","5914449","5914464","5914479"]
[null,"-","-",0,"tkm"]
[null,null,null,"Custo unitário total de transporte"]
[{"$nulls":5},"Custo unitário direto total",null,null,null,{"$f":"TRUNC(J596+J600,2)","v":39.880000000000003},68.44]
[null,"Obs."]
[]
[20,"1ª/GRD",{"$nulls":8},{"$f":"J647","v":25.6}]
[null,"OBRA:"," EXECUÇÃO DE RECAPEAMENTO ASFÁLTICO EM CBUQ - ESTRADA MUNICIPAL DA COMUNIDADE OLHOS D'ÁGUA - MONTES CLAROS - MG"]
[null,"Custo Unitário de Referência",null,null,"Minas Gerais"]
[{"$nulls":4}," Abril/2026",null,null,"Produção da equipe ",4.2992261392949267,{"$f":"VLOOKUP(A609,ORÇAMENTO!$A$10:$L$46,7,1)","v":"M"}]
[null,"94287a","EXECUÇÃO DE SARJETA EM CONCRETO USINADO, MOLDADO IN LOCO - 30CM DE BASE X 5CM DE ALTURA",{"$nulls":5},"Valores em reais (R$)"]
[null,"A - EQUIPAMENTOS",null,"Quantidade","Utilização",null,"Custo Horário",null,null,"Custo"]
[{"$nulls":4},"Operativa","Improdutiva","Produtivo","Improdutivo",null,"Horário Total"]
[null,"-","-",null,null,null,0,0,null,{"$f":"D616*(E616*G616+F616*H616)","v":0}]
[null,"-","-",null,null,null,0,0,null,{"$f":"D617*(E617*G617+F617*H617)","v":0}]
[{"$nulls":7},"Custo horário total de equipamentos",null,{"$f":"SUM(J616:J617)","v":0}]
[null,"B - MÃO DE OBRA",null,"Quantidade","Unidade",null,"Custo Horário","Custo Horário Total"]
[null,"P9821","Pedreiro",1,"h",null,28.9117,null,null,{"$f":"D620*G620","v":28.9117}]
[null,"P9824","Servente",1,"h",null,22.6355,null,null,{"$f":"D621*G621","v":22.6355}]
[null,null,null,"Custo horário total de mão de obra",{"$nulls":5},{"$f":"SUM(J620:J621)","v":51.547200000000004}]
[null,null,null,"Custo horário total de execução",{"$nulls":5},{"$f":"J618+J622","v":51.547200000000004}]
[null,null,null,"Custo unitário de execução",{"$nulls":5},{"$f":"J623/I612","v":11.989878720000002}]
[{"$nulls":7},"Custo do FIC",null,0]
[{"$nulls":7},"Custo do FIT",null,0]
[null,"C - MATERIAL",null,"Quantidade","Unidade",null,"Preço Unitário","Custo Unitário"]
[null,"M0082","Areia média lavada",9.9000000000000008E-3,"m³",null,151.07210000000001,null,null,{"$f":"D628*G628","v":1.4956137900000002}]
[null,"M0286","Tábua - E = 2,5 cm e L = 30 cm",8.3299999999999999E-2,"m",null,15.34,null,null,{"$f":"D629*G629","v":1.277822}]
[null,"M0451","Concreto usinado - fck = 20 MPa (comercial)",1.8800000000000001E-2,"m³",null,554.76,"SINAPI - 34.492",null,10.429488000000001]
[null,"M1358","Sarrafo em madeira de terceira - E = 2,5 cm e L = 5 cm",0.2,"m",null,2.08,null,null,0.41600000000000004]
[null,null,null,"Custo unitário total de material",{"$nulls":5},{"$f":"SUM(J628:J631)","v":13.618923790000002}]
[null,"D - ATIVIDADES AUXILIARES",null,"Quantidade","Unidade",null,"Custo Unitário","Custo Unitário"]
[null,"-","-",0,"-",null,0,null,null,{"$f":"D634*G634","v":0}]
[null,"-","-",0,"-",null,0,null,null,{"$f":"D635*G635","v":0}]
[null,null,null,"Custo total de atividades auxiliares",{"$nulls":5},{"$f":"SUM(J634:J635)","v":0}]
[{"$nulls":7},"Subtotal",null,{"$f":"J624+J632+J636+J625+J626","v":25.608802510000004}]
[null,"E - TEMPO FIXO",null,"Código","Quantidade","Unidade",null,"Custo Unitário","Custo Unitário"]
[null,"-","-","-",0,"t",null,0,null,{"$f":"ROUNDDOWN(E639*H639,4)","v":0}]
[null,"-","-","-",0,"t",null,0,null,{"$f":"ROUNDDOWN(E640*H640,4)","v":0}]
[null,null,null,"Custo unitário total de tempo fixo",{"$nulls":5},{"$f":"SUM(J639:J640)","v":0}]
[null,"F - MOMENTO DE TRANSPORTE",null,"Quantidade","Unidade","DMT",null,null,null,"Custo Unitário"]
[{"$nulls":5},"LN","RP","P"]
[null,"-","-",0,"tkm"]
[null,"-","-",0,"tkm"]
[null,null,null,"Custo unitário total de transporte"]
[{"$nulls":5},"Custo unitário direto total",null,null,null,{"$f":"TRUNC(J637+J641,2)","v":25.6},37.17]
[null,"Obs."]
[]
[21,"1ª/GRD",{"$nulls":8},{"$f":"J688","v":2.25}]
[null,"OBRA:"," EXECUÇÃO DE RECAPEAMENTO ASFÁLTICO EM CBUQ - ESTRADA MUNICIPAL DA COMUNIDADE OLHOS D'ÁGUA - MONTES CLAROS - MG"]
[null,"Custo Unitário de Referência",null,null,"Minas Gerais"]
[{"$nulls":4}," Abril/2026",null,null,"Produção da equipe ",155.59,{"$f":"VLOOKUP(A650,ORÇAMENTO!$A$10:$L$46,7,1)","v":"M2"}]
[null,4915724,"CAIAÇÃO COM FIXADOR DE CAL",{"$nulls":5},"Valores em reais (R$)"]
[null,"A - EQUIPAMENTOS",null,"Quantidade","Utilização",null,"Custo Horário",null,null,"Custo"]
[{"$nulls":4},"Operativa","Improdutiva","Produtivo","Improdutivo",null,"Horário Total"]
[null,"E9256","Equipamento para pintura com cal rebocável com dois bicos aplicadores e capacidade de 2.200 l",1,1,0,41.451300000000003,34.831899999999997,null,{"$f":"D657*(E657*G657+F657*H657)","v":41.451300000000003}]
[null,"E9156","Soprador de ar costal - 2,6 kW",1,1,0,5.9191000000000003,0.49049999999999999,null,{"$f":"D658*(E658*G658+F658*H658)","v":5.9191000000000003}]
[null,"E9577","Trator agrícola sobre pneus - 77 kW",1,1,0,192.7029,69.790599999999998,null,{"$f":"D659*(E659*G659+F659*H659)","v":192.7029}]
[{"$nulls":7},"Custo horário total de equipamentos",null,{"$f":"SUM(J657:J659)","v":240.07330000000002}]
[null,"B - MÃO DE OBRA",null,"Quantidade","Unidade",null,"Custo Horário","Custo Horário Total"]
[null,"P9824","Servente",2,"h",null,22.6355,null,null,{"$f":"D662*G662","v":45.271000000000001}]
[null,"-","-",0,"-",null,0,null,null,{"$f":"D663*G663","v":0}]
[null,null,null,"Custo horário total de mão de obra",{"$nulls":5},{"$f":"SUM(J662:J663)","v":45.271000000000001}]
[null,null,null,"Custo horário total de execução",{"$nulls":5},{"$f":"J660+J664","v":285.34430000000003}]
[null,null,null,"Custo unitário de execução",{"$nulls":5},{"$f":"J665/I653","v":1.8339501253293915}]
[{"$nulls":7},"Custo do FIC",null,2.5700000000000001E-2]
[{"$nulls":7},"Custo do FIT",null,"-"]
[null,"C - MATERIAL",null,"Quantidade","Unidade",null,"Preço Unitário","Custo Unitário"]
[null,"M0345","Cal hidratada - saco",0.41654999999999998,"kg",null,0.72989999999999999,null,null,{"$f":"D670*G670","v":0.30403984499999998}]
[null,"M0729","Fixador de cal para pintura",6.8999999999999997E-4,"l",null,4.6369999999999996,null,null,{"$f":"D671*G671","v":3.1995299999999995E-3}]
[null,"M0043","Óleo diesel",1.389E-2,"l",null,6.6,null,null,9.1673999999999992E-2]
[null,null,null,"Custo unitário total de material",{"$nulls":5},{"$f":"SUM(J670:J672)","v":0.39891337499999996}]
[null,"D - ATIVIDADES AUXILIARES",null,"Quantidade","Unidade",null,"Custo Unitário","Custo Unitário"]
[null,"-","-",0,"-",null,0,null,null,{"$f":"D675*G675","v":0}]
[null,"-","-",0,"-",null,0,null,null,{"$f":"D676*G676","v":0}]
[null,null,null,"Custo total de atividades auxiliares",{"$nulls":5},{"$f":"SUM(J675:J676)","v":0}]
[{"$nulls":7},"Subtotal",null,{"$f":"J666+J673+J677+J667","v":2.2585635003293913}]
[null,"E - TEMPO FIXO",null,"Código","Quantidade","Unidade",null,"Custo Unitário","Custo Unitário"]
[null,"-","-","-",0,"t",null,0,null,{"$f":"ROUNDDOWN(E680*H680,4)","v":0}]
[null,"-","-","-",0,"t",null,0,null,{"$f":"ROUNDDOWN(E681*H681,4)","v":0}]
[null,null,null,"Custo unitário total de tempo fixo",{"$nulls":5},{"$f":"SUM(J680:J681)","v":0}]
[null,"F - MOMENTO DE TRANSPORTE",null,"Quantidade","Unidade","DMT",null,null,null,"Custo Unitário"]
[{"$nulls":5},"LN","RP","P"]
[null,"-","-",0,"tkm"]
[null,"-","-",0,"tkm"]
[null,null,null,"Custo unitário total de transporte"]
[{"$nulls":5},"Custo unitário direto total",null,null,null,{"$f":"TRUNC(J678+J682,2)","v":2.25}]
[null,"Obs."]
[]
[22,"1ª/GRD",{"$nulls":8},{"$f":"J729","v":200.92}]
[null,"OBRA:"," EXECUÇÃO DE RECAPEAMENTO ASFÁLTICO EM CBUQ - ESTRADA MUNICIPAL DA COMUNIDADE OLHOS D'ÁGUA - MONTES CLAROS - MG"]
[null,"Custo Unitário de Referência",null,null,"Minas Gerais"]
[{"$nulls":4}," Abril/2026",null,null,"Produção da equipe ",1,{"$f":"VLOOKUP(A691,ORÇAMENTO!$A$10:$L$46,7,1)","v":"UNID."}]
[null,2003103,"ENTRADA PARA DESCIDA D'ÁGUA - EDA 01 - AREIA E BRITA COMERCIAIS",{"$nulls":5},"Valores em reais (R$)"]
[null,"A - EQUIPAMENTOS",null,"Quantidade","Utilização",null,"Custo Horário",null,null,"Custo"]
[{"$nulls":4},"Operativa","Improdutiva","Produtivo","Improdutivo",null,"Horário Total"]
[null,"-","-",null,null,null,0,0,null,{"$f":"D698*(E698*G698+F698*H698)","v":0}]
[null,"-","-",null,null,null,0,0,null,{"$f":"D699*(E699*G699+F699*H699)","v":0}]
[{"$nulls":7},"Custo horário total de equipamentos",null,{"$f":"SUM(J698:J699)","v":0}]
[null,"B - MÃO DE OBRA",null,"Quantidade","Unidade",null,"Custo Horário","Custo Horário Total"]
[null,"-","-",null,"-",null,0,null,null,{"$f":"D702*G702","v":0}]
[{"$nulls":9},{"$f":"D703*G703","v":0}]
[null,null,null,"Custo horário total de mão de obra",{"$nulls":5},{"$f":"SUM(J702:J703)","v":0}]
[null,null,null,"Custo horário total de execução",{"$nulls":5},{"$f":"J700+J704","v":0}]
[null,null,null,"Custo unitário de execução",{"$nulls":5},{"$f":"J705/I694","v":0}]
[{"$nulls":7},"Custo do FIC",null,0]
[{"$nulls":7},"Custo do FIT",null,0]
[null,"C - MATERIAL",null,"Quantidade","Unidade",null,"Preço Unitário","Custo Unitário"]
[null,"-","-",null,"-",null,0,null,null,{"$f":"D710*G710","v":0}]
[null,"-","-",null,"-",null,0,null,null,0]
[null,null,null,"Custo unitário total de material",{"$nulls":5},{"$f":"SUM(J710:J711)","v":0}]
[null,"D - ATIVIDADES AUXILIARES",null,"Quantidade","Unidade",null,"Custo Unitário","Custo Unitário"]
[null,4805756,"Apiloamento manual de superfície com espessura de 15 cm",1.2107000000000001,"m²",null,5.25,null,null,{"$f":"D714*G714","v":6.3561750000000004}]
[null,1107892,"Concreto fck = 20 MPa - confecção em betoneira e lançamento manual - areia e brita comerciais",0.17910000000000001,"m³",null,488.59,null,null,{"$f":"D715*G715","v":87.506468999999996}]
[null,4805750,"Escavação manual em material de 1ª categoria na profundidade de até 1 m",0.1211,"m³",null,46.65,null,null,5.6493149999999996]
[null,3103302,"Fôrmas de tábuas de pinho para dispositivos de drenagem - utilização de 3 vezes - confecção, instalação e retirada",1.2862,"m²",null,78.849999999999994,null,null,{"$f":"D717*G717","v":101.41686999999999}]
[null,null,null,"Custo total de atividades auxiliares",{"$nulls":5},{"$f":"SUM(J714:J717)","v":200.92882899999998}]
[{"$nulls":7},"Subtotal",null,{"$f":"J706+J712+J718+J707+J708","v":200.92882899999998}]
[null,"E - TEMPO FIXO",null,"Código","Quantidade","Unidade",null,"Custo Unitário","Custo Unitário"]
[null,"-","-","-",0,"t",null,0,null,{"$f":"ROUNDDOWN(E721*H721,4)","v":0}]
[null,"-","-","-",0,"t",null,0,null,{"$f":"ROUNDDOWN(E722*H722,4)","v":0}]
[null,null,null,"Custo unitário total de tempo fixo",{"$nulls":5},{"$f":"SUM(J721:J722)","v":0}]
[null,"F - MOMENTO DE TRANSPORTE",null,"Quantidade","Unidade","DMT",null,null,null,"Custo Unitário"]
[{"$nulls":5},"LN","RP","P"]
[null,"-","-",0,"tkm"]
[null,"-","-",0,"tkm"]
[null,null,null,"Custo unitário total de transporte"]
[{"$nulls":5},"Custo unitário direto total",null,null,null,{"$f":"TRUNC(J719+J723,2)","v":200.92}]
[null,"Obs."]
[]
[23,"1ª/GRD",{"$nulls":8},{"$f":"J770","v":238.45}]
[null,"OBRA:"," EXECUÇÃO DE RECAPEAMENTO ASFÁLTICO EM CBUQ - ESTRADA MUNICIPAL DA COMUNIDADE OLHOS D'ÁGUA - MONTES CLAROS - MG"]
[null,"Custo Unitário de Referência",null,null,"Minas Gerais"]
[{"$nulls":4}," Abril/2026",null,null,"Produção da equipe ",1,{"$f":"VLOOKUP(A732,ORÇAMENTO!$A$10:$L$46,7,1)","v":"M"}]
[null,2003389,"DESCIDA D'ÁGUA DE ATERRO TIPO RÁPIDO - DAR 01 - AREIA E BRITA COMERCIAIS",{"$nulls":5},"Valores em reais (R$)"]
[null,"A - EQUIPAMENTOS",null,"Quantidade","Utilização",null,"Custo Horário",null,null,"Custo"]
[{"$nulls":4},"Operativa","Improdutiva","Produtivo","Improdutivo",null,"Horário Total"]
[null,"-","-",null,null,null,0,0,null,{"$f":"D739*(E739*G739+F739*H739)","v":0}]
[null,"-","-",null,null,null,0,0,null,{"$f":"D740*(E740*G740+F740*H740)","v":0}]
[{"$nulls":7},"Custo horário total de equipamentos",null,{"$f":"SUM(J739:J740)","v":0}]
[null,"B - MÃO DE OBRA",null,"Quantidade","Unidade",null,"Custo Horário","Custo Horário Total"]
[null,"P9821","Pedreiro",0.25,"h",null,28.9117,null,null,{"$f":"D743*G743","v":7.2279249999999999}]
[null,"P9824","Servente",2,"h",null,22.6355,null,null,{"$f":"D744*G744","v":45.271000000000001}]
[null,null,null,"Custo horário total de mão de obra",{"$nulls":5},{"$f":"SUM(J743:J744)","v":52.498925}]
[null,null,null,"Custo horário total de execução",{"$nulls":5},{"$f":"J741+J745","v":52.498925}]
[null,null,null,"Custo unitário de execução",{"$nulls":5},{"$f":"J746/I735","v":52.498925}]
[{"$nulls":7},"Custo do FIC",null,1.7303999999999999]
[{"$nulls":7},"Custo do FIT",null,0]
[null,"C - MATERIAL",null,"Quantidade","Unidade",null,"Preço Unitário","Custo Unitário"]
[null,"M2117","Meio tubo de concreto simples - D = 0,40 m",1,"m",null,46.715200000000003,null,null,{"$f":"D751*G751","v":46.715200000000003}]
[null,null,null,"Custo unitário total de material",{"$nulls":5},{"$f":"SUM(J751:J751)","v":46.715200000000003}]
[null,"D - ATIVIDADES AUXILIARES",null,"Quantidade","Unidade",null,"Custo Unitário","Custo Unitário"]
[null,4805756,"Apiloamento manual de superfície com espessura de 15 cm",0.68,"m²",null,5.25,null,null,{"$f":"D754*G754","v":3.5700000000000003}]
[null,1109669,"Argamassa de cimento e areia 1:3 - confecção em betoneira e lançamento manual - areia comercial",4.0000000000000002E-4,"m³",null,511.74,null,null,{"$f":"D755*G755","v":0.20469600000000002}]
[null,1107892,"Concreto fck = 20 MPa - confecção em betoneira e lançamento manual - areia e brita comerciais",0.1389,"m³",null,488.59,null,null,{"$f":"D756*G756","v":67.865150999999997}]
[null,4805750,"Escavação manual em material de 1ª categoria na profundidade de até 1 m",0.17710000000000001,"m³",null,46.65,null,null,{"$f":"D757*G757","v":8.2617150000000006}]
[null,3103302,"Fôrmas de tábuas de pinho para dispositivos de drenagem - utilização de 3 vezes - confecção, instalação e retirada",0.68,"m²",null,78.849999999999994,null,null,{"$f":"D758*G758","v":53.618000000000002}]
[null,null,null,"Custo total de atividades auxiliares",{"$nulls":5},{"$f":"SUM(J754:J758)","v":133.51956200000001}]
[{"$nulls":7},"Subtotal",null,{"$f":"J747+J752+J759+J748+J749","v":234.46408700000001}]
[null,"E - TEMPO FIXO",null,"Código","Quantidade","Unidade",null,"Custo Unitário","Custo Unitário"]
[null,"M2117","Meio tubo de concreto simples - D = 0,40 m",5914655,0.10838,"t",null,36.86,null,{"$f":"ROUNDDOWN(E762*H762,4)","v":3.9948000000000001}]
[null,"-","-","-",null,"t",null,0,null,0]
[null,null,null,"Custo unitário total de tempo fixo",{"$nulls":5},{"$f":"SUM(J762:J763)","v":3.9948000000000001}]
[null,"F - MOMENTO DE TRANSPORTE",null,"Quantidade","Unidade","DMT",null,null,null,"Custo Unitário"]
[{"$nulls":5},"LN","RP","P"]
[null,"M2117","Meio tubo de concreto simples - D = 0,40 m",0.10838,"tkm"]
[null,"-","-",0,"tkm"]
[null,null,null,"Custo unitário total de transporte"]
[{"$nulls":5},"Custo unitário direto total",null,null,null,{"$f":"TRUNC(J760+J764,2)","v":238.45}]
[null,"Obs."]
[]
[24,"1ª/GRD",{"$nulls":8},{"$f":"J811","v":995.45}]
[null,"OBRA:"," EXECUÇÃO DE RECAPEAMENTO ASFÁLTICO EM CBUQ - ESTRADA MUNICIPAL DA COMUNIDADE OLHOS D'ÁGUA - MONTES CLAROS - MG"]
[null,"Custo Unitário de Referência",null,null,"Minas Gerais"]
[{"$nulls":4}," Abril/2026",null,null,"Produção da equipe ",1,{"$f":"VLOOKUP(A773,ORÇAMENTO!$A$10:$L$46,7,1)","v":"UNID."}]
[null,2003453,"DISSIPADOR DE ENERGIA - DEB 03 - AREIA, BRITA E PEDRA DE MÃO COMERCIAIS",{"$nulls":5},"Valores em reais (R$)"]
[null,"A - EQUIPAMENTOS",null,"Quantidade","Utilização",null,"Custo Horário",null,null,"Custo"]
[{"$nulls":4},"Operativa","Improdutiva","Produtivo","Improdutivo",null,"Horário Total"]
[null,"-","-",null,null,null,0,0,null,{"$f":"D780*(E780*G780+F780*H780)","v":0}]
[null,"-","-",null,null,null,0,0,null,{"$f":"D781*(E781*G781+F781*H781)","v":0}]
[{"$nulls":7},"Custo horário total de equipamentos",null,{"$f":"SUM(J780:J781)","v":0}]
[null,"B - MÃO DE OBRA",null,"Quantidade","Unidade",null,"Custo Horário","Custo Horário Total"]
[null,"P9824","Servente",0.94679999999999997,"h",null,22.6355,null,null,{"$f":"D784*G784","v":21.431291399999999}]
[null,"-","-",0,"-",null,0,null,null,{"$f":"D785*G785","v":0}]
[null,null,null,"Custo horário total de mão de obra",{"$nulls":5},{"$f":"SUM(J784:J785)","v":21.431291399999999}]
[null,null,null,"Custo horário total de execução",{"$nulls":5},{"$f":"J782+J786","v":21.431291399999999}]
[null,null,null,"Custo unitário de execução",{"$nulls":5},{"$f":"J787/I776","v":21.431291399999999}]
[{"$nulls":7},"Custo do FIC",null,0.70640000000000003]
[{"$nulls":7},"Custo do FIT",null,0]
[null,"C - MATERIAL",null,"Quantidade","Unidade",null,"Preço Unitário","Custo Unitário"]
[null,"M1097","Pedra de mão ou rachão",0.37480000000000002,"m³",null,161.2012,null,null,{"$f":"D792*G792","v":60.418209760000003}]
[null,"-","-",0,"-",null,0,null,null,{"$f":"D793*G793","v":0}]
[null,null,null,"Custo unitário total de material",{"$nulls":5},{"$f":"SUM(J792:J793)","v":60.418209760000003}]
[null,"D - ATIVIDADES AUXILIARES",null,"Quantidade","Unidade",null,"Custo Unitário","Custo Unitário"]
[null,4805756,"Apiloamento manual de superfície com espessura de 15 cm",5.4370000000000003,"m²",null,5.25,null,null,{"$f":"D796*G796","v":28.544250000000002}]
[null,1107892,"Concreto fck = 20 MPa - confecção em betoneira e lançamento manual - areia e brita comerciais",0.99890000000000001,"m³",null,488.59,null,null,{"$f":"D797*G797","v":488.05255099999999}]
[null,4805750,"Escavação manual em material de 1ª categoria na profundidade de até 1 m",1.0873999999999999,"m³",null,46.65,null,null,{"$f":"D798*G798","v":50.727209999999992}]
[null,3103302,"Fôrmas de tábuas de pinho para dispositivos de drenagem - utilização de 3 vezes - confecção, instalação e retirada",4.3680000000000003,"m²",null,78.849999999999994,null,null,{"$f":"D799*G799","v":344.41680000000002}]
[null,null,null,"Custo total de atividades auxiliares",{"$nulls":5},{"$f":"SUM(J796:J799)","v":911.74081100000012}]
[{"$nulls":7},"Subtotal",null,{"$f":"J788+J794+J800+J789+J790","v":994.2967121600002}]
[null,"E - TEMPO FIXO",null,"Código","Quantidade","Unidade",null,"Custo Unitário","Custo Unitário"]
[null,"M1097","Pedra de mão ou rachão",5914647,0.56220000000000003,"t",null,2.06,null,{"$f":"ROUNDDOWN(E803*H803,4)","v":1.1580999999999999}]
[null,"-","-","-",0,"t",null,0,null,0]
[null,null,null,"Custo unitário total de tempo fixo",{"$nulls":5},{"$f":"SUM(J803:J804)","v":1.1580999999999999}]
[null,"F - MOMENTO DE TRANSPORTE",null,"Quantidade","Unidade","DMT",null,null,null,"Custo Unitário"]
[{"$nulls":5},"LN","RP","P"]
[null,"M1097","Pedra de mão ou rachão",0.56220000000000003,"tkm"]
[null,"-","-",0,"tkm"]
[null,null,null,"Custo unitário total de transporte"]
[{"$nulls":5},"Custo unitário direto total",null,null,null,{"$f":"TRUNC(J801+J805,2)","v":995.45}]
[null,"Obs."]
[]
[25,"1ª/GRD",{"$nulls":8},{"$f":"J854","v":982.6}]
[null,"OBRA:"," EXECUÇÃO DE RECAPEAMENTO ASFÁLTICO EM CBUQ - ESTRADA MUNICIPAL DA COMUNIDADE OLHOS D'ÁGUA - MONTES CLAROS - MG"]
[null,"Custo Unitário de Referência",null,null,"Minas Gerais"]
[{"$nulls":4}," Abril/2026",null,null,"Produção da equipe ",1,{"$f":"VLOOKUP(A814,ORÇAMENTO!$A$10:$L$46,7,1)","v":"UNID."}]
[null,2003626,"BOCA DE LOBO SIMPLES - GRELHA DE CONCRETO - AREIA E BRITA COMERCIAIS",{"$nulls":5},"Valores em reais (R$)"]
[null,"A - EQUIPAMENTOS",null,"Quantidade","Utilização",null,"Custo Horário",null,null,"Custo"]
[{"$nulls":4},"Operativa","Improdutiva","Produtivo","Improdutivo",null,"Horário Total"]
[null,"-","-",null,null,null,0,0,null,{"$f":"D821*(E821*G821+F821*H821)","v":0}]
[null,"-","-",null,null,null,0,0,null,{"$f":"D822*(E822*G822+F822*H822)","v":0}]
[{"$nulls":7},"Custo horário total de equipamentos",null,{"$f":"SUM(J821:J822)","v":0}]
[null,"B - MÃO DE OBRA",null,"Quantidade","Unidade",null,"Custo Horário","Custo Horário Total"]
[null,"P9824","Servente",0.1,"h",null,22.6355,null,null,{"$f":"D825*G825","v":2.26355}]
[null,"-","-",null,"-",null,0,null,null,{"$f":"D826*G826","v":0}]
[null,null,null,"Custo horário total de mão de obra",{"$nulls":5},{"$f":"SUM(J825:J826)","v":2.26355}]
[null,null,null,"Custo horário total de execução",{"$nulls":5},{"$f":"J823+J827","v":2.26355}]
[null,null,null,"Custo unitário de execução",{"$nulls":5},{"$f":"J828/I817","v":2.26355}]
[{"$nulls":7},"Custo do FIC",null,7.46E-2]
[{"$nulls":7},"Custo do FIT",null,0]
[null,"C - MATERIAL",null,"Quantidade","Unidade",null,"Preço Unitário","Custo Unitário"]
[null,"-","-",0,"-",null,0,null,null,{"$f":"D833*G833","v":0}]
[null,"-","-",0,"-",null,0,null,null,0]
[null,null,null,"Custo unitário total de material",{"$nulls":5},{"$f":"SUM(J833:J834)","v":0}]
[null,"D - ATIVIDADES AUXILIARES",null,"Quantidade","Unidade",null,"Custo Unitário","Custo Unitário"]
[null,2009619,"Alvenaria de blocos de concreto 19 x 19 x 39 cm com espessura de 20 cm - areia comercial",3.81,"m²",null,132.25,null,null,{"$f":"D837*G837","v":503.8725}]
[null,1109669,"Argamassa de cimento e areia 1:3 - confecção em betoneira e lançamento manual - areia comercial",0.06,"m³",null,511.74,null,null,{"$f":"D838*G838","v":30.7044}]
[null,407819,"Armação em aço CA-50 - fornecimento, preparo e colocação",4.0999999999999996,"kg",null,11.86,null,null,48.625999999999991]
[null,1107892,"Concreto fck = 20 MPa - confecção em betoneira e lançamento manual - areia e brita comerciais",0.25,"m³",null,488.59,null,null,122.14749999999999]
[null,1107896,"Concreto fck = 25 MPa - confecção em betoneira e lançamento manual - areia e brita comerciais",0.06,"m³",null,508.08,null,null,30.484799999999996]
[null,3103302,"Fôrmas de tábuas de pinho para dispositivos de drenagem - utilização de 3 vezes - confecção, instalação e retirada",3.1,"m²",null,78.849999999999994,null,null,{"$f":"D842*G842","v":244.435}]
[null,null,null,"Custo total de atividades auxiliares",{"$nulls":5},{"$f":"SUM(J837:J842)","v":980.27019999999993}]
[{"$nulls":7},"Subtotal",null,{"$f":"J829+J835+J843+J830+J831","v":982.60834999999997}]
[null,"E - TEMPO FIXO",null,"Código","Quantidade","Unidade",null,"Custo Unitário","Custo Unitário"]
[null,"-","-","-",0,"t",null,0,null,{"$f":"ROUNDDOWN(E846*H846,4)","v":0}]
[null,"-","-","-",0,"t",null,0,null,{"$f":"ROUNDDOWN(E847*H847,4)","v":0}]
[null,null,null,"Custo unitário total de tempo fixo",{"$nulls":5},{"$f":"SUM(J846:J847)","v":0}]
[null,"F - MOMENTO DE TRANSPORTE",null,"Quantidade","Unidade","DMT",null,null,null,"Custo Unitário"]
[{"$nulls":5},"LN","RP","P"]
[null,"-","-",0,"tkm","5914359","5914374","5914389"]
[null,"-","-",null,"tkm"]
[null,null,null,"Custo unitário total de transporte"]
[{"$nulls":5},"Custo unitário direto total",null,null,null,{"$f":"TRUNC(J844+J848,2)","v":982.6}]
[null,"Obs."]
[]
[29,"1ª/GRD",{"$nulls":8},{"$f":"J894","v":279.70999999999998}]
[null,"OBRA:"," EXECUÇÃO DE RECAPEAMENTO ASFÁLTICO EM CBUQ - ESTRADA MUNICIPAL DA COMUNIDADE OLHOS D'ÁGUA - MONTES CLAROS - MG"]
[null,"Custo Unitário de Referência",null,null,"Minas Gerais"]
[{"$nulls":4}," Abril/2026",null,null,"Produção da equipe ",12.45,{"$f":"VLOOKUP(A857,ORÇAMENTO!$A$10:$L$46,7,1)","v":"UNID."}]
[null,2003626,"BOCA DE LOBO SIMPLES - GRELHA DE CONCRETO - AREIA E BRITA COMERCIAIS",{"$nulls":5},"Valores em reais (R$)"]
[null,"A - EQUIPAMENTOS",null,"Quantidade","Utilização",null,"Custo Horário",null,null,"Custo"]
[{"$nulls":4},"Operativa","Improdutiva","Produtivo","Improdutivo",null,"Horário Total"]
[null,"E9686","Caminhão guindauto com capacidade de elevação de 6,2 t e carroceria de 7 t - 136 kW",1,1,0,355.971,114.4237,null,{"$f":"D864*(E864*G864+F864*H864)","v":355.971}]
[null,"-","-",null,null,null,0,0,null,{"$f":"D865*(E865*G865+F865*H865)","v":0}]
[{"$nulls":7},"Custo horário total de equipamentos",null,{"$f":"SUM(J864:J865)","v":355.971}]
[null,"B - MÃO DE OBRA",null,"Quantidade","Unidade",null,"Custo Horário","Custo Horário Total"]
[null,"P9824","Servente",3,"h",null,22.6355,null,null,{"$f":"D868*G868","v":67.906499999999994}]
[null,"-","-",0,"-",null,0,null,null,{"$f":"D869*G869","v":0}]
[null,null,null,"Custo horário total de mão de obra",{"$nulls":5},{"$f":"SUM(J868:J869)","v":67.906499999999994}]
[null,null,null,"Custo horário total de execução",{"$nulls":5},{"$f":"J866+J870","v":423.8775}]
[null,null,null,"Custo unitário de execução",{"$nulls":5},{"$f":"J871/I860","v":34.046385542168679}]
[{"$nulls":7},"Custo do FIC",null,0.43149999999999999]
[{"$nulls":7},"Custo do FIT",null,0]
[null,"C - MATERIAL",null,"Quantidade","Unidade",null,"Preço Unitário","Custo Unitário"]
[null,"M2163","Tubo de concreto armado PA1 - D = 0,40 m",1,"m",null,138.55770000000001,null,null,{"$f":"D876*G876","v":138.55770000000001}]
[null,"-","-",0,"-",null,0,null,null,{"$f":"D877*G877","v":0}]
[null,null,null,"Custo unitário total de material",{"$nulls":5},{"$f":"SUM(J876:J877)","v":138.55770000000001}]
[null,"D - ATIVIDADES AUXILIARES",null,"Quantidade","Unidade",null,"Custo Unitário","Custo Unitário"]
[null,1109671,"Argamassa de cimento e areia 1:4 - confecção em betoneira e lançamento manual - areia comercial",1.65E-3,"m³",null,472.28,null,null,{"$f":"D880*G880","v":0.7792619999999999}]
[null,1106165,"Concreto ciclópico fck = 20 MPa - confecção em betoneira e lançamento manual - areia, brita e pedra de mão comerciais",0.151,"m³",null,440.24,null,null,{"$f":"D881*G881","v":66.476240000000004}]
[null,3103302,"Fôrmas de tábuas de pinho para dispositivos de drenagem - utilização de 3 vezes - confecção, instalação e retirada",0.5,"m²",null,78.849999999999994,null,null,{"$f":"D882*G882","v":39.424999999999997}]
[null,null,null,"Custo total de atividades auxiliares",{"$nulls":5},{"$f":"SUM(J880:J882)","v":106.680502}]
[{"$nulls":7},"Subtotal",null,{"$f":"J872+J878+J883+J873+J874","v":279.71608754216874}]
[null,"E - TEMPO FIXO",null,"Código","Quantidade","Unidade",null,"Custo Unitário","Custo Unitário"]
[null,"-","-","-",0,"t",null,0,null,{"$f":"ROUNDDOWN(E886*H886,4)","v":0}]
[null,"-","-","-",0,"t",null,0,null,{"$f":"ROUNDDOWN(E887*H887,4)","v":0}]
[null,null,null,"Custo unitário total de tempo fixo",{"$nulls":5},{"$f":"SUM(J886:J887)","v":0}]
[null,"F - MOMENTO DE TRANSPORTE",null,"Quantidade","Unidade","DMT",null,null,null,"Custo Unitário"]
[{"$nulls":5},"LN","RP","P"]
[null,"M2163","Tubo de concreto armado PA1 - D = 0,40 m",0.17268,"tkm","5914584","5914599","5914614"]
[null,"-","-",0,"tkm"]
[null,null,null,"Custo unitário total de transporte"]
[{"$nulls":5},"Custo unitário direto total",null,null,null,{"$f":"TRUNC(J884+J888,2)","v":279.70999999999998}]
[null,"Obs."]
[]
[36,"1ª/GRD",{"$nulls":8},{"$f":"J937","v":1062.2}]
[null,"OBRA:"," EXECUÇÃO DE RECAPEAMENTO ASFÁLTICO EM CBUQ - ESTRADA MUNICIPAL DA COMUNIDADE OLHOS D'ÁGUA - MONTES CLAROS - MG"]
[null,"Custo Unitário de Referência",null,null,"Minas Gerais"]
[{"$nulls":4}," Abril/2026",null,null,"Produção da equipe ",1,{"$f":"VLOOKUP(A897,ORÇAMENTO!$A$10:$L$46,7,1)","v":"M"}]
[null,2003365,"TRANSPOSIÇÃO DE SEGMENTO DE SARJETA - TSS 01 - AREIA E BRITA COMERCIAIS",{"$nulls":5},"Valores em reais (R$)"]
[null,"A - EQUIPAMENTOS",null,"Quantidade","Utilização",null,"Custo Horário",null,null,"Custo"]
[{"$nulls":4},"Operativa","Improdutiva","Produtivo","Improdutivo",null,"Horário Total"]
[null,"-","-",null,null,null,0,0,null,{"$f":"D904*(E904*G904+F904*H904)","v":0}]
[null,"-","-",null,null,null,0,0,null,{"$f":"D905*(E905*G905+F905*H905)","v":0}]
[{"$nulls":7},"Custo horário total de equipamentos",null,{"$f":"SUM(J904:J905)","v":0}]
[null,"B - MÃO DE OBRA",null,"Quantidade","Unidade",null,"Custo Horário","Custo Horário Total"]
[null,"-","-",null,"-",null,0,null,null,{"$f":"D908*G908","v":0}]
[null,"-","-",null,"-",null,0,null,null,{"$f":"D909*G909","v":0}]
[null,null,null,"Custo horário total de mão de obra",{"$nulls":5},{"$f":"SUM(J908:J909)","v":0}]
[null,null,null,"Custo horário total de execução",{"$nulls":5},{"$f":"J906+J910","v":0}]
[null,null,null,"Custo unitário de execução",{"$nulls":5},{"$f":"J911/I900","v":0}]
[{"$nulls":7},"Custo do FIC",null,0]
[{"$nulls":7},"Custo do FIT",null,0]
[null,"C - MATERIAL",null,"Quantidade","Unidade",null,"Preço Unitário","Custo Unitário"]
[null,"-","-",0,"-",null,0,null,null,{"$f":"D916*G916","v":0}]
[null,"-","-",0,"-",null,0,null,null,0]
[null,null,null,"Custo unitário total de material",{"$nulls":5},{"$f":"SUM(J916:J917)","v":0}]
[null,"D - ATIVIDADES AUXILIARES",null,"Quantidade","Unidade",null,"Custo Unitário","Custo Unitário"]
[null,1100657,"Adensamento de concreto por vibrador de imersão",0.252,"m³",null,3.62,null,null,{"$f":"D920*G920","v":0.91224000000000005}]
[null,407819,"Armação em aço CA-50 - fornecimento, preparo e colocação",24.454799999999999,"kg",null,11.86,null,null,{"$f":"D921*G921","v":290.03392799999995}]
[null,1107892,"Concreto fck = 20 MPa - confecção em betoneira e lançamento manual - areia e brita comerciais",0.75790000000000002,"m³",null,488.59,null,null,{"$f":"D922*G922","v":370.30236099999996}]
[null,1107896,"Concreto fck = 25 MPa - confecção em betoneira e lançamento manual - areia e brita comerciais",0.252,"m³",null,508.08,null,null,{"$f":"D923*G923","v":128.03616}]
[null,4805750,"Escavação manual em material de 1ª categoria na profundidade de até 1 m",0.49980000000000002,"m³",null,46.65,null,null,23.315670000000001]
[null,3103302,"Fôrmas de tábuas de pinho para dispositivos de drenagem - utilização de 3 vezes - confecção, instalação e retirada",3.1656,"m²",null,78.849999999999994,null,null,{"$f":"D925*G925","v":249.60755999999998}]
[null,null,null,"Custo total de atividades auxiliares",{"$nulls":5},{"$f":"SUM(J920:J925)","v":1062.2079189999999}]
[{"$nulls":7},"Subtotal",null,{"$f":"J912+J918+J926+J913+J914","v":1062.2079189999999}]
[null,"E - TEMPO FIXO",null,"Código","Quantidade","Unidade",null,"Custo Unitário","Custo Unitário"]
[null,"-","-","-",0,"t",null,0,null,{"$f":"ROUNDDOWN(E929*H929,4)","v":0}]
[null,"-","-","-",0,"t",null,0,null,{"$f":"ROUNDDOWN(E930*H930,4)","v":0}]
[null,null,null,"Custo unitário total de tempo fixo",{"$nulls":5},{"$f":"SUM(J929:J930)","v":0}]
[null,"F - MOMENTO DE TRANSPORTE",null,"Quantidade","Unidade","DMT",null,null,null,"Custo Unitário"]
[{"$nulls":5},"LN","RP","P"]
[null,"-","-",0,"tkm","5914584","5914599","5914614"]
[null,"-","-",0,"tkm"]
[null,null,null,"Custo unitário total de transporte"]
[{"$nulls":5},"Custo unitário direto total",null,null,null,{"$f":"TRUNC(J927+J931,2)","v":1062.2}]
[null,"Obs."]
[]
[48,"1ª/GRD",{"$nulls":8},{"$f":"J983","v":28.99}]
[null,"OBRA:"," EXECUÇÃO DE RECAPEAMENTO ASFÁLTICO EM CBUQ - ESTRADA MUNICIPAL DA COMUNIDADE OLHOS D'ÁGUA - MONTES CLAROS - MG"]
[null,"Custo Unitário de Referência",null,null,"Minas Gerais"]
[{"$nulls":4}," Abril/2026",null,null,"Produção da equipe ",149.4,{"$f":"VLOOKUP(A940,ORÇAMENTO!$A$10:$L$46,7,1)","v":"M2"}]
[null,5213401,"PINTURA DE EIXO VIÁRIO SOBRE ASFALTO COM TINTA RETRORREFLETIVA A BASE DE RESINA ACRÍLICA COM MICROESFERAS DE VIDRO, APLICAÇÃO MECÂNICA COM DEMARCADORA AUTOPROPELIDA",{"$nulls":5},"Valores em reais (R$)"]
[null,"A - EQUIPAMENTOS",null,"Quantidade","Utilização",null,"Custo Horário",null,null,"Custo"]
[{"$nulls":4},"Operativa","Improdutiva","Produtivo","Improdutivo",null,"Horário Total"]
[null,"E9644","Caminhão demarcador de faixas com sistema de pintura a frio - 28 kW/129 kW",1,1,0,493.67649999999998,188.46379999999999,null,{"$f":"D947*(E947*G947+F947*H947)","v":493.67649999999998}]
[null,"-","-",null,null,null,0,0,null,{"$f":"D948*(E948*G948+F948*H948)","v":0}]
[{"$nulls":7},"Custo horário total de equipamentos",null,{"$f":"SUM(J947:J948)","v":493.67649999999998}]
[null,"B - MÃO DE OBRA",null,"Quantidade","Unidade",null,"Custo Horário","Custo Horário Total"]
[null,"P9853","Pré-marcador",1,"h",null,24.272099999999998,null,null,{"$f":"D951*G951","v":24.272099999999998}]
[null,"P9824","Servente",4,"h",null,22.6355,null,null,{"$f":"D952*G952","v":90.542000000000002}]
[null,null,null,"Custo horário total de mão de obra",{"$nulls":5},{"$f":"SUM(J951:J952)","v":114.8141}]
[null,null,null,"Custo horário total de execução",{"$nulls":5},{"$f":"J949+J953","v":608.49059999999997}]
[null,null,null,"Custo unitário de execução",{"$nulls":5},{"$f":"J954/I943","v":4.0728955823293171}]
[{"$nulls":7},"Custo do FIC",null,5.3999999999999999E-2]
[{"$nulls":7},"Custo do FIT",null,0]
[null,"C - MATERIAL",null,"Quantidade","Unidade",null,"Preço Unitário","Custo Unitário"]
[null,"M2037","Microesferas refletivas de vidro tipo I-B",0.12,"kg",null,9.2093000000000007,null,null,{"$f":"D959*G959","v":1.105116}]
[null,"M2038","Microesferas refletivas de vidro tipo II-A",0.35,"kg",null,8.6385000000000005,null,null,{"$f":"D960*G960","v":3.0234749999999999}]
[null,"M2034","Solvente para tinta à base de resina acrílica",0.03,"l",null,16.4938,null,null,0.49481399999999998]
[null,"M2044","Tinta à base de resina acrílica emulsionada em água para pré-marcação viária",9.7000000000000005E-4,"l",null,21.143899999999999,null,null,2.0509583000000001E-2]
[null,"M2027","Tinta à base de resina acrílica estirenada para demarcação viária",0.6,"l",null,33.631599999999999,null,null,20.17896]
[null,null,null,"Custo unitário total de material",{"$nulls":5},{"$f":"SUM(J959:J963)","v":24.822874583000001}]
[null,"D - ATIVIDADES AUXILIARES",null,"Quantidade","Unidade",null,"Custo Unitário","Custo Unitário"]
[null,"-","-",null,"-",null,0,null,null,{"$f":"D966*G966","v":0}]
[null,"-","-",null,"-",null,0,null,null,{"$f":"D967*G967","v":0}]
[null,null,null,"Custo total de atividades auxiliares",{"$nulls":5},{"$f":"SUM(J966:J967)","v":0}]
[{"$nulls":7},"Subtotal",null,{"$f":"J955+J964+J968+J956+J957","v":28.949770165329316}]
[null,"E - TEMPO FIXO",null,"Código","Quantidade","Unidade",null,"Custo Unitário","Custo Unitário"]
[null,"M2037","Microesferas refletivas de vidro tipo I-B",5914655,1.2E-4,"t",null,36.86,null,{"$f":"ROUNDDOWN(E971*H971,4)","v":4.4000000000000003E-3}]
[null,"M2038","Microesferas refletivas de vidro tipo II-A",5914655,3.5E-4,"t",null,36.86,null,{"$f":"ROUNDDOWN(E972*H972,4)","v":1.29E-2}]
[null,"M2034","Solvente para tinta à base de resina acrílica",5914655,3.0000000000000001E-5,"t",null,36.86,null,1.1000000000000001E-3]
[null,"M2027","Tinta à base de resina acrílica estirenada para demarcação viária",5914655,8.3000000000000001E-4,"t",null,36.86,null,3.0499999999999999E-2]
[null,null,null,"Custo unitário total de tempo fixo",{"$nulls":5},{"$f":"SUM(J971:J974)","v":4.8899999999999999E-2}]
[null,"F - MOMENTO DE TRANSPORTE",null,"Quantidade","Unidade","DMT",null,null,null,"Custo Unitário"]
[{"$nulls":5},"LN","RP","P"]
[null,"M2037","Microesferas refletivas de vidro tipo I-B",1.2E-4,"tkm"]
[null,"M2038","Microesferas refletivas de vidro tipo II-A",3.5E-4,"tkm"]
[null,"M2034","Solvente para tinta à base de resina acrílica",3.0000000000000001E-5,"tkm"]
[null,"M2027","Tinta à base de resina acrílica estirenada para demarcação viária",8.3000000000000001E-4,"tkm"]
[null,null,null,"Custo unitário total de transporte"]
[{"$nulls":5},"Custo unitário direto total",null,null,null,{"$f":"TRUNC(J969+J975,2)","v":28.99}]
[null,"Obs."]
[]
[49,"1ª/GRD",{"$nulls":8},{"$f":"J1024","v":35.94}]
[null,"OBRA:"," EXECUÇÃO DE RECAPEAMENTO ASFÁLTICO EM CBUQ - ESTRADA MUNICIPAL DA COMUNIDADE OLHOS D'ÁGUA - MONTES CLAROS - MG"]
[null,"Custo Unitário de Referência",null,null,"Minas Gerais"]
[{"$nulls":4}," Abril/2026",null,null,"Produção da equipe ",36,{"$f":"VLOOKUP(A986,ORÇAMENTO!$A$10:$L$46,7,1)","v":"UNID."}]
[null,5213360,"TACHA REFLETIVA EM PLÁSTICO INJETADO - BIDIRECIONAL COM UM PINO - FORNECIMENTO E COLOCAÇÃO",{"$nulls":5},"Valores em reais (R$)"]
[null,"A - EQUIPAMENTOS",null,"Quantidade","Utilização",null,"Custo Horário",null,null,"Custo"]
[{"$nulls":4},"Operativa","Improdutiva","Produtivo","Improdutivo",null,"Horário Total"]
[null,"E9687","Caminhão carroceria com capacidade de 5 t - 120 kW",1,1,0,186.67019999999999,69.418999999999997,null,{"$f":"D993*(E993*G993+F993*H993)","v":186.67019999999999}]
[null,"E9764","Grupo gerador - 7,2 kVA",1,1,0,11.5359,0.72319999999999995,null,{"$f":"D994*(E994*G994+F994*H994)","v":11.5359}]
[null,"E9675","Martelete perfurador/rompedor elétrico - 1,50 kW",1,1,0,2.1318999999999999,1.1423000000000001,null,{"$f":"D995*(E995*G995+F995*H995)","v":2.1318999999999999}]
[{"$nulls":7},"Custo horário total de equipamentos",null,{"$f":"SUM(J993:J995)","v":200.33799999999999}]
[null,"B - MÃO DE OBRA",null,"Quantidade","Unidade",null,"Custo Horário","Custo Horário Total"]
[null,"P9830","Montador",1,"h",null,40.168599999999998,null,null,{"$f":"D998*G998","v":40.168599999999998}]
[null,"P9824","Servente",5,"h",null,22.6355,null,null,{"$f":"D999*G999","v":113.17750000000001}]
[null,null,null,"Custo horário total de mão de obra",{"$nulls":5},{"$f":"SUM(J998:J999)","v":153.34610000000001}]
[null,null,null,"Custo horário total de execução",{"$nulls":5},{"$f":"J996+J1000","v":353.6841}]
[null,null,null,"Custo unitário de execução",{"$nulls":5},{"$f":"J1001/I989","v":9.8245583333333339}]
[{"$nulls":7},"Custo do FIC",null,0.1661]
[{"$nulls":7},"Custo do FIT",null,0]
[null,"C - MATERIAL",null,"Quantidade","Unidade",null,"Preço Unitário","Custo Unitário"]
[null,"M2041","Adesivo à base de resina poliéster",0.10292,"kg",null,28.5259,null,null,{"$f":"D1006*G1006","v":2.9358856279999999}]
[null,"M1528","Broca de widia - D = 13 mm e C = 150 mm",3.4099999999999998E-3,"un",null,21.3034,null,null,{"$f":"D1007*G1007","v":7.2644593999999993E-2}]
[null,"M3821","Tacha refletiva em plástico injetado bidirecional com um pino - tipo I",1,"un",null,22.9374,null,null,22.9374]
[null,null,null,"Custo unitário total de material",{"$nulls":5},{"$f":"SUM(J1006:J1008)","v":25.945930222000001}]
[null,"D - ATIVIDADES AUXILIARES",null,"Quantidade","Unidade",null,"Custo Unitário","Custo Unitário"]
[null,"-","-",null,"-",null,0,null,null,{"$f":"D1011*G1011","v":0}]
[null,"-","-",null,"-",null,0,null,null,{"$f":"D1012*G1012","v":0}]
[null,null,null,"Custo total de atividades auxiliares",{"$nulls":5},{"$f":"SUM(J1011:J1012)","v":0}]
[{"$nulls":7},"Subtotal",null,{"$f":"J1002+J1009+J1013+J1003+J1004","v":35.936588555333337}]
[null,"E - TEMPO FIXO",null,"Código","Quantidade","Unidade",null,"Custo Unitário","Custo Unitário"]
[null,"M2041","Adesivo à base de resina poliéster",5914655,1E-4,"t",null,36.86,null,{"$f":"ROUNDDOWN(E1016*H1016,4)","v":3.5999999999999999E-3}]
[null,"M3821","Tacha refletiva em plástico injetado bidirecional com um pino - tipo I",5914655,1.6000000000000001E-4,"t",null,36.86,null,{"$f":"ROUNDDOWN(E1017*H1017,4)","v":5.7999999999999996E-3}]
[null,null,null,"Custo unitário total de tempo fixo",{"$nulls":5},{"$f":"SUM(J1016:J1017)","v":9.3999999999999986E-3}]
[null,"F - MOMENTO DE TRANSPORTE",null,"Quantidade","Unidade","DMT",null,null,null,"Custo Unitário"]
[{"$nulls":5},"LN","RP","P"]
[null,"M2041","Adesivo à base de resina poliéster",1E-4,"tkm"]
[null,"M3821","Tacha refletiva em plástico injetado bidirecional com um pino - tipo I",1.6000000000000001E-4,"tkm"]
[null,null,null,"Custo unitário total de transporte"]
[{"$nulls":5},"Custo unitário direto total",null,null,null,{"$f":"TRUNC(J1014+J1018,2)","v":35.94}]
[null,"Obs."]
[]
[50,"1ª/GRD",{"$nulls":8},{"$f":"J1070","v":45.3}]
[null,"OBRA:"," EXECUÇÃO DE RECAPEAMENTO ASFÁLTICO EM CBUQ - ESTRADA MUNICIPAL DA COMUNIDADE OLHOS D'ÁGUA - MONTES CLAROS - MG"]
[null,"Custo Unitário de Referência",null,null,"Minas Gerais"]
[{"$nulls":4}," Abril/2026",null,null,"Produção da equipe ",30.18,{"$f":"VLOOKUP(A1027,ORÇAMENTO!$A$10:$L$46,7,1)","v":"M2"}]
[null,5213405,"PINTURA DE FAIXA DE PEDESTRE OU ZEBRADA TINTA RETRORREFLETIVA A BASE DE RESINA ACRÍLICA COM MICROESFERAS DE VIDRO, APLICAÇÃO MANUAL",{"$nulls":5},"Valores em reais (R$)"]
[null,"A - EQUIPAMENTOS",null,"Quantidade","Utilização",null,"Custo Horário",null,null,"Custo"]
[{"$nulls":4},"Operativa","Improdutiva","Produtivo","Improdutivo",null,"Horário Total"]
[null,"E9644","Caminhão demarcador de faixas com sistema de pintura a frio - 28 kW/129 kW",1,1,0,493.67649999999998,188.46379999999999,null,{"$f":"D1034*(E1034*G1034+F1034*H1034)","v":493.67649999999998}]
[null,"-","-",null,null,null,0,0,null,{"$f":"D1035*(E1035*G1035+F1035*H1035)","v":0}]
[{"$nulls":7},"Custo horário total de equipamentos",null,{"$f":"SUM(J1034:J1035)","v":493.67649999999998}]
[null,"B - MÃO DE OBRA",null,"Quantidade","Unidade",null,"Custo Horário","Custo Horário Total"]
[null,"P9853","Pré-marcador",1,"h",null,24.272099999999998,null,null,{"$f":"D1038*G1038","v":24.272099999999998}]
[null,"P9824","Servente",4,"h",null,22.6355,null,null,{"$f":"D1039*G1039","v":90.542000000000002}]
[null,null,null,"Custo horário total de mão de obra",{"$nulls":5},{"$f":"SUM(J1038:J1039)","v":114.8141}]
[null,null,null,"Custo horário total de execução",{"$nulls":5},{"$f":"J1036+J1040","v":608.49059999999997}]
[null,null,null,"Custo unitário de execução",{"$nulls":5},{"$f":"J1041/I1030","v":20.162047713717694}]
[{"$nulls":7},"Custo do FIC",null,0.26750000000000002]
[{"$nulls":7},"Custo do FIT",null,0]
[null,"C - MATERIAL",null,"Quantidade","Unidade",null,"Preço Unitário","Custo Unitário"]
[null,"M2037","Microesferas refletivas de vidro tipo I-B",0.12,"kg",null,9.2093000000000007,null,null,{"$f":"D1046*G1046","v":1.105116}]
[null,"M2038","Microesferas refletivas de vidro tipo II-A",0.35,"kg",null,8.6385000000000005,null,null,{"$f":"D1047*G1047","v":3.0234749999999999}]
[null,"M2034","Solvente para tinta à base de resina acrílica",0.03,"l",null,16.4938,null,null,0.49481399999999998]
[null,"M2044","Tinta à base de resina acrílica emulsionada em água para pré-marcação viária",9.7000000000000005E-4,"l",null,21.143899999999999,null,null,2.0509583000000001E-2]
[null,"M2027","Tinta à base de resina acrílica estirenada para demarcação viária",0.6,"l",null,33.631599999999999,null,null,20.17896]
[null,null,null,"Custo unitário total de material",{"$nulls":5},{"$f":"SUM(J1046:J1050)","v":24.822874583000001}]
[null,"D - ATIVIDADES AUXILIARES",null,"Quantidade","Unidade",null,"Custo Unitário","Custo Unitário"]
[null,"-","-",null,"-",null,0,null,null,{"$f":"D1053*G1053","v":0}]
[null,"-","-",null,"-",null,0,null,null,{"$f":"D1054*G1054","v":0}]
[null,null,null,"Custo total de atividades auxiliares",{"$nulls":5},{"$f":"SUM(J1053:J1054)","v":0}]
[{"$nulls":7},"Subtotal",null,{"$f":"J1042+J1051+J1055+J1043+J1044","v":45.252422296717697}]
[null,"E - TEMPO FIXO",null,"Código","Quantidade","Unidade",null,"Custo Unitário","Custo Unitário"]
[null,"M2037","Microesferas refletivas de vidro tipo I-B",5914655,1.2E-4,"t",null,36.86,null,{"$f":"ROUNDDOWN(E1058*H1058,4)","v":4.4000000000000003E-3}]
[null,"M2038","Microesferas refletivas de vidro tipo II-A",5914655,3.5E-4,"t",null,36.86,null,{"$f":"ROUNDDOWN(E1059*H1059,4)","v":1.29E-2}]
[null,"M2034","Solvente para tinta à base de resina acrílica",5914655,3.0000000000000001E-5,"t",null,36.86,null,1.1000000000000001E-3]
[null,"M2027","Tinta à base de resina acrílica estirenada para demarcação viária",5914655,8.3000000000000001E-4,"t",null,36.86,null,3.0499999999999999E-2]
[null,null,null,"Custo unitário total de tempo fixo",{"$nulls":5},{"$f":"SUM(J1058:J1061)","v":4.8899999999999999E-2}]
[null,"F - MOMENTO DE TRANSPORTE",null,"Quantidade","Unidade","DMT",null,null,null,"Custo Unitário"]
[{"$nulls":5},"LN","RP","P"]
[null,"M2037","Microesferas refletivas de vidro tipo I-B",1.2E-4,"tkm"]
[null,"M2038","Microesferas refletivas de vidro tipo II-A",3.5E-4,"tkm"]
[null,"M2034","Solvente para tinta à base de resina acrílica",3.0000000000000001E-5,"tkm"]
[null,"M2027","Tinta à base de resina acrílica estirenada para demarcação viária",8.3000000000000001E-4,"tkm"]
[null,null,null,"Custo unitário total de transporte"]
[{"$nulls":5},"Custo unitário direto total",null,null,null,{"$f":"TRUNC(J1056+J1062,2)","v":45.3}]
[null,"Obs."]
[]
[51,"1ª/GRD",{"$nulls":8},{"$f":"J1109","v":284.75}]
[null,"OBRA:"," EXECUÇÃO DE RECAPEAMENTO ASFÁLTICO EM CBUQ - ESTRADA MUNICIPAL DA COMUNIDADE OLHOS D'ÁGUA - MONTES CLAROS - MG"]
[null,"Custo Unitário de Referência",null,null,"Minas Gerais"]
[{"$nulls":4}," Abril/2026",null,null,"Produção da equipe ",3,{"$f":"VLOOKUP(A1073,ORÇAMENTO!$A$10:$L$46,7,1)","v":"UNID"}]
[null,5213440,"PLACA DE REGULAMENTAÇÃO EM AÇO - PELÍCULA RETRORREFLETIVA TIPO I + SI - FORNECIMENTO E IMPLANTAÇÃO",{"$nulls":5},"Valores em reais (R$)"]
[null,"A - EQUIPAMENTOS",null,"Quantidade","Utilização",null,"Custo Horário",null,null,"Custo"]
[{"$nulls":4},"Operativa","Improdutiva","Produtivo","Improdutivo",null,"Horário Total"]
[null,"E9687","Caminhão carroceria com capacidade de 5 t - 120 kW",1,0.3,0.7,186.67019999999999,69.418999999999997,null,{"$f":"D1080*(E1080*G1080+F1080*H1080)","v":104.59435999999999}]
[null,"-","-",null,null,null,0,0,null,{"$f":"D1081*(E1081*G1081+F1081*H1081)","v":0}]
[{"$nulls":7},"Custo horário total de equipamentos",null,{"$f":"SUM(J1080:J1081)","v":104.59435999999999}]
[null,"B - MÃO DE OBRA",null,"Quantidade","Unidade",null,"Custo Horário","Custo Horário Total"]
[null,"P9830","Montador",1,"h",null,40.168599999999998,null,null,{"$f":"D1084*G1084","v":40.168599999999998}]
[null,"P9824","Servente",2,"h",null,22.6355,null,null,{"$f":"D1085*G1085","v":45.271000000000001}]
[null,null,null,"Custo horário total de mão de obra",{"$nulls":5},{"$f":"SUM(J1084:J1085)","v":85.439599999999999}]
[null,null,null,"Custo horário total de execução",{"$nulls":5},{"$f":"J1082+J1086","v":190.03395999999998}]
[null,null,null,"Custo unitário de execução",{"$nulls":5},{"$f":"J1087/I1076","v":63.344653333333326}]
[{"$nulls":7},"Custo do FIC",null,1.3086]
[{"$nulls":7},"Custo do FIT",null,0]
[null,"C - MATERIAL",null,"Quantidade","Unidade",null,"Preço Unitário","Custo Unitário"]
[null,"-","-",null,"-",null,0,null,null,{"$f":"D1092*G1092","v":0}]
[null,"-","-",null,"-",null,0,null,null,{"$f":"D1093*G1093","v":0}]
[null,null,null,"Custo unitário total de material",{"$nulls":5},{"$f":"SUM(J1092:J1093)","v":0}]
[null,"D - ATIVIDADES AUXILIARES",null,"Quantidade","Unidade",null,"Custo Unitário","Custo Unitário"]
[null,5213414,"Placa em aço nº 16 galvanizado com película retrorrefletiva tipo I + SI - confecção",0.35993999999999998,"m²",null,611.49,null,null,{"$f":"D1096*G1096","v":220.09971059999998}]
[null,"-","-",null,"-",null,0,null,null,{"$f":"D1097*G1097","v":0}]
[null,null,null,"Custo total de atividades auxiliares",{"$nulls":5},{"$f":"SUM(J1096:J1097)","v":220.09971059999998}]
[{"$nulls":7},"Subtotal",null,{"$f":"J1088+J1094+J1098+J1089+J1090","v":284.75296393333332}]
[null,"E - TEMPO FIXO",null,"Código","Quantidade","Unidade",null,"Custo Unitário","Custo Unitário"]
[null,"-","-","-",null,"t",null,0,null,{"$f":"ROUNDDOWN(E1101*H1101,4)","v":0}]
[null,"-","-","-",null,"t",null,0,null,{"$f":"ROUNDDOWN(E1102*H1102,4)","v":0}]
[null,null,null,"Custo unitário total de tempo fixo",{"$nulls":5},{"$f":"SUM(J1101:J1102)","v":0}]
[null,"F - MOMENTO DE TRANSPORTE",null,"Quantidade","Unidade","DMT",null,null,null,"Custo Unitário"]
[{"$nulls":5},"LN","RP","P"]
[null,"-","-",null,"tkm"]
[null,"-","-",null,"tkm"]
[null,null,null,"Custo unitário total de transporte"]
[{"$nulls":5},"Custo unitário direto total",null,null,null,{"$f":"TRUNC(J1099+J1103,2)","v":284.75}]
[null,"Obs."]

{"sheet":"CPU-FORNEC","index":2,"n_rows":92,"n_cols":14,"rows_kept":92,"cut":false,"hidden":false,"merged":[[71,0,80,0],[71,1,71,3],[71,4,71,7],[72,2,72,5],[73,2,73,3],[74,1,74,7],[77,1,77,3],[77,5,77,6],[78,1,78,6],[79,1,79,6],[80,1,80,6],[0,0,26,0],[0,1,0,3],[0,4,0,7],[22,1,22,3],[49,0,58,0],[49,1,49,3],[49,4,49,7],[50,2,50,5],[51,2,51,3],[52,1,52,7],[55,1,55,3],[55,5,55,6],[56,1,56,6],[57,1,57,6],[58,1,58,6],[27,1,27,3],[27,4,27,7],[28,2,28,5],[27,0,36,0],[29,2,29,3],[30,1,30,7],[33,1,33,3],[33,5,33,6],[34,1,34,6],[35,1,35,6],[36,1,36,6],[0,10,0,11],[1,2,1,5],[1,10,1,11],[2,2,2,3],[3,1,3,7],[22,5,22,6],[23,1,23,6],[24,1,24,6],[25,1,25,6],[5,1,5,7],[9,1,9,7],[13,1,13,7],[17,1,17,7],[38,0,47,0],[38,1,38,3],[38,4,38,7],[39,2,39,5],[40,2,40,3],[41,1,41,7],[44,1,44,3],[44,5,44,6],[45,1,45,6],[46,1,46,6],[47,1,47,6],[60,0,69,0],[60,1,60,3],[60,4,60,7],[61,2,61,5],[62,2,62,3],[63,1,63,7],[66,1,66,3],[66,5,66,6],[67,1,67,6],[68,1,68,6],[69,1,69,6],[81,1,81,7],[82,0,91,0],[82,1,82,3],[82,4,82,7],[83,2,83,5],[84,2,84,3],[85,1,85,7],[88,1,88,3],[88,5,88,6],[89,1,89,6],[90,1,90,6],[91,1,91,6]]}
[1,"CODEVASF",null,null," COMPOSIÇÃO DE PREÇO UNITÁRIO",null,null,null,{"$f":"H24","v":0},{"$f":"H26","v":0},"BDI CALCULADO:",null,{"$f":"ORÇAMENTO!L5","v":24.67}]
[null,"OBRA:  "," EXECUÇÃO DE RECAPEAMENTO ASFÁLTICO EM CBUQ - ESTRADA MUNICIPAL DA COMUNIDADE OLHOS D'ÁGUA - MONTES CLAROS - MG",null,null,null,"DATA: ",{"$f":"ORÇAMENTO!C6","v":" JULHO / 2026 "},null,null,"BDI DIFERENCIADO:",null,{"$f":"'BDI FORN'!D31/100","v":0.15}]
[null,"SERVIÇO:  ","CPU.1",null,"Referência:","CODEVASF","UNIDADE: ",{"$f":"VLOOKUP(A1,ORÇAMENTO!A11:L27,5)","v":"MOBILIZAÇÃO E DESMOBILIZAÇÃO"}]
[]
[null,"TIPO ITEM","CODIGO ITEM","DESCRIÇÃO ITEM","UNIDADE ITEM","COEFICIENTE","PRECO UNITARIO","CUSTO TOTAL",null,"distancia =",90,"B.DESPACHO"]
[null,"EQUIPAMENTOS",{"$nulls":7},"Pá carregadeira ",null,null,10.1," ton"]
[null,null,"E9001","E9001","E9001",null,"E9001"]
[]
[]
[null,"MÃO DE OBRA"]
[]
[]
[]
[null,"MATERIAIS"]
[]
[]
[{"$nulls":7},{"$f":"ROUNDDOWN(F17*G17,2)","v":0},null,"Motoniveladora ",null,null,12.47," ton"]
[null,"ATIVIDADES AUXILIARES",{"$nulls":7},"Trator de pneus",null,null,2.8," ton"]
[{"$nulls":7},{"$f":"ROUNDDOWN(F19*G19,2)","v":0}]
[{"$nulls":7},0]
[{"$nulls":7},0]
[{"$nulls":7},{"$f":"ROUNDDOWN(F22*G22,2)","v":0},null,"Rolo Compactador ",null,null,15.33," ton"]
[null,"PRODUÇÃO DA EQUIPE",null,null,1,"CUSTO ",null,{"$f":"SUM(H6:H22)","v":0},null,"Grade de disco",null,null,1," ton"]
[null,"TOTAL",{"$nulls":5},{"$f":"H23/E23","v":0},"OK","RETROESCAVADEIRA",null,null,6.67," ton"]
[null,"BDI                %",{"$nulls":5},{"$f":"1+$M$1","v":25.67}]
[null,"TOTAL DO SERVIÇO - R$",{"$nulls":5},{"$f":"ROUND(H24*H25,2)","v":0}]
[]
["F1","CODEVASF",null,null," COMPOSIÇÃO DE PREÇO UNITÁRIO",null,null,null,{"$f":"H35","v":2592.23},{"$f":"H37","v":2981.06}]
[null,"OBRA:  "," EXECUÇÃO DE RECAPEAMENTO ASFÁLTICO EM CBUQ - ESTRADA MUNICIPAL DA COMUNIDADE OLHOS D'ÁGUA - MONTES CLAROS - MG",null,null,null,"DATA: ",{"$f":"$H$2","v":" JULHO / 2026 "}]
[null,"SERVIÇO:  ","AQUISIÇÃO DE EMULSÃO ASFÁLTICA PARA IMPRIMAÇÃO (EAI) - EXCLUSIVE TRANSPORTE",null,"FONTE","CPU.7","UNIDADE: ",{"$f":"VLOOKUP(A28,ORÇAMENTO!$A$11:$L$53,7)","v":"T"}]
[]
[null,"TIPO ITEM","CODIGO ITEM","DESCRIÇÃO ITEM","UNIDADE ITEM","COEFICIENTE","PRECO UNITARIO","CUSTO TOTAL"]
[null,"INSUMO","ANP","EMULSÃO ASFÁLTICA PARA SERVIÇO DE IMPRIMAÇÃO (MEMÓRIA EM ANEXO)","T",1,2592.2350810040102,{"$f":"ROUNDDOWN(F33*G33,2)","v":2592.23}]
[null,"PRODUÇÃO DA EQUIPE",null,null,1,"CUSTO ",null,{"$f":"SUM(H33:H33)","v":2592.23}]
[null,"TOTAL",{"$nulls":5},{"$f":"H34/E34","v":2592.23}]
[null,"BDI                %",{"$nulls":5},{"$f":"1+$M$2","v":1.1499999999999999}]
[null,"TOTAL DO SERVIÇO - R$",{"$nulls":5},{"$f":"ROUND(H35*H36,2)","v":2981.06},"OK"]
[]
["F2","CODEVASF",null,null," COMPOSIÇÃO DE PREÇO UNITÁRIO",null,null,null,{"$f":"H46","v":740.26},{"$f":"H48","v":851.3}]
[null,"OBRA:  "," EXECUÇÃO DE RECAPEAMENTO ASFÁLTICO EM CBUQ - ESTRADA MUNICIPAL DA COMUNIDADE OLHOS D'ÁGUA - MONTES CLAROS - MG",null,null,null,"DATA: ",{"$f":"$H$2","v":" JULHO / 2026 "}]
[null,"SERVIÇO:  ","TRANSPORTE DE EMULSÃO ASFÁLTICA PARA IMPRIMAÇÃO (EAI)",null,"FONTE","CPU.8","UNIDADE: ",{"$f":"VLOOKUP(A39,ORÇAMENTO!$A$11:$L$53,7)","v":"T"}]
[]
[null,"TIPO ITEM","CODIGO ITEM","DESCRIÇÃO ITEM","UNIDADE ITEM","COEFICIENTE","PRECO UNITARIO","CUSTO TOTAL"]
[null,"INSUMO"," - ","TRANSPORTE DE EMULSÃO ASFÁLTICA PARA IMPRIMAÇÃO (EAI), INCLUINDO CUSTO TOTAL DO TRANSPORTE (COMBUSTÍVEL, PEDÁGIOS, ETC.) E ICMS - MEMÓRIA ANEXA","T",1,740.26,{"$f":"ROUNDDOWN(F44*G44,2)","v":740.26}]
[null,"PRODUÇÃO DA EQUIPE",null,null,1,"CUSTO ",null,{"$f":"SUM(H44:H44)","v":740.26}]
[null,"TOTAL",{"$nulls":5},{"$f":"H45/E45","v":740.26}]
[null,"BDI                %",{"$nulls":5},{"$f":"1+$M$2","v":1.1499999999999999}]
[null,"TOTAL DO SERVIÇO - R$",{"$nulls":5},{"$f":"ROUND(H46*H47,2)","v":851.3},"OK"]
[]
["F3","CODEVASF",null,null," COMPOSIÇÃO DE PREÇO UNITÁRIO",null,null,null,{"$f":"H57","v":2977.88},{"$f":"H59","v":3424.56}]
[null,"OBRA:  "," EXECUÇÃO DE RECAPEAMENTO ASFÁLTICO EM CBUQ - ESTRADA MUNICIPAL DA COMUNIDADE OLHOS D'ÁGUA - MONTES CLAROS - MG",null,null,null,"DATA: ",{"$f":"$H$2","v":" JULHO / 2026 "}]
[null,"SERVIÇO:  ","AQUISIÇÃO DE EMULSAO ASFALTICA CATIONICA RR-1C - EXCLUSIVE TRANSPORTE",null,"FONTE","CPU.9","UNIDADE: ",{"$f":"VLOOKUP(A50,ORÇAMENTO!$A$11:$L$53,7)","v":"T"}]
[]
[null,"TIPO ITEM","CODIGO ITEM","DESCRIÇÃO ITEM","UNIDADE ITEM","COEFICIENTE","PRECO UNITARIO","CUSTO TOTAL"]
[null,"INSUMO","ANP","EMULSÃO ASFÁLTICA CATIÔNICA RR-1C(MEMÓRIA EM ANEXO)","T",1,2977.8894342467106,{"$f":"ROUNDDOWN(F55*G55,2)","v":2977.88}]
[null,"PRODUÇÃO DA EQUIPE",null,null,1,"CUSTO ",null,{"$f":"SUM(H55:H55)","v":2977.88}]
[null,"TOTAL",{"$nulls":5},{"$f":"H56/E56","v":2977.88},"OK"]
[null,"BDI                %",{"$nulls":5},{"$f":"1+$M$2","v":1.1499999999999999}]
[null,"TOTAL DO SERVIÇO - R$",{"$nulls":5},{"$f":"ROUND(H57*H58,2)","v":3424.56}]
[]
["F4","CODEVASF",null,null," COMPOSIÇÃO DE PREÇO UNITÁRIO",null,null,null,{"$f":"H68","v":565.02},{"$f":"H70","v":649.77}]
[null,"OBRA:  "," EXECUÇÃO DE RECAPEAMENTO ASFÁLTICO EM CBUQ - ESTRADA MUNICIPAL DA COMUNIDADE OLHOS D'ÁGUA - MONTES CLAROS - MG",null,null,null,"DATA: ",{"$f":"$H$2","v":" JULHO / 2026 "}]
[null,"SERVIÇO:  ","TRANSPORTE DE EMULSÃO ASFÁLTICA CATIONICA RR-1C",null,"FONTE","CPU.10","UNIDADE: ",{"$f":"VLOOKUP(A61,ORÇAMENTO!$A$11:$L$53,7)","v":"T"}]
[]
[null,"TIPO ITEM","CODIGO ITEM","DESCRIÇÃO ITEM","UNIDADE ITEM","COEFICIENTE","PRECO UNITARIO","CUSTO TOTAL"]
[null,"INSUMO"," - ","TRANSPORTE DE EMULSÃO ASFÁLTICA CATIONICA TIPO RR-1C, INCLUINDO CUSTO TOTAL DO TRANSPORTE (COMBUSTÍVEL, PEDÁGIOS, ETC.) E ICMS - MEMÓRIA ANEXA","T",1,565.02333333333331,{"$f":"ROUNDDOWN(F66*G66,2)","v":565.02}]
[null,"PRODUÇÃO DA EQUIPE",null,null,1,"CUSTO ",null,{"$f":"SUM(H66:H66)","v":565.02}]
[null,"TOTAL",{"$nulls":5},{"$f":"H67/E67","v":565.02},"OK"]
[null,"BDI                %",{"$nulls":5},{"$f":"1+$M$2","v":1.1499999999999999}]
[null,"TOTAL DO SERVIÇO - R$",{"$nulls":5},{"$f":"ROUND(H68*H69,2)","v":649.77}]
[]
["F5","CODEVASF",null,null," COMPOSIÇÃO DE PREÇO UNITÁRIO",null,null,null,{"$f":"H79","v":3968.3},{"$f":"H81","v":4563.55}]
[null,"OBRA:  "," EXECUÇÃO DE RECAPEAMENTO ASFÁLTICO EM CBUQ - ESTRADA MUNICIPAL DA COMUNIDADE OLHOS D'ÁGUA - MONTES CLAROS - MG",null,null,null,"DATA: ",{"$f":"$H$2","v":" JULHO / 2026 "}]
[null,"SERVIÇO:  ","AQUISIÇÃO DE CONCRETO ASFÁLTICO DE PETRÓLEO - CAP 50/70 - EXCLUSIVE TRANSPORTE",null,"FONTE","CPU.11","UNIDADE: ",{"$f":"VLOOKUP(A72,ORÇAMENTO!$A$11:$L$53,7)","v":"T"}]
[]
[null,"TIPO ITEM","CODIGO ITEM","DESCRIÇÃO ITEM","UNIDADE ITEM","COEFICIENTE","PRECO UNITARIO","CUSTO TOTAL"]
[null,"INSUMO",1518,"CIMENTOS ASFÁLTICO DE PETRÓLEO TIPO CAP 50/70 (MEMÓRIA EM ANEXO)","T",1,3968.3031463040193,{"$f":"ROUNDDOWN(F77*G77,2)","v":3968.3}]
[null,"PRODUÇÃO DA EQUIPE",null,null,1,"CUSTO ",null,{"$f":"SUM(H77:H77)","v":3968.3}]
[null,"TOTAL",{"$nulls":5},{"$f":"H78/E78","v":3968.3}]
[null,"BDI                %",{"$nulls":5},{"$f":"1+$M$2","v":1.1499999999999999}]
[null,"TOTAL DO SERVIÇO - R$",{"$nulls":5},{"$f":"ROUND(H79*H80,2)","v":4563.55}]
[]
["F6","CODEVASF",null,null," COMPOSIÇÃO DE PREÇO UNITÁRIO",null,null,null,{"$f":"H90","v":420.95},{"$f":"H92","v":484.09}]
[null,"OBRA:  "," EXECUÇÃO DE RECAPEAMENTO ASFÁLTICO EM CBUQ - ESTRADA MUNICIPAL DA COMUNIDADE OLHOS D'ÁGUA - MONTES CLAROS - MG",null,null,null,"DATA: ",{"$f":"$H$2","v":" JULHO / 2026 "}]
[null,"SERVIÇO:  ","TRANSPORTE DE CONCRETO ASFÁLTICO DE PETRÓLEO - CAP 50/70",null,"FONTE","CPU.12","UNIDADE: ",{"$f":"VLOOKUP(A83,ORÇAMENTO!$A$11:$L$53,7)","v":"T"}]
[]
[null,"TIPO ITEM","CODIGO ITEM","DESCRIÇÃO ITEM","UNIDADE ITEM","COEFICIENTE","PRECO UNITARIO","CUSTO TOTAL"]
[null,"INSUMO"," - ","TRANSPORTE DE CIMENTO ASFÁLTICO DE PETRÓLEO TIPO CAP 50-70, INCLUINDO CUSTO TOTAL DO TRANSPORTE (COMBUSTÍVEL, PEDÁGIOS, ETC.) E ICMS - MEMÓRIA ANEXA","T",1,420.94999999999993,{"$f":"ROUNDDOWN(F88*G88,2)","v":420.95}]
[null,"PRODUÇÃO DA EQUIPE",null,null,1,"CUSTO ",null,{"$f":"SUM(H88:H88)","v":420.95}]
[null,"TOTAL",{"$nulls":5},{"$f":"H89/E89","v":420.95}]
[null,"BDI                %",{"$nulls":5},{"$f":"1+$M$2","v":1.1499999999999999}]
[null,"TOTAL DO SERVIÇO - R$",{"$nulls":5},{"$f":"ROUND(H90*H91,2)","v":484.09}]

{"sheet":"BDI SERV","index":3,"n_rows":60,"n_cols":5,"rows_kept":60,"cut":false,"hidden":false,"merged":[[38,1,38,4],[39,2,39,3],[36,0,36,5],[0,1,2,4],[25,1,25,3],[26,1,26,2],[26,3,26,4],[27,3,27,4],[35,0,35,5]]}
[null,"DETALHAMENTO DO BDI - SERVIÇOS"]
[]
[]
[null,"Item","Descrição dos Serviços","% - PV","% - CD"]
[]
[null,1,"ADMINISTRAÇÃO CENTRAL"," ",4.01]
[null,"1.1","ESCRITÓRIO CENTRAL",null,4.01]
[null,"1.2","VIAGENS"]
[null,"1.3","OUTROS"]
[null," "," "," "," "]
[null,2,"IMPOSTOS E TAXAS",8.65,0]
[null,"2.1","ISS - Proposta",5]
[null,"2.2","PIS",0.65]
[null,"2.3","Cofins",3]
[null,"2.4","Contribuição Previdenciaria (CPRB)"]
[]
[null,3,"TAXA DE RISCO",null,0.96]
[null,"3.1","SEGURO",null,0.2]
[null,"3.2","RISCO",null,0.56000000000000005]
[null,"3.3","GARANTIA",null,0.2]
[]
[null,4,"DESPESAS FINANCEIRAS",null,1.1100000000000001]
[]
[null,5,"LUCRO",null,7.3]
[]
[null,"BDI APRESENTADO:",null,null,24.67]
[]
[null,null,"Legislação Municipal:"," Lei Complementar nº 004/2005"]
[null,null,"Município:","Montes Claros "]
[null,null,"Alíquota ISSQN:",0.05,"Município"]
[null,null,"Base de Cálculo:",1,"Art. 55 § 2º"]
[null,null,"Valor Serviço:",783955.16]
[null,null,"Dedução - Material:",0]
[null,null,"ISSQN BDI:",0.05,"(*)"]
[]
["Acórdão nº 2.622/2013 - TCU Plenário"]
["BDI = ARRED((((((1+(AC+TR)/100)*(1+DF/100)*(1+L/100))/(1-IMP/100))-1)*100);2)"]
[]
[null,"(*) É obrigação da licitante a verificação da Legislação Tributária vigente no município, bem como o cálculo dos valores totais de serviços e materiais estimados, para apresentação de sua proposta."]
[]
[null,null,"Forma de Cálculo do BDI:","BDI - Acórdão nº 2.622/2013 - TCU"]
[]
[null,null,"BDI - Digitado",13.38]
[null,null,"BDI - Calculado",26.21]
[null,null,"BDI - Acórdão nº 2.622/2013 - TCU",24.67]
[]
[]
[]
[null,null,null,"Dedução - Material","Município"]
[null,null,null,0.1,"Simples Nacional"]
[null,null,null,0.2,"Municípios Indefinidos"]
[null,null,null,0.3]
[null,null,null,0.4]
[null,null,null,0.5]
[null,null,null,0.6]
[null,null,null,0.7]
[null,null,null,0.8]
[null,null,null,0.9]
[null,null,null,1]
[null,null,null,"Art. 55 § 2º"]

{"sheet":"BDI FORN","index":4,"n_rows":37,"n_cols":5,"rows_kept":37,"cut":false,"hidden":false,"merged":[[31,1,31,2],[32,0,34,5],[36,0,36,5],[0,1,2,4],[3,1,4,1],[3,2,4,2],[28,0,28,5],[30,1,30,2]]}
[null,"DETALHAMENTO DO BDI - FORNECIMENTO \n(MATERIAL ASFÁLTICO)"]
[]
[]
[null,"Item","Descrição dos Serviços","%","%"]
[null,null,null,"PV","CD"]
[]
[null,1,"ADMINISTRAÇÃO CENTRAL"," ",3.45]
[null,"1.1","ESCRITÓRIO CENTRAL"," "," "]
[null,"1.2","VIAGENS"," "," "]
[null,"1.3","OUTROS"," "," "]
[null," "," "," "," "]
[null,2,"IMPOSTOS E TAXAS",3.65,4.5600000000000005]
[null,"2.1","ISS (*)",null,0]
[null,"2.2","PIS",0.65,0.81]
[null,"2.3","Cofins",3,3.75]
[null,"2.4","CONTRIBUIÇÃO PREVIDENCIÁRIA SOBRE A RENDA BRUTA",0,0]
[]
[null,3,"TAXA DE RISCO"," ",1.08]
[null,"3.1","SEGURO",null,0.24]
[null,"3.2","RISCO",null,0.6]
[null,"3.3","GARANTIA",null,0.24]
[]
[null,4,"DESPESAS FINANCEIRAS"," ",0.85]
[]
[null,5,"LUCRO",null,5.1100000000000003]
[]
[null," ","BDI - CALCULADO"," ",15]
[]
["BDI = ((1+((AC+S+R+G)/100))x(1+DF/100)x(1+L/100)/(1-I/100)-1)*100"]
[]
[null,"BDI (CALCULADO):",null,15,"%"]
[null," "]
[]
[]
[]
[]
["BDI EM CONFORMIDADE COM OS ACÓRDÃOS Nº 2369/2011 e ACÓRDÃO Nº 2.622/2013 - TCU - PLENÁRIO"]

{"sheet":"CRONOGRAMA","index":5,"n_rows":19,"n_cols":11,"rows_kept":19,"cut":false,"hidden":false,"merged":[[9,0,10,0],[9,1,10,1],[9,2,10,2],[15,1,16,2],[18,1,22,10],[11,0,12,0],[11,1,12,1],[11,2,12,2],[13,0,14,0],[13,1,14,1],[13,2,14,2],[3,1,3,9],[5,0,6,0],[5,1,6,1],[5,2,6,2],[7,0,8,0],[7,1,8,1],[7,2,8,2],[0,1,0,10],[1,1,2,1],[1,2,2,4],[1,6,1,10],[2,6,2,10]]}
[null,"CRONOGRAMA FÍSICO-FINANCEIRO"]
[null,"OBRA: "," EXECUÇÃO DE RECAPEAMENTO ASFÁLTICO EM CBUQ - ESTRADA MUNICIPAL DA COMUNIDADE OLHOS D'ÁGUA - MONTES CLAROS - MG",null,null,"VALOR:",1300000]
[{"$nulls":5},"PRAZO: ","150 DIAS "]
[]
[null,"ITEM","ETAPAS/DESCRIÇAO","FISICO/  FINANCEIRO","TOTAL    ETAPAS","MÊS 1","MÊS 2","MÊS 3","MÊS 4","MÊS 5","TOTAL"]
["A",1,"SERVIÇOS PRELIMINARES ","FISICO ",8.7400000000000005E-2,0.25,0.2,0.2,0.2,0.15,1]
[null,null,null,"FINANCEIRO",113660.3,28415.08,22732.06,22732.06,22732.06,17049.05,113660.31]
["B",2,"TERRAPLANAGEM E PAVIMENTAÇÃO","FISICO ",0.26540000000000002,0.25,0.2,0.2,0.2,0.15,1]
[null,null,null,"FINANCEIRO",345005.5,86251.38,69001.100000000006,69001.100000000006,69001.100000000006,51750.83,345005.51000000007]
["C",3,"TRANSPORTE DE MATERIAIS","FISICO ",7.2700000000000001E-2,0.2,0.2,0.2,0.2,0.2,1]
[null,null,null,"FINANCEIRO",94564,18912.8,18912.8,18912.8,18912.8,18912.8,94563.96]
["E",4,"DRENAGEM E OBRAS COMPLEMENTARES","FISICO ",0.32590000000000002,0.15,0.15,0.2,0.3,0.2,1]
[null,null,null,"FINANCEIRO",423648.98,63547.35,63547.35,84729.8,127094.69,84729.8,423648.97]
["F",5,"FORNECIMENTOS - MATERIAL ASFÁLTICO (BDI DIFERENCIADO)","FISICO ",0.24859999999999999,0.1,0.2,0.3,0.2,0.2,1]
[null,null,null,"FINANCEIRO",323121.22000000003,32312.12,64624.24,96936.37,64624.24,64624.24,323121.18999999994]
[null,"TOTAL",null,"FISICO ",1.0000000153846154,0.17649133076923076,0.18370580769230771,0.22485548461538463,0.23258837692307693,0.18235901538461541,1.0000000153846154]
[null,null,null,"FINANCEIRO",1300000,229438.73,238817.55000000002,292312.13,302364.89,237066.72000000003,1300000]
[]
[null,"OBSERVAÇÕES:"]