{"text_format":"2","workbook":"xlsx","n_sheets":6,"sheets":["ORÇAMENTO","CPU-SERV","CPU-FORNEC","BDI SERV","BDI FORN","CRONOGRAMA"],"not_rendered":{"charts":0,"images":3,"macros":0,"external_links":0,"defined_names":7,"comments":2,"pivot_tables":0},"unopened":[],"bounds":{"document_bytes":16777216,"sheet_cells":100000,"run_cost":"one","rows_first":2000,"rows_last":500,"rows_between":2000,"halvings":0,"cell_chars":16384,"cell_head_chars":4096},"cells_cut":0,"cells_raw":0,"read":"whole","date_system":"1900"}

{"sheet":"ORÇAMENTO","index":0,"n_rows":46,"n_cols":16,"rows_kept":46,"cut":false,"hidden":false,"merged":[[6,8,6,10],[9,16,9,18],[45,1,45,4],[0,0,8,0],[0,4,0,11],[1,4,1,11],[2,4,2,11],[6,1,6,4],[9,14,9,15],[7,1,7,11],[4,2,4,8],[5,2,5,7],[4,9,4,10],[5,8,5,10]]}
["<---- NUMERAR SERVIÇOS PARA CPU",null,null,null,"Ministério do Desenvolvimento Regional"]
[{"$nulls":4},"Companhia de Desenvolvimento dos Vales do São Francisco e do Parnaíba"]
[{"$nulls":4},"1ª Superintendência Regional",{"$nulls":7},"VALOR SERVIÇO"," = ",{"$f":"TRUNC(SUMPRODUCT(H11:H25,I11:I25)+SUMPRODUCT(H27:H38,I27:I38),2)","v":783955.16},{"$f":"(L10+L16+L21+L26)/(1+L5)","v":38055.269964939616}]
[]
[null,"OBRA: "," EXECUÇÃO DE RECAPEAMENTO ASFÁLTICO EM CBUQ - ESTRADA MUNICIPAL DA COMUNIDADE OLHOS D'ÁGUA - MONTES CLAROS - MG",{"$nulls":6},"BDI Serviços (%):",null,{"$f":"'BDI SERV'!E26","v":24.67}]
[null,"DATA:"," JULHO / 2026 ",{"$nulls":5},"BDI Diferenciado Serviços (%):",null,null,{"$f":"'BDI FORN'!D31","v":15}]
[null,"PRAZO DE EXECUÇÃO:     150 DIAS",{"$nulls":6},"BDI Fornecimentos (%):",null,null,{"$f":"'BDI FORN'!D31","v":15}]
[null,"PLANILHA DE ORÇAMENTAÇÃO"]
[null,"ITEM","CÓDIGO","FONTE","DISCRIMINAÇÃO","TIPO","UNID.","QUANT.","VR.UNIT.S/BDI","PR. UNIT.C/BDI","C. TOT.S/BDI","P. TOT.C/BDI"]
["A",1,null,null,"SERVIÇOS PRELIMINARES ",{"$nulls":5},{"$f":"SUM(K11:K15)","v":91181.560000000012},{"$f":"SUM(L11:L15)","v":113660.3}]
[1,"1.1","CPU.1","CODEVASF","MOBILIZAÇÃO E DESMOBILIZAÇÃO","SERV","GL",1,{"$f":"VLOOKUP(A11,'CPU-SERV'!A:K,11,0)","v":7066.91},{"$f":"TRUNC(_xlfn.IFS(F11=\"SERV\",I11*(1+$L$5/100),F11=\"SERV DIF\",I11*(1+$L$6/100),F11=\"FORN\",I11*(1+$L$7/100)),2)","v":8810.31},{"$f":"TRUNC(H11*I11,2)","v":7066.91},{"$f":"TRUNC(H11*J11,2)","v":8810.31}]
[2,"1.2","CPU.2","CODEVASF","ADMINISTRAÇÃO LOCAL ","SERV","GL",1,{"$f":"VLOOKUP(A12,'CPU-SERV'!A:K,11,0)","v":74744.98},{"$f":"TRUNC(_xlfn.IFS(F12=\"SERV\",I12*(1+$L$5/100),F12=\"SERV DIF\",I12*(1+$L$6/100),F12=\"FORN\",I12*(1+$L$7/100)),2)","v":93184.56},{"$f":"TRUNC(H12*I12,2)","v":74744.98},{"$f":"TRUNC(H12*J12,2)","v":93184.56}]
[3,"1.3","CPU.3","CODEVASF","CANTEIRO DE OBRAS ","SERV","GL",1,{"$f":"VLOOKUP(A13,'CPU-SERV'!A:K,11,0)","v":7197.85},{"$f":"TRUNC(_xlfn.IFS(F13=\"SERV\",I13*(1+$L$5/100),F13=\"SERV DIF\",I13*(1+$L$6/100),F13=\"FORN\",I13*(1+$L$7/100)),2)","v":8973.5499999999993},7197.85,8973.5499999999993]
[4,"1.4",103689,"SINAPI","PLACA DE OBRA EM CHAPA DE AÇO GALVANIZADO","SERV","M2",2,{"$f":"VLOOKUP(A14,'CPU-SERV'!A:K,11,0)","v":437.91},{"$f":"TRUNC(_xlfn.IFS(F14=\"SERV\",I14*(1+$L$5/100),F14=\"SERV DIF\",I14*(1+$L$6/100),F14=\"FORN\",I14*(1+$L$7/100)),2)","v":545.94000000000005},875.82,1091.8800000000001]
[5,"1.5",5502985,"SICRO","LIMPEZA MECANIZADA DE CAMADA VEGETAL","SERV","M2",1600,{"$f":"VLOOKUP(A15,'CPU-SERV'!A:K,11,0)","v":0.81},{"$f":"TRUNC(_xlfn.IFS(F15=\"SERV\",I15*(1+$L$5/100),F15=\"SERV DIF\",I15*(1+$L$6/100),F15=\"FORN\",I15*(1+$L$7/100)),2)","v":1},1296,1600]
["B",2,null,null,"TERRAPLANAGEM E PAVIMENTAÇÃO",{"$nulls":5},{"$f":"SUM(K17:K20)","v":276768},{"$f":"SUM(L17:L20)","v":345005.5}]
[10,"2.1",4915656,"SICRO","FRESAGEM CONTÍNUA DE REVESTIMENTO ASFÁLTICO - ESPESSURA ATÉ 4CM","SERV","M3",400,{"$f":"VLOOKUP(A17,'CPU-SERV'!A:K,11,0)","v":91.31},{"$f":"TRUNC(_xlfn.IFS(F17=\"SERV\",I17*(1+$L$5/100),F17=\"SERV DIF\",I17*(1+$L$6/100),F17=\"FORN\",I17*(1+$L$7/100)),2)","v":113.83},{"$f":"TRUNC(H17*I17,2)","v":36524},{"$f":"TRUNC(H17*J17,2)","v":45532}]
[11,"2.2",4915631,"SICRO","REMENDO PROFUNDO COM IMPRIMAÇÃO - DEMOLIÇÃO MECÂNICA E CORTE COM SERRA","SERV","M3",50,{"$f":"VLOOKUP(A18,'CPU-SERV'!A:K,11,0)","v":323.44},{"$f":"TRUNC(_xlfn.IFS(F18=\"SERV\",I18*(1+$L$5/100),F18=\"SERV DIF\",I18*(1+$L$6/100),F18=\"FORN\",I18*(1+$L$7/100)),2)","v":403.23},16172,20161.5]
[13,"2.3",4011353,"SICRO","PINTURA DE LIGAÇÃO COM EMULSÃO ASFÁLTICA RR-1C","SERV","M2",9600,{"$f":"VLOOKUP(A19,'CPU-SERV'!A:K,11,0)","v":0.42},{"$f":"TRUNC(_xlfn.IFS(F19=\"SERV\",I19*(1+$L$5/100),F19=\"SERV DIF\",I19*(1+$L$6/100),F19=\"FORN\",I19*(1+$L$7/100)),2)","v":0.52},4032,4992]
[14,"2.4",4011463,"SICRO","EXECUÇÃO DE PAVIMENTO COM APLICAÇÃO DE CONCRETO ASFÁLTICO USINADO A QUENTE (CBUQ), CAMADA DE ROLAMENTO - EXCLUSIVE TRANSPORTE","SERV","T",1000,{"$f":"VLOOKUP(A20,'CPU-SERV'!A:K,11,0)","v":220.04},{"$f":"TRUNC(_xlfn.IFS(F20=\"SERV\",I20*(1+$L$5/100),F20=\"SERV DIF\",I20*(1+$L$6/100),F20=\"FORN\",I20*(1+$L$7/100)),2)","v":274.32},220040,274320]
{"$rows_left_out":27}
{"sheet":"CPU-SERV","index":1,"n_rows":1110,"n_cols":16,"rows_kept":1110,"cut":false,"hidden":false,"merged":[[1103,3,1104,3],[1103,4,1104,4],[1103,5,1103,7],[1103,9,1104,9],[1107,3,1107,7],[1108,5,1108,7],[39,0,81,0],[40,2,40,9],[1072,0,1109,0],[1073,2,1073,9],[1074,1,1075,3],[1074,4,1074,5],[1075,4,1075,5],[1076,2,1076,7],[1076,8,1076,9],[1077,1,1078,2],[1077,3,1078,3],[1077,4,1077,5],[1077,6,1077,7],[1082,7,1082,9],[1085,3,1085,7],[1086,3,1086,7],[1087,3,1087,7],[1090,7,1090,9],[1093,3,1093,7],[1094,7,1094,9],[1097,3,1097,7],[1099,8,1099,9],[1102,3,1102,7],[1103,1,1104,2],[362,0,411,0],[363,2,363,9],[364,1,365,3],[364,4,364,5],[365,4,365,5],[366,2,366,7],[366,8,366,9],[367,1,368,2],[367,3,368,3],[367,4,367,5],[367,6,367,7],[375,7,375,9],[377,3,377,7],[378,3,378,7],[379,3,379,7],[382,7,382,9],[390,3,390,7],[409,3,409,7],[30,3,30,7],[31,1,32,2],[7,13,7,15],[15,11,15,13],[22,7,22,9],[25,3,25,7],[2,10,2,11],[27,8,27,9],[21,3,21,7],[4,2,4,7],[4,8,4,9],[5,1,6,2],[5,3,6,3],[5,4,5,5],[5,6,5,7],[41,1,42,3],[41,4,41,5],[42,4,42,5],[43,2,43,7],[43,8,43,9],[44,1,45,2],[0,0,37,0],[3,4,3,5],[0,11,0,12],[1,11,1,12],[2,4,2,5],[1,2,1,9],[2,1,3,3],[31,3,32,3],[31,4,32,4],[31,5,31,7],[31,9,32,9],[35,3,35,7],[36,5,36,7],[10,7,10,9],[13,3,13,7],[14,3,14,7],[15,3,15,7],[18,7,18,9],[57,3,57,7],[60,7,60,9],[63,3,63,7],[64,7,64,9],[69,3,69,7],[71,8,71,9],[44,3,45,3],[44,4,44,5],[44,6,44,7],[49,7,49,9],[55,3,55,7],[56,3,56,7],[79,3,79,7],[80,5,80,7],[85,4,85,5],[74,3,74,7],[75,1,76,2],[75,3,76,3],[75,4,76,4],[75,5,75,7],[75,9,76,9],[114,1,115,2],[114,3,115,3],[114,4,115,4],[114,5,114,7],[114,9,115,9],[118,3,118,7],[93,7,93,9],[98,3,98,7],[101,7,101,9],[104,3,104,7],[105,7,105,9],[108,3,108,7],[110,8,110,9],[113,3,113,7],[96,3,96,7],[97,3,97,7],[119,5,119,7],[122,0,161,0],[123,2,123,9],[124,1,125,3],[124,4,124,5],[125,4,125,5],[126,2,126,7],[126,8,126,9],[159,3,159,7],[160,5,160,7],[83,0,120,0],[84,2,84,9],[85,1,86,3],[86,4,86,5],[87,2,87,7],[87,8,87,9],[88,1,89,2],[88,3,89,3],[88,4,88,5],[88,6,88,7],[136,3,136,7],[137,3,137,7],[140,7,140,9],[145,3,145,7],[146,7,146,9],[149,3,149,7],[127,1,128,2],[127,3,128,3],[127,4,127,5],[127,6,127,7],[132,7,132,9],[135,3,135,7],[151,8,151,9],[154,3,154,7],[155,1,156,2],[155,3,156,3],[155,4,156,4],[155,5,155,7],[155,9,156,9],[188,3,188,7],[190,8,190,9],[176,3,176,7],[177,3,177,7],[178,3,178,7],[167,8,167,9],[168,1,169,2],[168,3,169,3],[168,4,168,5],[168,6,168,7],[173,7,173,9],[198,3,198,7],[199,5,199,7],[181,7,181,9],[184,3,184,7],[185,7,185,9],[163,0,200,0],[164,2,164,9],[165,1,166,3],[165,4,165,5],[166,4,166,5],[167,2,167,7],[193,3,193,7],[194,1,195,2],[194,3,195,3],[194,4,195,4],[194,5,194,7],[194,9,195,9],[203,2,203,9],[204,1,205,3],[204,4,204,5],[205,4,205,5],[206,2,206,7],[239,3,239,7],[240,5,240,7],[247,8,247,9],[248,1,249,2],[248,3,249,3],[248,4,248,5],[217,3,217,7],[218,3,218,7],[219,3,219,7],[222,7,222,9],[225,3,225,7],[226,7,226,9],[206,8,206,9],[207,1,208,2],[207,3,208,3],[207,4,207,5],[207,6,207,7],[214,7,214,9],[248,6,248,7],[243,0,285,0],[244,2,244,9],[245,1,246,3],[245,4,245,5],[246,4,246,5],[247,2,247,7],[229,3,229,7],[231,8,231,9],[234,3,234,7],[235,1,236,2],[235,3,236,3],[235,4,236,4],[235,5,235,7],[235,9,236,9],[273,3,273,7],[275,8,275,9],[278,3,278,7],[279,1,280,2],[279,3,280,3],[279,4,280,4],[279,5,279,7],[279,9,280,9],[260,3,260,7],[202,0,241,0],[257,7,257,9],[283,3,283,7],[284,5,284,7],[261,3,261,7],[262,3,262,7],[265,7,265,9],[269,3,269,7],[270,7,270,9],[318,3,319,3],[318,4,319,4],[318,5,318,7],[318,9,319,9],[300,3,300,7],[291,8,291,9],[314,8,314,9],[317,3,317,7],[302,3,302,7],[292,1,293,2],[292,3,293,3],[292,4,292,5],[305,7,305,9],[308,3,308,7],[309,7,309,9],[391,7,391,9],[350,3,350,7],[326,0,360,0],[327,2,327,9],[328,1,329,3],[328,4,328,5],[329,4,329,5],[330,2,330,7],[358,3,358,7],[359,5,359,7],[306,7,306,8],[287,0,324,0],[288,2,288,9],[289,1,290,3],[289,4,289,5],[290,4,290,5],[291,2,291,7],[312,3,312,7],[318,1,319,2],[443,3,443,7],[444,1,445,2],[444,3,445,3],[444,4,445,4],[444,5,444,7],[444,9,445,9],[292,6,292,7],[297,7,297,9],[339,3,339,7],[340,3,340,7],[341,3,341,7],[344,7,344,9],[347,3,347,7],[348,7,348,9],[330,8,330,9],[331,1,332,2],[331,3,332,3],[331,4,331,5],[331,6,331,7],[337,7,337,9],[322,3,322,7],[323,5,323,7],[301,3,301,7],[352,8,352,9],[354,3,354,7],[428,3,428,7],[431,7,431,9],[434,3,434,7],[435,7,435,9],[417,8,417,9],[417,2,417,7],[427,3,427,7],[355,1,356,2],[355,3,356,3],[355,4,356,4],[355,5,355,7],[355,9,356,9],[402,1,403,2],[402,3,403,3],[402,4,403,4],[402,5,402,7],[402,9,403,9],[393,3,393,7],[395,8,395,9],[401,3,401,7],[387,7,387,8],[410,5,410,7],[418,1,419,2],[418,3,419,3],[418,4,418,5],[418,6,418,7],[423,7,423,9],[448,3,448,7],[449,5,449,7],[438,3,438,7],[440,8,440,9],[452,0,489,0],[453,2,453,9],[454,1,455,3],[454,4,454,5],[455,4,455,5],[456,2,456,7],[487,3,487,7],[488,5,488,7],[413,0,450,0],[414,2,414,9],[415,1,416,3],[415,4,415,5],[416,4,416,5],[477,3,477,7],[479,8,479,9],[482,3,482,7],[426,3,426,7],[501,7,501,9],[474,7,474,9],[456,8,456,9],[457,1,458,2],[457,3,458,3],[457,4,457,5],[457,6,457,7],[462,7,462,9],[465,3,465,7],[466,3,466,7],[467,3,467,7],[470,7,470,9],[473,3,473,7],[483,1,484,2],[483,3,484,3],[483,4,484,4],[483,5,483,7],[483,9,484,9],[495,8,495,9],[496,1,497,2],[496,3,497,3],[496,4,496,5],[496,6,496,7],[522,3,523,3],[522,4,523,4],[522,5,522,7],[522,9,523,9],[504,3,504,7],[505,3,505,7],[506,3,506,7],[509,7,509,9],[512,3,512,7],[513,7,513,9],[526,3,526,7],[527,5,527,7],[530,0,567,0],[531,2,531,9],[532,1,533,3],[532,4,532,5],[533,4,533,5],[534,2,534,7],[565,3,565,7],[566,5,566,7],[491,0,528,0],[492,2,492,9],[493,1,494,3],[493,4,493,5],[494,4,494,5],[495,2,495,7],[555,3,555,7],[557,8,557,9],[560,3,560,7],[561,1,562,2],[516,3,516,7],[518,8,518,9],[521,3,521,7],[522,1,523,2],[543,3,543,7],[544,3,544,7],[545,3,545,7],[548,7,548,9],[551,3,551,7],[552,7,552,9],[534,8,534,9],[535,1,536,2],[535,3,536,3],[535,4,535,5],[535,6,535,7],[540,7,540,9],[561,3,562,3],[561,4,562,4],[561,5,561,7],[561,9,562,9],[594,3,594,7],[596,8,596,9],[599,3,599,7],[600,1,601,2],[600,3,601,3],[600,4,601,4],[600,5,600,7],[600,9,601,9],[582,3,582,7],[583,3,583,7],[584,3,584,7],[587,7,587,9],[590,3,590,7],[591,7,591,9],[573,8,573,9],[574,1,575,2],[574,3,575,3],[574,4,574,5],[574,6,574,7],[579,7,579,9],[604,3,604,7],[605,5,605,7],[608,0,647,0],[609,2,609,9],[610,1,611,3],[610,4,610,5],[611,4,611,5],[612,2,612,7],[645,3,645,7],[646,5,646,7],[569,0,606,0],[570,2,570,9],[571,1,572,3],[571,4,571,5],[572,4,572,5],[573,2,573,7],[635,3,635,7],[637,8,637,9],[640,3,640,7],[641,1,642,2],[621,3,621,7],[622,3,622,7],[623,3,623,7],[626,7,626,9],[631,3,631,7],[632,7,632,9],[612,8,612,9],[613,1,614,2],[613,3,614,3],[613,4,613,5],[613,6,613,7],[618,7,618,9],[641,3,642,3],[641,4,642,4],[641,5,641,7],[641,9,642,9],[676,3,676,7],[678,8,678,9],[681,3,681,7],[682,1,683,2],[682,3,683,3],[682,4,683,4],[682,5,682,7],[682,9,683,9],[663,3,663,7],[664,3,664,7],[665,3,665,7],[668,7,668,9],[672,3,672,7],[673,7,673,9],[653,8,653,9],[654,1,655,2],[654,3,655,3],[654,4,654,5],[654,6,654,7],[660,7,660,9],[686,3,686,7],[687,5,687,7],[690,0,729,0],[691,2,691,9],[692,1,693,3],[692,4,692,5],[693,4,693,5],[694,2,694,7],[727,3,727,7],[728,5,728,7],[649,0,688,0],[650,2,650,9],[651,1,652,3],[651,4,651,5],[652,4,652,5],[653,2,653,7],[717,3,717,7],[719,8,719,9],[722,3,722,7],[723,1,724,2],[703,3,703,7],[704,3,704,7],[705,3,705,7],[708,7,708,9],[711,3,711,7],[712,7,712,9],[694,8,694,9],[695,1,696,2],[695,3,696,3],[695,4,695,5],[695,6,695,7],[700,7,700,9],[723,3,724,3],[723,4,724,4],[723,5,723,7],[723,9,724,9],[758,3,758,7],[760,8,760,9],[763,3,763,7],[764,1,765,2],[764,3,765,3],[764,4,765,4],[764,5,764,7],[764,9,765,9],[744,3,744,7],[745,3,745,7],[746,3,746,7],[749,7,749,9],[751,3,751,7],[752,7,752,9],[735,8,735,9],[736,1,737,2],[736,3,737,3],[736,4,736,5],[736,6,736,7],[741,7,741,9],[768,3,768,7],[769,5,769,7],[772,0,811,0],[773,2,773,9],[774,1,775,3],[774,4,774,5],[775,4,775,5],[776,2,776,7],[809,3,809,7],[810,5,810,7],[731,0,770,0],[732,2,732,9],[733,1,734,3],[733,4,733,5],[734,4,734,5],[735,2,735,7],[799,3,799,7],[801,8,801,9],[804,3,804,7],[805,1,806,2],[785,3,785,7],[786,3,786,7],[787,3,787,7],[790,7,790,9],[793,3,793,7],[794,7,794,9],[776,8,776,9],[777,1,778,2],[777,3,778,3],[777,4,777,5],[777,6,777,7],[782,7,782,9],[805,3,806,3],[805,4,806,4],[805,5,805,7],[805,9,806,9],[861,1,862,2],[861,3,862,3],[861,4,861,5],[861,6,861,7],[842,3,842,7],[844,8,844,9],[847,3,847,7],[848,1,849,2],[848,3,849,3],[848,4,849,4],[848,5,848,7],[848,9,849,9],[813,0,854,0],[814,2,814,9],[815,1,816,3],[815,4,815,5],[816,4,816,5],[817,2,817,7],[817,8,817,9],[818,1,819,2],[818,3,819,3],[818,4,818,5],[818,6,818,7],[823,7,823,9],[826,3,826,7],[827,3,827,7],[828,3,828,7],[831,7,831,9],[834,3,834,7],[835,7,835,9],[869,3,869,7],[870,3,870,7],[871,3,871,7],[874,7,874,9],[877,3,877,7],[878,7,878,9],[866,7,866,9],[852,3,852,7],[853,5,853,7],[860,8,860,9],[931,1,932,2],[882,3,882,7],[884,8,884,9],[887,3,887,7],[888,1,889,2],[888,3,889,3],[888,4,889,4],[888,5,888,7],[888,9,889,9],[900,8,900,9],[901,1,902,2],[901,3,902,3],[901,4,901,5],[901,6,901,7],[906,7,906,9],[892,3,892,7],[893,5,893,7],[917,3,917,7],[918,7,918,9],[930,3,930,7],[896,0,937,0],[897,2,897,9],[898,1,899,3],[898,4,898,5],[899,4,899,5],[900,2,900,7],[935,3,935,7],[936,5,936,7],[856,0,894,0],[857,2,857,9],[858,1,859,3],[858,4,858,5],[859,4,859,5],[860,2,860,7],[925,3,925,7],[927,8,927,9],[931,3,932,3],[931,4,932,4],[931,5,931,7],[931,9,932,9],[909,3,909,7],[910,3,910,7],[911,3,911,7],[914,7,914,9],[939,0,983,0],[940,2,940,9],[941,1,942,3],[941,4,941,5],[942,4,942,5],[943,2,943,7],[981,3,981,7],[982,5,982,7],[967,3,967,7],[969,8,969,9],[974,3,974,7],[975,1,976,2],[952,3,952,7],[953,3,953,7],[954,3,954,7],[957,7,957,9],[963,3,963,7],[964,7,964,9],[943,8,943,9],[944,1,945,2],[944,3,945,3],[944,4,944,5],[944,6,944,7],[949,7,949,9],[975,3,976,3],[975,4,976,4],[975,5,975,7],[975,9,976,9],[1012,3,1012,7],[1014,8,1014,9],[1017,3,1017,7],[1018,1,1019,2],[1018,3,1019,3],[1018,4,1019,4],[1018,5,1018,7],[1018,9,1019,9],[999,3,999,7],[1000,3,1000,7],[1001,3,1001,7],[1004,7,1004,9],[1008,3,1008,7],[1009,7,1009,9],[989,8,989,9],[990,1,991,2],[990,3,991,3],[990,4,990,5],[990,6,990,7],[996,7,996,9],[1030,8,1030,9],[1031,1,1032,2],[1031,3,1032,3],[1031,4,1031,5],[1031,6,1031,7],[1036,7,1036,9],[1022,3,1022,7],[1023,5,1023,7],[1026,0,1070,0],[1027,2,1027,9],[1028,1,1029,3],[1028,4,1028,5],[1029,4,1029,5],[1030,2,1030,7],[1068,3,1068,7],[1069,5,1069,7],[985,0,1024,0],[986,2,986,9],[987,1,988,3],[987,4,987,5],[988,4,988,5],[989,2,989,7],[1054,3,1054,7],[1056,8,1056,9],[1061,3,1061,7],[1062,1,1063,2],[1062,3,1063,3],[1062,4,1063,4],[1062,5,1062,7],[1062,9,1063,9],[1039,3,1039,7],[1040,3,1040,7],[1041,3,1041,7],[1044,7,1044,9],[1050,3,1050,7],[1051,7,1051,9]]}
[1,"1ª/GRD",{"$nulls":8},{"$f":"J37","v":7066.91}]
[null,"OBRA:"," EXECUÇÃO DE RECAPEAMENTO ASFÁLTICO EM CBUQ - ESTRADA MUNICIPAL DA COMUNIDADE OLHOS D'ÁGUA - MONTES CLAROS - MG"]
[null,"Custo Unitário de Referência",null,null,"Minas Gerais"]
[{"$nulls":4}," Abril/2026",null,null,"Produção da equipe ",0.5,{"$f":"VLOOKUP(A1,ORÇAMENTO!$A$10:$L$46,7,1)","v":"GL"}]
[null,"CPU.1","MOBILIZAÇÃO E DESMOBILIZAÇÃO",{"$nulls":5},"Valores em reais (R$)"]
[null,"A - EQUIPAMENTOS",null,"Quantidade","Utilização",null,"Custo Horário",null,null,"Custo"]
[{"$nulls":4},"Operativa","Improdutiva","Produtivo","Improdutivo",null,"Horário Total"]
[null,"E9687","Caminhão carroceria com capacidade de 5 t - 120 kW",4,0.5,0.5,186.67019999999999,69.418999999999997,null,{"$f":"D8*(E8*G8+F8*H8)","v":512.17840000000001},null,"distancia =",30,"MONTES CLAROS"]
[null,"E9575","Caminhão basculante com caçamba estanque com capacidade de 14 m³ - 210 kW",4,1,0,361.291,100.32389999999999,null,{"$f":"D9*(E9*G9+F9*H9)","v":1445.164},null,"Pá carregadeira ",null,null,null," ton"]
[{"$nulls":7},"Custo horário total de equipamentos",null,{"$f":"SUM(J8:J9)","v":1957.3424},null,"Motoniveladora ",null,null,12.47," ton"]
[null,"B - MÃO DE OBRA",null,"Quantidade","Unidade",null,"Custo Horário","Custo Horário Total",null,null,null,"Trator de pneus",null,null,null," ton"]
[null,"P9824","Servente",8,"h",null,22.6355,null,null,{"$f":"D12*G12","v":181.084},null,"Rolo Compactador ",null,null,27," ton"]
[{"$nulls":9},{"$f":"D13*G13","v":0},null,"Rolo Tandem",null,null,10.4," ton"]
[null,null,null,"Custo horário total de mão de obra",{"$nulls":5},{"$f":"SUM(J12:J13)","v":181.084},null,"Retroescavadeira ",null,null,6.67," ton"]
[null,null,null,"Custo horário total de execução",{"$nulls":5},{"$f":"J10+J14","v":2138.4263999999998},null,"Fresadora",null,null,15,"ton"]
[null,null,null,"Custo unitário de execução",{"$nulls":5},{"$f":"J15/I4","v":4276.8527999999997},null,"MOBILIZAÇÃO + DESMOBILIZAÇÃO DOS EQUIPTOS",null,null,{"$f":"SUM(O9:O15)*M8*2","v":4292.3999999999996},"ton.km"]
[{"$nulls":7},"Custo do FIC",null,0]
[{"$nulls":7},"Custo do FIT",null,0]
[null,"C - MATERIAL",null,"Quantidade","Unidade",null,"Preço Unitário","Custo Unitário"]
[null,"-","-",null,"-",null,0,null,null,{"$f":"D20*G20","v":0}]
{"$rows_left_out":1091}
{"sheet":"CPU-FORNEC","index":2,"n_rows":92,"n_cols":14,"rows_kept":92,"cut":false,"hidden":false,"merged":[[71,0,80,0],[71,1,71,3],[71,4,71,7],[72,2,72,5],[73,2,73,3],[74,1,74,7],[77,1,77,3],[77,5,77,6],[78,1,78,6],[79,1,79,6],[80,1,80,6],[0,0,26,0],[0,1,0,3],[0,4,0,7],[22,1,22,3],[49,0,58,0],[49,1,49,3],[49,4,49,7],[50,2,50,5],[51,2,51,3],[52,1,52,7],[55,1,55,3],[55,5,55,6],[56,1,56,6],[57,1,57,6],[58,1,58,6],[27,1,27,3],[27,4,27,7],[28,2,28,5],[27,0,36,0],[29,2,29,3],[30,1,30,7],[33,1,33,3],[33,5,33,6],[34,1,34,6],[35,1,35,6],[36,1,36,6],[0,10,0,11],[1,2,1,5],[1,10,1,11],[2,2,2,3],[3,1,3,7],[22,5,22,6],[23,1,23,6],[24,1,24,6],[25,1,25,6],[5,1,5,7],[9,1,9,7],[13,1,13,7],[17,1,17,7],[38,0,47,0],[38,1,38,3],[38,4,38,7],[39,2,39,5],[40,2,40,3],[41,1,41,7],[44,1,44,3],[44,5,44,6],[45,1,45,6],[46,1,46,6],[47,1,47,6],[60,0,69,0],[60,1,60,3],[60,4,60,7],[61,2,61,5],[62,2,62,3],[63,1,63,7],[66,1,66,3],[66,5,66,6],[67,1,67,6],[68,1,68,6],[69,1,69,6],[81,1,81,7],[82,0,91,0],[82,1,82,3],[82,4,82,7],[83,2,83,5],[84,2,84,3],[85,1,85,7],[88,1,88,3],[88,5,88,6],[89,1,89,6],[90,1,90,6],[91,1,91,6]]}
[1,"CODEVASF",null,null," COMPOSIÇÃO DE PREÇO UNITÁRIO",null,null,null,{"$f":"H24","v":0},{"$f":"H26","v":0},"BDI CALCULADO:",null,{"$f":"ORÇAMENTO!L5","v":24.67}]
[null,"OBRA:  "," EXECUÇÃO DE RECAPEAMENTO ASFÁLTICO EM CBUQ - ESTRADA MUNICIPAL DA COMUNIDADE OLHOS D'ÁGUA - MONTES CLAROS - MG",null,null,null,"DATA: ",{"$f":"ORÇAMENTO!C6","v":" JULHO / 2026 "},null,null,"BDI DIFERENCIADO:",null,{"$f":"'BDI FORN'!D31/100","v":0.15}]
[null,"SERVIÇO:  ","CPU.1",null,"Referência:","CODEVASF","UNIDADE: ",{"$f":"VLOOKUP(A1,ORÇAMENTO!A11:L27,5)","v":"MOBILIZAÇÃO E DESMOBILIZAÇÃO"}]
[]
[null,"TIPO ITEM","CODIGO ITEM","DESCRIÇÃO ITEM","UNIDADE ITEM","COEFICIENTE","PRECO UNITARIO","CUSTO TOTAL",null,"distancia =",90,"B.DESPACHO"]
[null,"EQUIPAMENTOS",{"$nulls":7},"Pá carregadeira ",null,null,10.1," ton"]
[null,null,"E9001","E9001","E9001",null,"E9001"]
[]
[]
[null,"MÃO DE OBRA"]
[]
[]
[]
[null,"MATERIAIS"]
[]
[]
[{"$nulls":7},{"$f":"ROUNDDOWN(F17*G17,2)","v":0},null,"Motoniveladora ",null,null,12.47," ton"]
[null,"ATIVIDADES AUXILIARES",{"$nulls":7},"Trator de pneus",null,null,2.8," ton"]
[{"$nulls":7},{"$f":"ROUNDDOWN(F19*G19,2)","v":0}]
[{"$nulls":7},0]
{"$rows_left_out":73}
{"sheet":"BDI SERV","index":3,"n_rows":60,"n_cols":5,"rows_kept":60,"cut":false,"hidden":false,"merged":[[38,1,38,4],[39,2,39,3],[36,0,36,5],[0,1,2,4],[25,1,25,3],[26,1,26,2],[26,3,26,4],[27,3,27,4],[35,0,35,5]]}
[null,"DETALHAMENTO DO BDI - SERVIÇOS"]
[]
[]
[null,"Item","Descrição dos Serviços","% - PV","% - CD"]
[]
[null,1,"ADMINISTRAÇÃO CENTRAL"," ",4.01]
[null,"1.1","ESCRITÓRIO CENTRAL",null,4.01]
[null,"1.2","VIAGENS"]
[null,"1.3","OUTROS"]
[null," "," "," "," "]
[null,2,"IMPOSTOS E TAXAS",8.65,0]
[null,"2.1","ISS - Proposta",5]
[null,"2.2","PIS",0.65]
[null,"2.3","Cofins",3]
[null,"2.4","Contribuição Previdenciaria (CPRB)"]
[]
[null,3,"TAXA DE RISCO",null,0.96]
[null,"3.1","SEGURO",null,0.2]
[null,"3.2","RISCO",null,0.56000000000000005]
[null,"3.3","GARANTIA",null,0.2]
{"$rows_left_out":41}
{"sheet":"BDI FORN","index":4,"n_rows":37,"n_cols":5,"rows_kept":37,"cut":false,"hidden":false,"merged":[[31,1,31,2],[32,0,34,5],[36,0,36,5],[0,1,2,4],[3,1,4,1],[3,2,4,2],[28,0,28,5],[30,1,30,2]]}
[null,"DETALHAMENTO DO BDI - FORNECIMENTO \n(MATERIAL ASFÁLTICO)"]
[]
[]
[null,"Item","Descrição dos Serviços","%","%"]
[null,null,null,"PV","CD"]
[]
[null,1,"ADMINISTRAÇÃO CENTRAL"," ",3.45]
[null,"1.1","ESCRITÓRIO CENTRAL"," "," "]
[null,"1.2","VIAGENS"," "," "]
[null,"1.3","OUTROS"," "," "]
[null," "," "," "," "]
[null,2,"IMPOSTOS E TAXAS",3.65,4.5600000000000005]
[null,"2.1","ISS (*)",null,0]
[null,"2.2","PIS",0.65,0.81]
[null,"2.3","Cofins",3,3.75]
[null,"2.4","CONTRIBUIÇÃO PREVIDENCIÁRIA SOBRE A RENDA BRUTA",0,0]
[]
[null,3,"TAXA DE RISCO"," ",1.08]
[null,"3.1","SEGURO",null,0.24]
[null,"3.2","RISCO",null,0.6]
{"$rows_left_out":18}
{"sheet":"CRONOGRAMA","index":5,"n_rows":19,"n_cols":11,"rows_kept":19,"cut":false,"hidden":false,"merged":[[9,0,10,0],[9,1,10,1],[9,2,10,2],[15,1,16,2],[18,1,22,10],[11,0,12,0],[11,1,12,1],[11,2,12,2],[13,0,14,0],[13,1,14,1],[13,2,14,2],[3,1,3,9],[5,0,6,0],[5,1,6,1],[5,2,6,2],[7,0,8,0],[7,1,8,1],[7,2,8,2],[0,1,0,10],[1,1,2,1],[1,2,2,4],[1,6,1,10],[2,6,2,10]]}
[null,"CRONOGRAMA FÍSICO-FINANCEIRO"]
[null,"OBRA: "," EXECUÇÃO DE RECAPEAMENTO ASFÁLTICO EM CBUQ - ESTRADA MUNICIPAL DA COMUNIDADE OLHOS D'ÁGUA - MONTES CLAROS - MG",null,null,"VALOR:",1300000]
[{"$nulls":5},"PRAZO: ","150 DIAS "]
[]
[null,"ITEM","ETAPAS/DESCRIÇAO","FISICO/  FINANCEIRO","TOTAL    ETAPAS","MÊS 1","MÊS 2","MÊS 3","MÊS 4","MÊS 5","TOTAL"]
["A",1,"SERVIÇOS PRELIMINARES ","FISICO ",8.7400000000000005E-2,0.25,0.2,0.2,0.2,0.15,1]
[null,null,null,"FINANCEIRO",113660.3,28415.08,22732.06,22732.06,22732.06,17049.05,113660.31]
["B",2,"TERRAPLANAGEM E PAVIMENTAÇÃO","FISICO ",0.26540000000000002,0.25,0.2,0.2,0.2,0.15,1]
[null,null,null,"FINANCEIRO",345005.5,86251.38,69001.100000000006,69001.100000000006,69001.100000000006,51750.83,345005.51000000007]
["C",3,"TRANSPORTE DE MATERIAIS","FISICO ",7.2700000000000001E-2,0.2,0.2,0.2,0.2,0.2,1]
[null,null,null,"FINANCEIRO",94564,18912.8,18912.8,18912.8,18912.8,18912.8,94563.96]
["E",4,"DRENAGEM E OBRAS COMPLEMENTARES","FISICO ",0.32590000000000002,0.15,0.15,0.2,0.3,0.2,1]
[null,null,null,"FINANCEIRO",423648.98,63547.35,63547.35,84729.8,127094.69,84729.8,423648.97]
["F",5,"FORNECIMENTOS - MATERIAL ASFÁLTICO (BDI DIFERENCIADO)","FISICO ",0.24859999999999999,0.1,0.2,0.3,0.2,0.2,1]
[null,null,null,"FINANCEIRO",323121.22000000003,32312.12,64624.24,96936.37,64624.24,64624.24,323121.18999999994]
[null,"TOTAL",null,"FISICO ",1.0000000153846154,0.17649133076923076,0.18370580769230771,0.22485548461538463,0.23258837692307693,0.18235901538461541,1.0000000153846154]
[null,null,null,"FINANCEIRO",1300000,229438.73,238817.55000000002,292312.13,302364.89,237066.72000000003,1300000]
[]
[null,"OBSERVAÇÕES:"]