{"text_format":"2","workbook":"xlsx","n_sheets":5,"sheets":["ORÇAMENTO","CPU-SERV","AUX-VEIC.","BDI SERV","CRONOGRAMA"],"not_rendered":{"charts":0,"images":1,"macros":0,"external_links":0,"defined_names":5,"comments":2,"pivot_tables":0},"unopened":[],"bounds":{"document_bytes":16777216,"sheet_cells":100000,"run_cost":"one","rows_first":2000,"rows_last":500,"rows_between":2000,"halvings":0,"cell_chars":16384,"cell_head_chars":4096},"cells_cut":0,"cells_raw":0,"read":"whole","date_system":"1900"}

{"sheet":"ORÇAMENTO","index":0,"n_rows":32,"n_cols":12,"rows_kept":32,"cut":false,"hidden":false,"merged":[[8,13,9,13],[31,1,31,4],[0,0,8,0],[0,4,0,11],[1,4,1,11],[2,4,2,11],[7,1,7,11],[4,2,4,7],[5,2,5,7],[4,8,4,10],[5,8,5,10],[6,8,6,10],[6,1,6,4]]}
["<---- NUMERAR SERVIÇOS PARA CPU",null,null,null,"Ministério do Desenvolvimento Regional"]
[{"$nulls":4},"Companhia de Desenvolvimento dos Vales do São Francisco e do Parnaíba"]
[{"$nulls":4},"1ª Superintendência Regional"]
[]
[null,"OBRA: "," PAVIMENTAÇÃO EM BLOQUETE SEXTAVADOS - RUA DA COMUNIDADE OLIVEIRA NO MUNICÍPIO DE LADAINHA / MG",{"$nulls":5},"BDI Serviços (%):",null,null,{"$f":"'BDI SERV'!E26","v":21.55}]
[null,"DATA:"," MARÇO/2026",{"$nulls":5},"BDI Diferenciado Serviços (%):",null,null,15]
[null,"PRAZO DE EXECUÇÃO:    180 DIAS",{"$nulls":6},"BDI Fornecimentos (%):",null,null,15]
[null,"PLANILHA DE ORÇAMENTAÇÃO"]
[null,"ITEM","CÓDIGO","FONTE","DISCRIMINAÇÃO","TIPO","UNID.","QUANT.","VR.UNIT.S/BDI","PR. UNIT.C/BDI","C. TOT.S/BDI","P. TOT.C/BDI"]
["A",1,null,null,"SERVIÇOS PRELIMINARES ",{"$nulls":5},{"$f":"SUM(K11:K16)","v":151816.37000000002},{"$f":"SUM(L11:L16)","v":184499.74}]
[1,"1.1","CPU.1","CODEVASF","MOBILIZAÇÃO E DESMOBILIZAÇÃO","SERV","GL",1,{"$f":"VLOOKUP(A11,'CPU-SERV'!A:K,11,0)","v":11277.06},{"$f":"TRUNC(_xlfn.IFS(F11=\"SERV\",I11*(1+$L$5/100),F11=\"SERV DIF\",I11*(1+$L$6/100),F11=\"FORN\",I11*(1+$L$7/100)),2)","v":13707.26},{"$f":"TRUNC(H11*I11,2)","v":11277.06},{"$f":"TRUNC(H11*J11,2)","v":13707.26}]
[2,"1.2","CPU.2","CODEVASF","ADMINISTRAÇÃO LOCAL","SERV","GL",1,{"$f":"VLOOKUP(A12,'CPU-SERV'!A:K,11,0)","v":83819.3},{"$f":"TRUNC(_xlfn.IFS(F12=\"SERV\",I12*(1+$L$5/100),F12=\"SERV DIF\",I12*(1+$L$6/100),F12=\"FORN\",I12*(1+$L$7/100)),2)","v":101882.35},{"$f":"TRUNC(H12*I12,2)","v":83819.3},{"$f":"TRUNC(H12*J12,2)","v":101882.35}]
[3,"1.3","CPU.3","CODEVASF","CANTEIRO DE OBRAS","SERV","GL",1,{"$f":"VLOOKUP(A13,'CPU-SERV'!A:K,11,0)","v":16481.150000000001},{"$f":"TRUNC(_xlfn.IFS(F13=\"SERV\",I13*(1+$L$5/100),F13=\"SERV DIF\",I13*(1+$L$6/100),F13=\"FORN\",I13*(1+$L$7/100)),2)","v":20032.830000000002},16481.150000000001,20032.830000000002]
[4,"1.4",103689,"SINAPI","PLACA DE OBRA EM CHAPA DE AÇO GALVANIZADO","SERV","M2",2,{"$f":"VLOOKUP(A14,'CPU-SERV'!A:K,11,0)","v":428.87},{"$f":"TRUNC(_xlfn.IFS(F14=\"SERV\",I14*(1+$L$5/100),F14=\"SERV DIF\",I14*(1+$L$6/100),F14=\"FORN\",I14*(1+$L$7/100)),2)","v":521.29},857.74,1042.58]
[5,"1.5","CPU.4","CODEVASF","VEÍCULO PARA A FISCALIZAÇÃO, MÁXIMO 02 ANOS DE USO OU 50.000KM, PREFERENCIALMENTE NA COR BRANCA, COM IDENTIFICAÇÃO CONFORME ESPECIFICAÇÕES DA CODEVASF, INCLUSIVE COMBUSTÍVEL, MANUTENÇÃO, SEGURO E IMPOSTOS - CONFORME ESPECIFICAÇÕES","SERV","MÊS",8,{"$f":"VLOOKUP(A15,'CPU-SERV'!A:K,11,0)","v":4346.6400000000003},{"$f":"TRUNC(_xlfn.IFS(F15=\"SERV\",I15*(1+$L$5/100),F15=\"SERV DIF\",I15*(1+$L$6/100),F15=\"FORN\",I15*(1+$L$7/100)),2)","v":5283.34},{"$f":"TRUNC(H15*I15,2)","v":34773.120000000003},{"$f":"TRUNC(H15*J15,2)","v":42266.720000000001}]
[6,"1.6",78472,"SINAPI","SERVIÇOS TOPOGRÁFICOS PARA PAVIMENTAÇÃO, INCLUSIVE LEVANTAMENTO PLANIALTIMÉTRICO CADASTRAL, GERAÇÃO DE NOTAS DE SERVIÇO, SEÇÕES TRANSVERSAIS E GREIDE, ESTAQUEAMENTO E ACOMPANHAMENTO EXECUTIVO","SERV","M2",9600,{"$f":"VLOOKUP(A16,'CPU-SERV'!A:K,11,0)","v":0.48},{"$f":"TRUNC(_xlfn.IFS(F16=\"SERV\",I16*(1+$L$5/100),F16=\"SERV DIF\",I16*(1+$L$6/100),F16=\"FORN\",I16*(1+$L$7/100)),2)","v":0.57999999999999996},4608,5568]
["B",2,null,null,"TERRAPLANAGEM E PAVIMENTAÇÃO",{"$nulls":5},{"$f":"SUM(K18:K21)","v":664296.1},{"$f":"SUM(L18:L21)","v":807368.9}]
[7,"2.1",5502114,"SICRO","ESCAVAÇÃO, CARGA E TRANSPORTE DE MATERIAL DE 1ª CATEGORIA - DMT 1.000 A 1.200M, CAMINHO DE SERVIÇO EM REVESTIMENTO PRIMÁRIO","SERV","M3",2850,{"$f":"VLOOKUP(A18,'CPU-SERV'!A:K,11,0)","v":8.65},{"$f":"TRUNC(_xlfn.IFS(F18=\"SERV\",I18*(1+$L$5/100),F18=\"SERV DIF\",I18*(1+$L$6/100),F18=\"FORN\",I18*(1+$L$7/100)),2)","v":10.51},{"$f":"TRUNC(H18*I18,2)","v":24652.5},{"$f":"TRUNC(H18*J18,2)","v":29953.5}]
[8,"2.2",4011209,"SICRO","REGULARIZAÇÃO DO SUBLEITO - 100% PROCTOR INTERMEDIÁRIO","SERV","M2",9600,{"$f":"VLOOKUP(A19,'CPU-SERV'!A:K,11,0)","v":1.88},{"$f":"TRUNC(_xlfn.IFS(F19=\"SERV\",I19*(1+$L$5/100),F19=\"SERV DIF\",I19*(1+$L$6/100),F19=\"FORN\",I19*(1+$L$7/100)),2)","v":2.2799999999999998},18048,21888]
[9,"2.3",4011219,"SICRO","BASE DE SOLO ESTABILIZADA GRANULOMETRICAMENTE SEM MISTURA COM MATERIAL DE JAZIDA - 100% PROCTOR MODIFICADO","SERV","M3",1450,{"$f":"VLOOKUP(A20,'CPU-SERV'!A:K,11,0)","v":17.2},{"$f":"TRUNC(_xlfn.IFS(F20=\"SERV\",I20*(1+$L$5/100),F20=\"SERV DIF\",I20*(1+$L$6/100),F20=\"FORN\",I20*(1+$L$7/100)),2)","v":20.9},{"$f":"TRUNC(H20*I20,2)","v":24940},{"$f":"TRUNC(H20*J20,2)","v":30305}]
[10,"2.4",92394,"SINAPI","EXECUÇÃO DE PAVIMENTO EM PISO INTERTRAVADO, COM BLOCO SEXTAVADO DE CONCRETO DE 25 X 25 CM, ESPESSURA 8 CM","SERV","M2",8520,{"$f":"VLOOKUP(A21,'CPU-SERV'!A:K,11,0)","v":70.03},{"$f":"TRUNC(_xlfn.IFS(F21=\"SERV\",I21*(1+$L$5/100),F21=\"SERV DIF\",I21*(1+$L$6/100),F21=\"FORN\",I21*(1+$L$7/100)),2)","v":85.12},596655.6,725222.40000000002]
["C",3,null,null,"TRANSPORTE DE MATERIAIS",{"$nulls":5},{"$f":"SUM(K23:K26)","v":175265},{"$f":"SUM(L23:L26)","v":211410}]
[15,"3.1",5915321,"SICRO","TRANSPORTE COM CAMINHÃO BASCULANTE, EM VIA URBANA PAVIMENTADA","SERV","TXKM",102000,{"$f":"VLOOKUP(A23,'CPU-SERV'!A:K,11,0)","v":0.68},{"$f":"TRUNC(_xlfn.IFS(F23=\"SERV\",I23*(1+$L$5/100),F23=\"SERV DIF\",I23*(1+$L$6/100),F23=\"FORN\",I23*(1+$L$7/100)),2)","v":0.82},{"$f":"TRUNC(H23*I23,2)","v":69360},{"$f":"TRUNC(H23*J23,2)","v":83640}]
[16,"3.2",5915320,"SICRO","TRANSPORTE COM CAMINHÃO BASCULANTE, EM VIA COM REVESTIMENTO PRIMÁRIO","SERV","TXKM",24000,{"$f":"VLOOKUP(A24,'CPU-SERV'!A:K,11,0)","v":0.75},{"$f":"TRUNC(_xlfn.IFS(F24=\"SERV\",I24*(1+$L$5/100),F24=\"SERV DIF\",I24*(1+$L$6/100),F24=\"FORN\",I24*(1+$L$7/100)),2)","v":0.91},18000,21840]
[17,"3.3",5914434,"SICRO","TRANSPORTE COM CAMINHÃO CARROCERIA, EM VIA URBANA PAVIMENTADA","SERV","TXKM",98000,{"$f":"VLOOKUP(A25,'CPU-SERV'!A:K,11,0)","v":0.83},{"$f":"TRUNC(_xlfn.IFS(F25=\"SERV\",I25*(1+$L$5/100),F25=\"SERV DIF\",I25*(1+$L$6/100),F25=\"FORN\",I25*(1+$L$7/100)),2)","v":1},81340,98000]
[18,"3.4",5914419,"SICRO","TRANSPORTE COM CAMINHÃO CARROCERIA, EM VIA COM REVESTIMENTO PRIMÁRIO","SERV","TXKM",6500,{"$f":"VLOOKUP(A26,'CPU-SERV'!A:K,11,0)","v":1.01},{"$f":"TRUNC(_xlfn.IFS(F26=\"SERV\",I26*(1+$L$5/100),F26=\"SERV DIF\",I26*(1+$L$6/100),F26=\"FORN\",I26*(1+$L$7/100)),2)","v":1.22},6565,7930]
["D",4,null,null,"DRENAGEM E OBRAS COMPLEMENTARES",{"$nulls":5},{"$f":"SUM(K28:K31)","v":110015.36000000002},{"$f":"SUM(L28:L31)","v":133721.34999999998}]
[20,"4.1",94267,"SINAPI","GUIA (MEIO-FIO) E SARJETA CONJUGADOS DE CONCRETO, MOLDADA  IN LOCO COM EXTRUSORA, 45 CM BASE (15 CM BASE DA GUIA + 30 CM SARJETA) X 22 CM ALTURA","SERV","M",2400,{"$f":"VLOOKUP(A28,'CPU-SERV'!A:K,11,0)","v":43.76},{"$f":"TRUNC(_xlfn.IFS(F28=\"SERV\",I28*(1+$L$5/100),F28=\"SERV DIF\",I28*(1+$L$6/100),F28=\"FORN\",I28*(1+$L$7/100)),2)","v":53.19},{"$f":"TRUNC(H28*I28,2)","v":105024},{"$f":"TRUNC(H28*J28,2)","v":127656}]
[22,"4.2",94263,"SINAPI","GUIA (MEIO-FIO) CONCRETO, MOLDADA IN LOCO EM TRECHO RETO (PARA TRAVAMENTO), 13 CM BASE X 22 CM ALTURA","SERV","M",180,{"$f":"VLOOKUP(A29,'CPU-SERV'!A:K,11,0)","v":20.97},{"$f":"TRUNC(_xlfn.IFS(F29=\"SERV\",I29*(1+$L$5/100),F29=\"SERV DIF\",I29*(1+$L$6/100),F29=\"FORN\",I29*(1+$L$7/100)),2)","v":25.48},3774.6,4586.3999999999996]
[46,"4.2","5213440+\n5213863a","SICRO","FORNECIMENTO E INSTALAÇÃO DE PLACA DE SINALIZAÇÃO VIÁRIA - REGULAMENTAÇÃO 0,60MX0,60M, SUPORTE INCLUSO","SERV","UNID.",2,{"$f":"VLOOKUP(A30,'CPU-SERV'!A:K,11,0)","v":543.23},{"$f":"TRUNC(_xlfn.IFS(F30=\"SERV\",I30*(1+$L$5/100),F30=\"SERV DIF\",I30*(1+$L$6/100),F30=\"FORN\",I30*(1+$L$7/100)),2)","v":660.29},1086.46,1320.58]
[47,"4.3","CPU.5","CODEVASF","FORNECIMENTO E INSTALAÇÃO DE PLACA DE IDENTIFICAÇÃO DE LOGRADOURO, SUPORTE EXISTENTE - CONFORME PROJETO","SERV","UNID.",1,{"$f":"VLOOKUP(A31,'CPU-SERV'!A:K,11,0)","v":130.30000000000001},{"$f":"TRUNC(_xlfn.IFS(F31=\"SERV\",I31*(1+$L$5/100),F31=\"SERV DIF\",I31*(1+$L$6/100),F31=\"FORN\",I31*(1+$L$7/100)),2)","v":158.37},130.30000000000001,158.37]
[null,"TOTAL GERAL DA OBRA COM BDI ",{"$nulls":8},{"$f":"SUM(K10,K17,K22,K27)","v":1101392.83},{"$f":"SUM(L10,L17,L22,L27)+0.01","v":1337000.0000000002}]

{"sheet":"CPU-SERV","index":1,"n_rows":730,"n_cols":12,"rows_kept":730,"cut":false,"hidden":false,"merged":[[622,7,622,9],[626,3,626,7],[627,3,627,7],[291,11,291,12],[694,10,694,11],[574,10,574,11],[613,11,613,12],[614,10,614,11],[653,11,653,12],[654,10,654,11],[693,11,693,12],[457,10,457,11],[495,11,495,12],[496,10,496,11],[534,11,534,12],[535,10,535,11],[573,11,573,12],[657,4,657,5],[657,6,657,7],[662,7,662,9],[665,3,665,7],[666,3,666,7],[628,3,628,7],[631,7,631,9],[634,3,634,7],[635,7,635,9],[638,3,638,7],[640,8,640,9],[632,7,632,8],[728,5,728,7],[722,3,722,7],[697,3,698,3],[697,4,697,5],[697,6,697,7],[702,7,702,9],[705,3,705,7],[706,3,706,7],[688,3,688,7],[689,5,689,7],[719,8,719,9],[41,10,41,11],[84,11,84,12],[85,10,85,11],[123,11,123,12],[124,10,124,11],[211,11,211,12],[40,11,40,12],[727,3,727,7],[667,3,667,7],[670,7,670,9],[673,3,673,7],[674,7,674,9],[678,3,678,7],[680,8,680,9],[292,10,292,11],[374,11,374,12],[378,10,378,11],[417,11,417,12],[418,10,418,11],[456,11,456,12],[212,10,212,11],[252,11,252,12],[253,10,253,11],[657,3,658,3],[692,0,729,0],[693,2,693,9],[694,1,695,3],[694,4,694,5],[695,4,695,5],[696,2,696,7],[696,8,696,9],[697,1,698,2],[683,3,683,7],[684,1,685,2],[684,3,685,3],[684,4,685,4],[684,5,684,7],[684,9,685,9],[723,1,724,2],[723,3,724,3],[723,4,724,4],[723,5,723,7],[723,9,724,9],[707,3,707,7],[710,7,710,9],[713,3,713,7],[714,7,714,9],[717,3,717,7],[652,0,690,0],[653,2,653,9],[654,1,655,3],[654,4,654,5],[655,4,655,5],[656,2,656,7],[656,8,656,9],[657,1,658,2],[612,0,650,0],[613,2,613,9],[614,1,615,3],[614,4,614,5],[615,4,615,5],[616,2,616,7],[616,8,616,9],[617,1,618,2],[648,3,648,7],[649,5,649,7],[643,3,643,7],[644,1,645,2],[644,3,645,3],[644,4,645,4],[644,5,644,7],[644,9,645,9],[617,3,618,3],[617,4,617,5],[560,8,560,9],[577,3,578,3],[577,4,577,5],[577,6,577,7],[582,7,582,9],[586,3,586,7],[587,3,587,7],[608,3,608,7],[609,5,609,7],[592,7,592,8],[593,7,593,8],[595,7,595,9],[598,3,598,7],[600,8,600,9],[617,6,617,7],[572,0,610,0],[573,2,573,9],[574,1,575,3],[574,4,574,5],[575,4,575,5],[576,2,576,7],[576,8,576,9],[577,1,578,2],[603,3,603,7],[604,1,605,2],[604,3,605,3],[604,4,605,4],[604,5,604,7],[604,9,605,9],[588,3,588,7],[591,7,591,9],[594,3,594,7],[547,3,547,7],[529,3,529,7],[530,5,530,7],[533,0,570,0],[534,2,534,9],[535,1,536,3],[535,4,535,5],[536,4,536,5],[537,2,537,7],[537,8,537,9],[538,1,539,2],[568,3,568,7],[569,5,569,7],[563,3,563,7],[564,1,565,2],[564,3,565,3],[564,4,565,4],[564,5,564,7],[564,9,565,9],[548,3,548,7],[551,7,551,9],[554,3,554,7],[555,7,555,9],[558,3,558,7],[515,3,515,7],[516,7,516,9],[519,3,519,7],[521,8,521,9],[538,3,539,3],[538,4,538,5],[538,6,538,7],[543,7,543,9],[546,3,546,7],[499,3,500,3],[499,4,499,5],[499,6,499,7],[504,7,504,9],[507,3,507,7],[508,3,508,7],[490,3,490,7],[491,5,491,7],[494,0,531,0],[495,2,495,9],[496,1,497,3],[496,4,496,5],[497,4,497,5],[498,2,498,7],[498,8,498,9],[499,1,500,2],[524,3,524,7],[525,1,526,2],[525,3,526,3],[525,4,526,4],[525,5,525,7],[525,9,526,9],[509,3,509,7],[512,7,512,9],[455,0,492,0],[456,2,456,9],[457,1,458,3],[457,4,457,5],[458,4,458,5],[459,2,459,7],[459,8,459,9],[460,1,461,2],[485,3,485,7],[486,1,487,2],[486,3,487,3],[486,4,487,4],[486,5,486,7],[486,9,487,9],[470,3,470,7],[473,7,473,9],[476,3,476,7],[477,7,477,9],[480,3,480,7],[482,8,482,9],[441,3,441,7],[443,8,443,9],[460,3,461,3],[460,4,460,5],[460,6,460,7],[465,7,465,9],[468,3,468,7],[469,3,469,7],[451,3,451,7],[452,5,452,7],[421,3,422,3],[421,4,421,5],[421,6,421,7],[426,7,426,9],[429,3,429,7],[430,3,430,7],[416,0,453,0],[417,2,417,9],[418,1,419,3],[418,4,418,5],[419,4,419,5],[420,2,420,7],[420,8,420,9],[421,1,422,2],[446,3,446,7],[447,1,448,2],[447,3,448,3],[447,4,448,4],[447,5,447,7],[447,9,448,9],[431,3,431,7],[434,7,434,9],[437,3,437,7],[438,7,438,9],[412,3,412,7],[413,5,413,7],[407,3,407,7],[408,1,409,2],[408,3,409,3],[408,4,409,4],[408,5,408,7],[408,9,409,9],[391,3,391,7],[394,7,394,9],[398,3,398,7],[399,7,399,9],[402,3,402,7],[404,8,404,9],[395,7,395,8],[396,7,396,8],[381,6,381,7],[386,7,386,9],[389,3,389,7],[390,3,390,7],[329,3,329,7],[330,5,330,7],[378,1,379,3],[378,4,378,5],[379,4,379,5],[380,2,380,7],[380,8,380,9],[381,1,382,2],[334,2,334,9],[335,1,336,3],[335,4,335,5],[336,4,336,5],[337,2,337,7],[337,8,337,9],[338,1,339,2],[338,3,339,3],[373,5,373,7],[381,4,381,5],[359,7,359,9],[381,3,382,3],[290,0,331,0],[291,2,291,9],[292,1,293,3],[292,4,292,5],[293,4,293,5],[294,2,294,7],[294,8,294,9],[295,1,296,2],[324,3,324,7],[325,1,326,2],[325,3,326,3],[325,4,326,4],[325,5,325,7],[325,9,326,9],[309,3,309,7],[312,7,312,9],[315,3,315,7],[316,7,316,9],[319,3,319,7],[321,8,321,9],[273,7,273,9],[276,3,276,7],[278,8,278,9],[295,3,296,3],[295,4,295,5],[295,6,295,7],[304,7,304,9],[307,3,307,7],[308,3,308,7],[286,3,286,7],[287,5,287,7],[239,8,239,9],[256,3,257,3],[256,4,256,5],[256,6,256,7],[261,7,261,9],[264,3,264,7],[265,3,265,7],[251,0,288,0],[252,2,252,9],[253,1,254,3],[253,4,253,5],[254,4,254,5],[255,2,255,7],[255,8,255,9],[256,1,257,2],[281,3,281,7],[282,1,283,2],[282,3,283,3],[282,4,283,4],[282,5,282,7],[282,9,283,9],[266,3,266,7],[269,7,269,9],[272,3,272,7],[226,3,226,7],[159,3,159,7],[160,5,160,7],[210,0,249,0],[211,2,211,9],[212,1,213,3],[212,4,212,5],[213,4,213,5],[214,2,214,7],[214,8,214,9],[215,1,216,2],[247,3,247,7],[248,5,248,7],[242,3,242,7],[243,1,244,2],[243,3,244,3],[243,4,244,4],[243,5,243,7],[243,9,244,9],[227,3,227,7],[230,7,230,9],[233,3,233,7],[234,7,234,9],[237,3,237,7],[145,3,145,7],[146,7,146,9],[149,3,149,7],[151,8,151,9],[215,3,216,3],[215,4,215,5],[215,6,215,7],[220,7,220,9],[225,3,225,7],[202,3,203,3],[202,4,203,4],[202,5,202,7],[202,9,203,9],[206,3,206,7],[207,5,207,7],[127,3,128,3],[127,4,127,5],[127,6,127,7],[132,7,132,9],[135,3,135,7],[136,3,136,7],[118,3,118,7],[119,5,119,7],[122,0,161,0],[123,2,123,9],[124,1,125,3],[124,4,124,5],[125,4,125,5],[126,2,126,7],[126,8,126,9],[127,1,128,2],[154,3,154,7],[155,1,156,2],[155,3,156,3],[155,4,156,4],[155,5,155,7],[155,9,156,9],[137,3,137,7],[140,7,140,9],[83,0,120,0],[84,2,84,9],[85,1,86,3],[85,4,85,5],[86,4,86,5],[87,2,87,7],[87,8,87,9],[88,1,89,2],[113,3,113,7],[114,1,115,2],[114,3,115,3],[114,4,115,4],[114,5,114,7],[114,9,115,9],[98,3,98,7],[101,7,101,9],[104,3,104,7],[105,7,105,9],[108,3,108,7],[110,8,110,9],[69,3,69,7],[71,8,71,9],[88,3,89,3],[88,4,88,5],[88,6,88,7],[93,7,93,9],[96,3,96,7],[97,3,97,7],[79,3,79,7],[80,5,80,7],[49,7,49,9],[55,3,55,7],[56,3,56,7],[35,3,35,7],[36,5,36,7],[39,0,81,0],[40,2,40,9],[41,1,42,3],[41,4,41,5],[42,4,42,5],[43,2,43,7],[43,8,43,9],[44,1,45,2],[0,0,37,0],[74,3,74,7],[75,1,76,2],[75,3,76,3],[75,4,76,4],[75,5,75,7],[75,9,76,9],[57,3,57,7],[60,7,60,9],[63,3,63,7],[64,7,64,9],[27,8,27,9],[30,3,30,7],[31,1,32,2],[31,3,32,3],[31,4,32,4],[31,5,31,7],[31,9,32,9],[44,3,45,3],[44,4,44,5],[44,6,44,7],[0,11,0,12],[1,2,1,9],[1,11,1,12],[2,1,3,3],[2,4,2,5],[2,10,2,11],[3,4,3,5],[4,2,4,7],[4,8,4,9],[13,3,13,7],[14,3,14,7],[15,3,15,7],[15,11,15,13],[18,7,18,9],[21,3,21,7],[5,1,6,2],[5,3,6,3],[5,4,5,5],[5,6,5,7],[7,13,7,15],[10,7,10,9],[22,7,22,9],[25,3,25,7],[202,1,203,2],[333,0,374,0],[377,2,377,9],[376,0,415,0],[397,7,397,8],[362,3,362,7],[364,8,364,9],[367,3,367,7],[368,1,369,2],[368,3,369,3],[368,4,369,4],[368,5,368,7],[368,9,369,9],[372,3,372,7],[338,4,338,5],[338,6,338,7],[347,7,347,9],[350,3,350,7],[351,3,351,7],[352,3,352,7],[355,7,355,9],[358,3,358,7],[50,11,51,12],[163,0,208,0],[164,2,164,9],[164,11,164,12],[165,1,166,3],[165,4,165,5],[165,10,165,11],[166,4,166,5],[167,2,167,7],[167,8,167,9],[168,1,169,2],[168,3,169,3],[168,4,168,5],[168,6,168,7],[173,7,173,9],[176,3,176,7],[177,3,177,7],[178,3,178,7],[181,7,181,9],[184,3,184,7],[185,7,185,9],[196,3,196,7],[198,8,198,9],[201,3,201,7]]}
[1,"1ª/GRD",{"$nulls":8},{"$f":"J37","v":11277.06},"Minas Gerais"]
[null,"OBRA:"," PAVIMENTAÇÃO EM BLOQUETE SEXTAVADOS - RUA DA COMUNIDADE OLIVEIRA NO MUNICÍPIO DE LADAINHA / MG",{"$nulls":8}," MARÇO/2026"]
[null,"Custo Unitário de Referência",null,null,"Minas Gerais"]
[{"$nulls":4}," MARÇO/2026",null,null,"Produção da equipe ",0.5,{"$f":"VLOOKUP(A1,ORÇAMENTO!$A$10:$L$59,7,1)","v":"GL"}]
[null,"CPU.1","MOBILIZAÇÃO E DESMOBILIZAÇÃO",{"$nulls":5},"Valores em reais (R$)"]
[null,"A - EQUIPAMENTOS",null,"Quantidade","Utilização",null,"Custo Horário",null,null,"Custo"]
[{"$nulls":4},"Operativa","Improdutiva","Produtivo","Improdutivo",null,"Horário Total"]
[null,"E9687","Caminhão carroceria com capacidade de 5 t - 120 kW",8,0.6,0.4,172.44059999999999,68.639300000000006,null,{"$f":"D8*(E8*G8+F8*H8)","v":1047.3606399999999}]
[null,"E9575","Caminhão basculante com caçamba estanque com capacidade de 14 m³ - 210 kW",8,1,0,323.19150000000002,97.611199999999997,null,{"$f":"D9*(E9*G9+F9*H9)","v":2585.5320000000002}]
[{"$nulls":7},"Custo horário total de equipamentos",null,{"$f":"SUM(J8:J9)","v":3632.89264}]
[null,"B - MÃO DE OBRA",null,"Quantidade","Unidade",null,"Custo Horário","Custo Horário Total"]
[null,"P9824","Servente",8,"h",null,21.684899999999999,null,null,{"$f":"D12*G12","v":173.47919999999999}]
[null,"-","-",null,"-",null,0,null,null,{"$f":"D13*G13","v":0}]
[null,null,null,"Custo horário total de mão de obra",{"$nulls":5},{"$f":"SUM(J12:J13)","v":173.47919999999999}]
[null,null,null,"Custo horário total de execução",{"$nulls":5},{"$f":"J10+J14","v":3806.3718399999998}]
[null,null,null,"Custo unitário de execução",{"$nulls":5},{"$f":"J15/I4","v":7612.7436799999996}]
[{"$nulls":7},"Custo do FIC",null,0]
[{"$nulls":7},"Custo do FIT",null,0]
[null,"C - MATERIAL",null,"Quantidade","Unidade",null,"Preço Unitário","Custo Unitário"]
[null,"-","-",null,"-",null,0,null,null,{"$f":"D20*G20","v":0}]
[null,"-","-",null,"-",null,0,null,null,{"$f":"D21*G21","v":0}]
[null,null,null,"Custo unitário total de material",{"$nulls":5},{"$f":"SUM(J20:J21)","v":0}]
[null,"D - ATIVIDADES AUXILIARES",null,"Quantidade","Unidade",null,"Custo Unitário","Custo Unitário"]
[null,5914640,"Transporte com cavalo mecânico com semirreboque com capacidade de 32 t - rodovia pavimentada",6210.7080000000005,"tkm",null,0.59,null,null,{"$f":"D24*G24","v":3664.31772}]
[null,"-","-",0,"-",null,0,null,null,{"$f":"D25*G25","v":0}]
[null,null,null,"Custo total de atividades auxiliares",{"$nulls":5},{"$f":"SUM(J24:J25)","v":3664.31772}]
[{"$nulls":7},"Subtotal",null,{"$f":"J16+J22+J26+J17+J18","v":11277.061399999999}]
[null,"E - TEMPO FIXO",null,"Código","Quantidade","Unidade",null,"Custo Unitário","Custo Unitário"]
[null,"-","-","-",null,"-",null,0,null,{"$f":"ROUNDDOWN(E29*H29,4)","v":0}]
[null,"-","-","-",null,"-",null,0,null,{"$f":"ROUNDDOWN(E30*H30,4)","v":0}]
[null,null,null,"Custo unitário total de tempo fixo",{"$nulls":5},{"$f":"SUM(J29:J30)","v":0}]
[null,"F - MOMENTO DE TRANSPORTE",null,"Quantidade","Unidade","DMT",null,null,null,"Custo Unitário"]
[{"$nulls":5},"LN","RP","P"]
[null,"-","-",null,"tkm"]
[null,"-","-",null,"tkm"]
[null,null,null,"Custo unitário total de transporte"]
[{"$nulls":5},"Custo unitário direto total",null,null,null,{"$f":"TRUNC(J27+J31,2)","v":11277.06}]
[null,"Obs."]
[]
[2,"1ª/GRD",{"$nulls":8},{"$f":"J81","v":83819.3}]
{"$rows_left_out":691}
{"sheet":"AUX-VEIC.","index":2,"n_rows":31,"n_cols":5,"rows_kept":31,"cut":false,"hidden":false,"merged":[[25,2,25,3],[1,1,1,4],[2,1,2,2],[3,1,3,4],[17,1,17,4],[18,2,18,3],[19,2,19,3],[20,2,20,3],[21,2,21,3],[22,2,22,3],[23,2,23,3],[24,2,24,3],[26,2,26,3],[27,2,27,3],[28,2,28,3],[29,1,30,1],[29,2,29,3],[30,2,30,3]]}
[]
[null,"CÁLCULO DO CUSTO POR MÊS DE VEÍCULOS"]
[null,"Veículo: Polo TSI, Onix Turbo, Argo 1.3, HB-20 Turbo",null,"Data:","2026-01-20"]
[null,"DADOS ELEMENTARES DO VEÍCULO"]
[null,"Dados Básicos","Preço (R$)","Quantidade","Vida Útil"]
[null,"Quilometragem média mensal",null,3000]
[null,"Valor de Aquisição (VA)",108890]
[null,"Taxa de Juros (i)%",null,15]
[null,"IPVA e Seguro Obrigatório (4%)",4355.6000000000004]
[null,"Lavagem",50,2]
[null,"Pneus",499.9,4,50000]
[null,"Combustível",5.86,14]
[null,"Óleo Lubrificante + Filtros (revisão)",846.74400000000003,1,10000]
[null,"Seguro Total Anual",3378.94]
[null,"Jogo de Amortecedores",1246.5,null,50000]
[null,"Coeficiente de Manutenção",null,4.7999999999999998E-6]
[null,"Motorista",3038.2740182832176,1]
[null,"CÁLCULO DO CUSTO POR MÊS"]
[null,"DEPRECIAÇÃO","D = (VA-0,60xVA) / 12 x 5",null,725.93333333333328]
[null,"JUROS","J = (VA-0,60xVA) x i / 12",null,544.45000000000005]
[null,"LICENCIAMENTO","L = (IPVA=SEG.OBRIG.)/12",null,362.97]
[null,"SEGURO TOTAL","ST = SEGURO ANUAL/12",null,281.58]
[null,"COMBUSTÍVEL","OD = (Comb./Consu)x Km.mês",null,1255.71]
[null,"ÓLEO LUBRIFICANTE","OL = ((Ol. X Quant)/Vida Útil)xKm.mês)",null,254.02]
[null,"LAVAGEM","LL = Preço Lavagem x Quantidade",null,100]
[null,"PNEUS","P = ((P. PneusxQuant)/Vida Útil)xkm.mês)",null,119.98]
[null,"AMORTECEDORES","AM = (P. Amort/Vida Útil)xkm.mês",null,74.790000000000006]
[null,"MANUTENÇÃO","M = (VA-VPxK)xkm.mês",null,627.21]
[null,"MOTORISTA","MOT = SALÁRIO+LEIS SOCIAIS",null,5276.87]
[null,"CUSTO POR MÊS","SEM MOTORISTA",null,4346.6433333333334]
[null,null,"COM MOTORISTA",null,9623.5133333333324]

{"sheet":"BDI SERV","index":3,"n_rows":60,"n_cols":5,"rows_kept":60,"cut":false,"hidden":false,"merged":[[36,0,36,5],[38,1,38,4],[39,2,39,3],[35,0,35,5],[0,1,2,4],[25,1,25,3],[26,1,26,2],[26,3,26,4],[27,3,27,4]]}
[null,"DETALHAMENTO DO BDI - SERVIÇOS"]
[]
[]
[null,"Item","Descrição dos Serviços","% - PV","% - CD"]
[]
[null,1,"ADMINISTRAÇÃO CENTRAL"," ",{"$f":"SUM(E7:E9)","v":4.01}]
[null,"1.1","ESCRITÓRIO CENTRAL",null,4.01]
[null,"1.2","VIAGENS"]
[null,"1.3","OUTROS"]
[null," "," "," "," "]
[null,2,"IMPOSTOS E TAXAS",{"$f":"SUM(D12:D15)","v":5.7},{"$f":"SUM(E12:E15)","v":0}]
[null,"2.1","ISS - Proposta",{"$f":"D34*100","v":2.0500000000000003}]
[null,"2.2","PIS",0.65]
[null,"2.3","Cofins",3]
[null,"2.4","Contribuição Previdenciaria (CPRB)"]
[]
[null,3,"TAXA DE RISCO",null,{"$f":"SUM(E18:E20)","v":0.96}]
[null,"3.1","SEGURO",null,0.2]
[null,"3.2","RISCO",null,0.56000000000000005]
[null,"3.3","GARANTIA",null,0.2]
[]
[null,4,"DESPESAS FINANCEIRAS",null,1.1100000000000001]
[]
[null,5,"LUCRO",null,8]
[]
[null,"BDI APRESENTADO:",null,null,21.55]
[]
[null,null,"Legislação Municipal:","Lei Municipal N° 17"]
[null,null,"Município:","Ladainha - MG"]
[null,null,"Alíquota ISSQN:",0.05,"Município"]
[null,null,"Base de Cálculo:","Dedução - Material"]
[null,null,"Valor Serviço:",1101392.83]
[null,null,"Dedução - Material (estimado):",650000,{"$f":"D33/D32","v":0.5901618226441514}]
[null,null,"ISSQN BDI:",{"$f":"IF(D32=\"\",0,ROUND(IF(D31=D49,((1-(D33/D32))*D30),D30*D31),4))","v":2.0500000000000001E-2},"(*)"]
[]
["Acórdão nº 2.622/2013 - TCU Plenário"]
["BDI = ARRED((((((1+(AC+TR)/100)*(1+DF/100)*(1+L/100))/(1-IMP/100))-1)*100);2)"]
[]
[null,"(*) É obrigação da licitante a verificação da Legislação Tributária vigente no município, bem como o cálculo dos valores totais de serviços e materiais estimados, para apresentação de sua proposta."]
[]
{"$rows_left_out":21}
{"sheet":"CRONOGRAMA","index":4,"n_rows":17,"n_cols":12,"rows_kept":17,"cut":false,"hidden":false,"merged":[[7,0,8,0],[9,0,10,0],[11,0,12,0],[0,1,0,11],[1,6,1,11],[2,6,2,11],[3,1,3,6],[5,0,6,0],[5,2,6,2],[1,1,2,1],[5,1,6,1],[1,2,2,4],[13,1,14,2],[16,1,20,11],[7,2,8,2],[9,2,10,2],[11,2,12,2],[7,1,8,1],[9,1,10,1],[11,1,12,1]]}
[null,"CRONOGRAMA FÍSICO-FINANCEIRO"]
[null,"OBRA: "," PAVIMENTAÇÃO EM BLOQUETE SEXTAVADOS - RUA DA COMUNIDADE OLIVEIRA NO MUNICÍPIO DE LADAINHA / MG",null,null,"VALOR:",1337000.0000000002]
[{"$nulls":5},"PRAZO: ","180 DIAS "]
[]
[null,"ITEM","ETAPAS/DESCRIÇAO","FISICO/  FINANCEIRO","TOTAL    ETAPAS","MÊS 1","MÊS 2","MÊS 3","MÊS 4","MÊS 5","MÊS 6","TOTAL"]
["A",1,"SERVIÇOS PRELIMINARES ","FISICO ",0.13800000000000001,0.2,0.2,0.15,0.15,0.15,0.15,1]
[null,null,null,"FINANCEIRO",184499.74,36899.949999999997,36899.949999999997,27674.959999999999,27674.959999999999,27674.959999999999,27674.959999999999,184499.73999999996]
["B",2,"TERRAPLANAGEM E PAVIMENTAÇÃO","FISICO ",0.60389999999999999,0.2,0.2,0.15,0.15,0.15,0.15,1]
[null,null,null,"FINANCEIRO",807368.9,161473.78,161473.78,121105.34,121105.34,121105.34,121105.34,807368.91999999993]
["C",3,"TRANSPORTE DE MATERIAIS","FISICO ",0.15809999999999999,0.15,0.15,0.2,0.2,0.15,0.15,1]
[null,null,null,"FINANCEIRO",211410,31711.5,31711.5,42282,42282,31711.5,31711.5,211410]
["D",4,"DRENAGEM E OBRAS COMPLEMENTARES","FISICO ",0.1,0.1,0.15,0.2,0.2,0.2,0.15,1]
[null,null,null,"FINANCEIRO",133721.34999999998,13372.14,20058.2,26744.27,26744.27,26744.27,20058.2,133721.35]
[null,"TOTAL",null,"FISICO ",0.5320922777269429,0.18209227510914189,0.18709306796629066,0.16290693465151032,0.16290693465151032,0.1550008014584951,0.15000000112191472,1.000000014958863]
[null,null,null,"FINANCEIRO",1336999.9900000002,243457.37,250143.43,217806.56999999998,217806.56999999998,207236.06999999998,200550,1337000.01]
[]
[null,"OBSERVAÇÕES:"]