{"text_format":"2","workbook":"xlsx","n_sheets":5,"sheets":["ORÇAMENTO","CPU-SERV","AUX-VEIC.","BDI SERV","CRONOGRAMA"],"not_rendered":{"charts":0,"images":1,"macros":0,"external_links":0,"defined_names":5,"comments":2,"pivot_tables":0},"unopened":[],"bounds":{"document_bytes":16777216,"sheet_cells":100000,"run_cost":"one","rows_first":2000,"rows_last":500,"rows_between":2000,"halvings":0,"cell_chars":16384,"cell_head_chars":4096},"cells_cut":0,"cells_raw":0,"read":"whole","date_system":"1900"}

{"sheet":"ORÇAMENTO","index":0,"n_rows":32,"n_cols":12,"rows_kept":32,"cut":false,"hidden":false,"merged":[[8,13,9,13],[31,1,31,4],[0,0,8,0],[0,4,0,11],[1,4,1,11],[2,4,2,11],[7,1,7,11],[4,2,4,7],[5,2,5,7],[4,8,4,10],[5,8,5,10],[6,8,6,10],[6,1,6,4]]}
["<---- NUMERAR SERVIÇOS PARA CPU",null,null,null,"Ministério do Desenvolvimento Regional"]
[{"$nulls":4},"Companhia de Desenvolvimento dos Vales do São Francisco e do Parnaíba"]
[{"$nulls":4},"1ª Superintendência Regional"]
[]
[null,"OBRA: "," PAVIMENTAÇÃO EM BLOQUETE SEXTAVADOS - RUA DA COMUNIDADE OLIVEIRA NO MUNICÍPIO DE LADAINHA / MG",{"$nulls":5},"BDI Serviços (%):",null,null,{"$f":"'BDI SERV'!E26","v":21.55}]
[null,"DATA:"," MARÇO/2026",{"$nulls":5},"BDI Diferenciado Serviços (%):",null,null,15]
[null,"PRAZO DE EXECUÇÃO:    180 DIAS",{"$nulls":6},"BDI Fornecimentos (%):",null,null,15]
[null,"PLANILHA DE ORÇAMENTAÇÃO"]
[null,"ITEM","CÓDIGO","FONTE","DISCRIMINAÇÃO","TIPO","UNID.","QUANT.","VR.UNIT.S/BDI","PR. UNIT.C/BDI","C. TOT.S/BDI","P. TOT.C/BDI"]
["A",1,null,null,"SERVIÇOS PRELIMINARES ",{"$nulls":5},{"$f":"SUM(K11:K16)","v":151816.37000000002},{"$f":"SUM(L11:L16)","v":184499.74}]
[1,"1.1","CPU.1","CODEVASF","MOBILIZAÇÃO E DESMOBILIZAÇÃO","SERV","GL",1,{"$f":"VLOOKUP(A11,'CPU-SERV'!A:K,11,0)","v":11277.06},{"$f":"TRUNC(_xlfn.IFS(F11=\"SERV\",I11*(1+$L$5/100),F11=\"SERV DIF\",I11*(1+$L$6/100),F11=\"FORN\",I11*(1+$L$7/100)),2)","v":13707.26},{"$f":"TRUNC(H11*I11,2)","v":11277.06},{"$f":"TRUNC(H11*J11,2)","v":13707.26}]
[2,"1.2","CPU.2","CODEVASF","ADMINISTRAÇÃO LOCAL","SERV","GL",1,{"$f":"VLOOKUP(A12,'CPU-SERV'!A:K,11,0)","v":83819.3},{"$f":"TRUNC(_xlfn.IFS(F12=\"SERV\",I12*(1+$L$5/100),F12=\"SERV DIF\",I12*(1+$L$6/100),F12=\"FORN\",I12*(1+$L$7/100)),2)","v":101882.35},{"$f":"TRUNC(H12*I12,2)","v":83819.3},{"$f":"TRUNC(H12*J12,2)","v":101882.35}]
[3,"1.3","CPU.3","CODEVASF","CANTEIRO DE OBRAS","SERV","GL",1,{"$f":"VLOOKUP(A13,'CPU-SERV'!A:K,11,0)","v":16481.150000000001},{"$f":"TRUNC(_xlfn.IFS(F13=\"SERV\",I13*(1+$L$5/100),F13=\"SERV DIF\",I13*(1+$L$6/100),F13=\"FORN\",I13*(1+$L$7/100)),2)","v":20032.830000000002},16481.150000000001,20032.830000000002]
[4,"1.4",103689,"SINAPI","PLACA DE OBRA EM CHAPA DE AÇO GALVANIZADO","SERV","M2",2,{"$f":"VLOOKUP(A14,'CPU-SERV'!A:K,11,0)","v":428.87},{"$f":"TRUNC(_xlfn.IFS(F14=\"SERV\",I14*(1+$L$5/100),F14=\"SERV DIF\",I14*(1+$L$6/100),F14=\"FORN\",I14*(1+$L$7/100)),2)","v":521.29},857.74,1042.58]
[5,"1.5","CPU.4","CODEVASF","VEÍCULO PARA A FISCALIZAÇÃO, MÁXIMO 02 ANOS DE USO OU 50.000KM, PREFERENCIALMENTE NA COR BRANCA, COM IDENTIFICAÇÃO CONFORME ESPECIFICAÇÕES DA CODEVASF, INCLUSIVE COMBUSTÍVEL, MANUTENÇÃO, SEGURO E IMPOSTOS - CONFORME ESPECIFICAÇÕES","SERV","MÊS",8,{"$f":"VLOOKUP(A15,'CPU-SERV'!A:K,11,0)","v":4346.6400000000003},{"$f":"TRUNC(_xlfn.IFS(F15=\"SERV\",I15*(1+$L$5/100),F15=\"SERV DIF\",I15*(1+$L$6/100),F15=\"FORN\",I15*(1+$L$7/100)),2)","v":5283.34},{"$f":"TRUNC(H15*I15,2)","v":34773.120000000003},{"$f":"TRUNC(H15*J15,2)","v":42266.720000000001}]
[6,"1.6",78472,"SINAPI","SERVIÇOS TOPOGRÁFICOS PARA PAVIMENTAÇÃO, INCLUSIVE LEVANTAMENTO PLANIALTIMÉTRICO CADASTRAL, GERAÇÃO DE NOTAS DE SERVIÇO, SEÇÕES TRANSVERSAIS E GREIDE, ESTAQUEAMENTO E ACOMPANHAMENTO EXECUTIVO","SERV","M2",9600,{"$f":"VLOOKUP(A16,'CPU-SERV'!A:K,11,0)","v":0.48},{"$f":"TRUNC(_xlfn.IFS(F16=\"SERV\",I16*(1+$L$5/100),F16=\"SERV DIF\",I16*(1+$L$6/100),F16=\"FORN\",I16*(1+$L$7/100)),2)","v":0.57999999999999996},4608,5568]
["B",2,null,null,"TERRAPLANAGEM E PAVIMENTAÇÃO",{"$nulls":5},{"$f":"SUM(K18:K21)","v":664296.1},{"$f":"SUM(L18:L21)","v":807368.9}]
[7,"2.1",5502114,"SICRO","ESCAVAÇÃO, CARGA E TRANSPORTE DE MATERIAL DE 1ª CATEGORIA - DMT 1.000 A 1.200M, CAMINHO DE SERVIÇO EM REVESTIMENTO PRIMÁRIO","SERV","M3",2850,{"$f":"VLOOKUP(A18,'CPU-SERV'!A:K,11,0)","v":8.65},{"$f":"TRUNC(_xlfn.IFS(F18=\"SERV\",I18*(1+$L$5/100),F18=\"SERV DIF\",I18*(1+$L$6/100),F18=\"FORN\",I18*(1+$L$7/100)),2)","v":10.51},{"$f":"TRUNC(H18*I18,2)","v":24652.5},{"$f":"TRUNC(H18*J18,2)","v":29953.5}]
[8,"2.2",4011209,"SICRO","REGULARIZAÇÃO DO SUBLEITO - 100% PROCTOR INTERMEDIÁRIO","SERV","M2",9600,{"$f":"VLOOKUP(A19,'CPU-SERV'!A:K,11,0)","v":1.88},{"$f":"TRUNC(_xlfn.IFS(F19=\"SERV\",I19*(1+$L$5/100),F19=\"SERV DIF\",I19*(1+$L$6/100),F19=\"FORN\",I19*(1+$L$7/100)),2)","v":2.2799999999999998},18048,21888]
[9,"2.3",4011219,"SICRO","BASE DE SOLO ESTABILIZADA GRANULOMETRICAMENTE SEM MISTURA COM MATERIAL DE JAZIDA - 100% PROCTOR MODIFICADO","SERV","M3",1450,{"$f":"VLOOKUP(A20,'CPU-SERV'!A:K,11,0)","v":17.2},{"$f":"TRUNC(_xlfn.IFS(F20=\"SERV\",I20*(1+$L$5/100),F20=\"SERV DIF\",I20*(1+$L$6/100),F20=\"FORN\",I20*(1+$L$7/100)),2)","v":20.9},{"$f":"TRUNC(H20*I20,2)","v":24940},{"$f":"TRUNC(H20*J20,2)","v":30305}]
[10,"2.4",92394,"SINAPI","EXECUÇÃO DE PAVIMENTO EM PISO INTERTRAVADO, COM BLOCO SEXTAVADO DE CONCRETO DE 25 X 25 CM, ESPESSURA 8 CM","SERV","M2",8520,{"$f":"VLOOKUP(A21,'CPU-SERV'!A:K,11,0)","v":70.03},{"$f":"TRUNC(_xlfn.IFS(F21=\"SERV\",I21*(1+$L$5/100),F21=\"SERV DIF\",I21*(1+$L$6/100),F21=\"FORN\",I21*(1+$L$7/100)),2)","v":85.12},596655.6,725222.40000000002]
["C",3,null,null,"TRANSPORTE DE MATERIAIS",{"$nulls":5},{"$f":"SUM(K23:K26)","v":175265},{"$f":"SUM(L23:L26)","v":211410}]
[15,"3.1",5915321,"SICRO","TRANSPORTE COM CAMINHÃO BASCULANTE, EM VIA URBANA PAVIMENTADA","SERV","TXKM",102000,{"$f":"VLOOKUP(A23,'CPU-SERV'!A:K,11,0)","v":0.68},{"$f":"TRUNC(_xlfn.IFS(F23=\"SERV\",I23*(1+$L$5/100),F23=\"SERV DIF\",I23*(1+$L$6/100),F23=\"FORN\",I23*(1+$L$7/100)),2)","v":0.82},{"$f":"TRUNC(H23*I23,2)","v":69360},{"$f":"TRUNC(H23*J23,2)","v":83640}]
[16,"3.2",5915320,"SICRO","TRANSPORTE COM CAMINHÃO BASCULANTE, EM VIA COM REVESTIMENTO PRIMÁRIO","SERV","TXKM",24000,{"$f":"VLOOKUP(A24,'CPU-SERV'!A:K,11,0)","v":0.75},{"$f":"TRUNC(_xlfn.IFS(F24=\"SERV\",I24*(1+$L$5/100),F24=\"SERV DIF\",I24*(1+$L$6/100),F24=\"FORN\",I24*(1+$L$7/100)),2)","v":0.91},18000,21840]
[17,"3.3",5914434,"SICRO","TRANSPORTE COM CAMINHÃO CARROCERIA, EM VIA URBANA PAVIMENTADA","SERV","TXKM",98000,{"$f":"VLOOKUP(A25,'CPU-SERV'!A:K,11,0)","v":0.83},{"$f":"TRUNC(_xlfn.IFS(F25=\"SERV\",I25*(1+$L$5/100),F25=\"SERV DIF\",I25*(1+$L$6/100),F25=\"FORN\",I25*(1+$L$7/100)),2)","v":1},81340,98000]
[18,"3.4",5914419,"SICRO","TRANSPORTE COM CAMINHÃO CARROCERIA, EM VIA COM REVESTIMENTO PRIMÁRIO","SERV","TXKM",6500,{"$f":"VLOOKUP(A26,'CPU-SERV'!A:K,11,0)","v":1.01},{"$f":"TRUNC(_xlfn.IFS(F26=\"SERV\",I26*(1+$L$5/100),F26=\"SERV DIF\",I26*(1+$L$6/100),F26=\"FORN\",I26*(1+$L$7/100)),2)","v":1.22},6565,7930]
["D",4,null,null,"DRENAGEM E OBRAS COMPLEMENTARES",{"$nulls":5},{"$f":"SUM(K28:K31)","v":110015.36000000002},{"$f":"SUM(L28:L31)","v":133721.34999999998}]
[20,"4.1",94267,"SINAPI","GUIA (MEIO-FIO) E SARJETA CONJUGADOS DE CONCRETO, MOLDADA  IN LOCO COM EXTRUSORA, 45 CM BASE (15 CM BASE DA GUIA + 30 CM SARJETA) X 22 CM ALTURA","SERV","M",2400,{"$f":"VLOOKUP(A28,'CPU-SERV'!A:K,11,0)","v":43.76},{"$f":"TRUNC(_xlfn.IFS(F28=\"SERV\",I28*(1+$L$5/100),F28=\"SERV DIF\",I28*(1+$L$6/100),F28=\"FORN\",I28*(1+$L$7/100)),2)","v":53.19},{"$f":"TRUNC(H28*I28,2)","v":105024},{"$f":"TRUNC(H28*J28,2)","v":127656}]
[22,"4.2",94263,"SINAPI","GUIA (MEIO-FIO) CONCRETO, MOLDADA IN LOCO EM TRECHO RETO (PARA TRAVAMENTO), 13 CM BASE X 22 CM ALTURA","SERV","M",180,{"$f":"VLOOKUP(A29,'CPU-SERV'!A:K,11,0)","v":20.97},{"$f":"TRUNC(_xlfn.IFS(F29=\"SERV\",I29*(1+$L$5/100),F29=\"SERV DIF\",I29*(1+$L$6/100),F29=\"FORN\",I29*(1+$L$7/100)),2)","v":25.48},3774.6,4586.3999999999996]
[46,"4.2","5213440+\n5213863a","SICRO","FORNECIMENTO E INSTALAÇÃO DE PLACA DE SINALIZAÇÃO VIÁRIA - REGULAMENTAÇÃO 0,60MX0,60M, SUPORTE INCLUSO","SERV","UNID.",2,{"$f":"VLOOKUP(A30,'CPU-SERV'!A:K,11,0)","v":543.23},{"$f":"TRUNC(_xlfn.IFS(F30=\"SERV\",I30*(1+$L$5/100),F30=\"SERV DIF\",I30*(1+$L$6/100),F30=\"FORN\",I30*(1+$L$7/100)),2)","v":660.29},1086.46,1320.58]
[47,"4.3","CPU.5","CODEVASF","FORNECIMENTO E INSTALAÇÃO DE PLACA DE IDENTIFICAÇÃO DE LOGRADOURO, SUPORTE EXISTENTE - CONFORME PROJETO","SERV","UNID.",1,{"$f":"VLOOKUP(A31,'CPU-SERV'!A:K,11,0)","v":130.30000000000001},{"$f":"TRUNC(_xlfn.IFS(F31=\"SERV\",I31*(1+$L$5/100),F31=\"SERV DIF\",I31*(1+$L$6/100),F31=\"FORN\",I31*(1+$L$7/100)),2)","v":158.37},130.30000000000001,158.37]
[null,"TOTAL GERAL DA OBRA COM BDI ",{"$nulls":8},{"$f":"SUM(K10,K17,K22,K27)","v":1101392.83},{"$f":"SUM(L10,L17,L22,L27)+0.01","v":1337000.0000000002}]

{"sheet":"CPU-SERV","index":1,"n_rows":730,"n_cols":12,"rows_kept":730,"cut":false,"hidden":false,"merged":[[622,7,622,9],[626,3,626,7],[627,3,627,7],[291,11,291,12],[694,10,694,11],[574,10,574,11],[613,11,613,12],[614,10,614,11],[653,11,653,12],[654,10,654,11],[693,11,693,12],[457,10,457,11],[495,11,495,12],[496,10,496,11],[534,11,534,12],[535,10,535,11],[573,11,573,12],[657,4,657,5],[657,6,657,7],[662,7,662,9],[665,3,665,7],[666,3,666,7],[628,3,628,7],[631,7,631,9],[634,3,634,7],[635,7,635,9],[638,3,638,7],[640,8,640,9],[632,7,632,8],[728,5,728,7],[722,3,722,7],[697,3,698,3],[697,4,697,5],[697,6,697,7],[702,7,702,9],[705,3,705,7],[706,3,706,7],[688,3,688,7],[689,5,689,7],[719,8,719,9],[41,10,41,11],[84,11,84,12],[85,10,85,11],[123,11,123,12],[124,10,124,11],[211,11,211,12],[40,11,40,12],[727,3,727,7],[667,3,667,7],[670,7,670,9],[673,3,673,7],[674,7,674,9],[678,3,678,7],[680,8,680,9],[292,10,292,11],[374,11,374,12],[378,10,378,11],[417,11,417,12],[418,10,418,11],[456,11,456,12],[212,10,212,11],[252,11,252,12],[253,10,253,11],[657,3,658,3],[692,0,729,0],[693,2,693,9],[694,1,695,3],[694,4,694,5],[695,4,695,5],[696,2,696,7],[696,8,696,9],[697,1,698,2],[683,3,683,7],[684,1,685,2],[684,3,685,3],[684,4,685,4],[684,5,684,7],[684,9,685,9],[723,1,724,2],[723,3,724,3],[723,4,724,4],[723,5,723,7],[723,9,724,9],[707,3,707,7],[710,7,710,9],[713,3,713,7],[714,7,714,9],[717,3,717,7],[652,0,690,0],[653,2,653,9],[654,1,655,3],[654,4,654,5],[655,4,655,5],[656,2,656,7],[656,8,656,9],[657,1,658,2],[612,0,650,0],[613,2,613,9],[614,1,615,3],[614,4,614,5],[615,4,615,5],[616,2,616,7],[616,8,616,9],[617,1,618,2],[648,3,648,7],[649,5,649,7],[643,3,643,7],[644,1,645,2],[644,3,645,3],[644,4,645,4],[644,5,644,7],[644,9,645,9],[617,3,618,3],[617,4,617,5],[560,8,560,9],[577,3,578,3],[577,4,577,5],[577,6,577,7],[582,7,582,9],[586,3,586,7],[587,3,587,7],[608,3,608,7],[609,5,609,7],[592,7,592,8],[593,7,593,8],[595,7,595,9],[598,3,598,7],[600,8,600,9],[617,6,617,7],[572,0,610,0],[573,2,573,9],[574,1,575,3],[574,4,574,5],[575,4,575,5],[576,2,576,7],[576,8,576,9],[577,1,578,2],[603,3,603,7],[604,1,605,2],[604,3,605,3],[604,4,605,4],[604,5,604,7],[604,9,605,9],[588,3,588,7],[591,7,591,9],[594,3,594,7],[547,3,547,7],[529,3,529,7],[530,5,530,7],[533,0,570,0],[534,2,534,9],[535,1,536,3],[535,4,535,5],[536,4,536,5],[537,2,537,7],[537,8,537,9],[538,1,539,2],[568,3,568,7],[569,5,569,7],[563,3,563,7],[564,1,565,2],[564,3,565,3],[564,4,565,4],[564,5,564,7],[564,9,565,9],[548,3,548,7],[551,7,551,9],[554,3,554,7],[555,7,555,9],[558,3,558,7],[515,3,515,7],[516,7,516,9],[519,3,519,7],[521,8,521,9],[538,3,539,3],[538,4,538,5],[538,6,538,7],[543,7,543,9],[546,3,546,7],[499,3,500,3],[499,4,499,5],[499,6,499,7],[504,7,504,9],[507,3,507,7],[508,3,508,7],[490,3,490,7],[491,5,491,7],[494,0,531,0],[495,2,495,9],[496,1,497,3],[496,4,496,5],[497,4,497,5],[498,2,498,7],[498,8,498,9],[499,1,500,2],[524,3,524,7],[525,1,526,2],[525,3,526,3],[525,4,526,4],[525,5,525,7],[525,9,526,9],[509,3,509,7],[512,7,512,9],[455,0,492,0],[456,2,456,9],[457,1,458,3],[457,4,457,5],[458,4,458,5],[459,2,459,7],[459,8,459,9],[460,1,461,2],[485,3,485,7],[486,1,487,2],[486,3,487,3],[486,4,487,4],[486,5,486,7],[486,9,487,9],[470,3,470,7],[473,7,473,9],[476,3,476,7],[477,7,477,9],[480,3,480,7],[482,8,482,9],[441,3,441,7],[443,8,443,9],[460,3,461,3],[460,4,460,5],[460,6,460,7],[465,7,465,9],[468,3,468,7],[469,3,469,7],[451,3,451,7],[452,5,452,7],[421,3,422,3],[421,4,421,5],[421,6,421,7],[426,7,426,9],[429,3,429,7],[430,3,430,7],[416,0,453,0],[417,2,417,9],[418,1,419,3],[418,4,418,5],[419,4,419,5],[420,2,420,7],[420,8,420,9],[421,1,422,2],[446,3,446,7],[447,1,448,2],[447,3,448,3],[447,4,448,4],[447,5,447,7],[447,9,448,9],[431,3,431,7],[434,7,434,9],[437,3,437,7],[438,7,438,9],[412,3,412,7],[413,5,413,7],[407,3,407,7],[408,1,409,2],[408,3,409,3],[408,4,409,4],[408,5,408,7],[408,9,409,9],[391,3,391,7],[394,7,394,9],[398,3,398,7],[399,7,399,9],[402,3,402,7],[404,8,404,9],[395,7,395,8],[396,7,396,8],[381,6,381,7],[386,7,386,9],[389,3,389,7],[390,3,390,7],[329,3,329,7],[330,5,330,7],[378,1,379,3],[378,4,378,5],[379,4,379,5],[380,2,380,7],[380,8,380,9],[381,1,382,2],[334,2,334,9],[335,1,336,3],[335,4,335,5],[336,4,336,5],[337,2,337,7],[337,8,337,9],[338,1,339,2],[338,3,339,3],[373,5,373,7],[381,4,381,5],[359,7,359,9],[381,3,382,3],[290,0,331,0],[291,2,291,9],[292,1,293,3],[292,4,292,5],[293,4,293,5],[294,2,294,7],[294,8,294,9],[295,1,296,2],[324,3,324,7],[325,1,326,2],[325,3,326,3],[325,4,326,4],[325,5,325,7],[325,9,326,9],[309,3,309,7],[312,7,312,9],[315,3,315,7],[316,7,316,9],[319,3,319,7],[321,8,321,9],[273,7,273,9],[276,3,276,7],[278,8,278,9],[295,3,296,3],[295,4,295,5],[295,6,295,7],[304,7,304,9],[307,3,307,7],[308,3,308,7],[286,3,286,7],[287,5,287,7],[239,8,239,9],[256,3,257,3],[256,4,256,5],[256,6,256,7],[261,7,261,9],[264,3,264,7],[265,3,265,7],[251,0,288,0],[252,2,252,9],[253,1,254,3],[253,4,253,5],[254,4,254,5],[255,2,255,7],[255,8,255,9],[256,1,257,2],[281,3,281,7],[282,1,283,2],[282,3,283,3],[282,4,283,4],[282,5,282,7],[282,9,283,9],[266,3,266,7],[269,7,269,9],[272,3,272,7],[226,3,226,7],[159,3,159,7],[160,5,160,7],[210,0,249,0],[211,2,211,9],[212,1,213,3],[212,4,212,5],[213,4,213,5],[214,2,214,7],[214,8,214,9],[215,1,216,2],[247,3,247,7],[248,5,248,7],[242,3,242,7],[243,1,244,2],[243,3,244,3],[243,4,244,4],[243,5,243,7],[243,9,244,9],[227,3,227,7],[230,7,230,9],[233,3,233,7],[234,7,234,9],[237,3,237,7],[145,3,145,7],[146,7,146,9],[149,3,149,7],[151,8,151,9],[215,3,216,3],[215,4,215,5],[215,6,215,7],[220,7,220,9],[225,3,225,7],[202,3,203,3],[202,4,203,4],[202,5,202,7],[202,9,203,9],[206,3,206,7],[207,5,207,7],[127,3,128,3],[127,4,127,5],[127,6,127,7],[132,7,132,9],[135,3,135,7],[136,3,136,7],[118,3,118,7],[119,5,119,7],[122,0,161,0],[123,2,123,9],[124,1,125,3],[124,4,124,5],[125,4,125,5],[126,2,126,7],[126,8,126,9],[127,1,128,2],[154,3,154,7],[155,1,156,2],[155,3,156,3],[155,4,156,4],[155,5,155,7],[155,9,156,9],[137,3,137,7],[140,7,140,9],[83,0,120,0],[84,2,84,9],[85,1,86,3],[85,4,85,5],[86,4,86,5],[87,2,87,7],[87,8,87,9],[88,1,89,2],[113,3,113,7],[114,1,115,2],[114,3,115,3],[114,4,115,4],[114,5,114,7],[114,9,115,9],[98,3,98,7],[101,7,101,9],[104,3,104,7],[105,7,105,9],[108,3,108,7],[110,8,110,9],[69,3,69,7],[71,8,71,9],[88,3,89,3],[88,4,88,5],[88,6,88,7],[93,7,93,9],[96,3,96,7],[97,3,97,7],[79,3,79,7],[80,5,80,7],[49,7,49,9],[55,3,55,7],[56,3,56,7],[35,3,35,7],[36,5,36,7],[39,0,81,0],[40,2,40,9],[41,1,42,3],[41,4,41,5],[42,4,42,5],[43,2,43,7],[43,8,43,9],[44,1,45,2],[0,0,37,0],[74,3,74,7],[75,1,76,2],[75,3,76,3],[75,4,76,4],[75,5,75,7],[75,9,76,9],[57,3,57,7],[60,7,60,9],[63,3,63,7],[64,7,64,9],[27,8,27,9],[30,3,30,7],[31,1,32,2],[31,3,32,3],[31,4,32,4],[31,5,31,7],[31,9,32,9],[44,3,45,3],[44,4,44,5],[44,6,44,7],[0,11,0,12],[1,2,1,9],[1,11,1,12],[2,1,3,3],[2,4,2,5],[2,10,2,11],[3,4,3,5],[4,2,4,7],[4,8,4,9],[13,3,13,7],[14,3,14,7],[15,3,15,7],[15,11,15,13],[18,7,18,9],[21,3,21,7],[5,1,6,2],[5,3,6,3],[5,4,5,5],[5,6,5,7],[7,13,7,15],[10,7,10,9],[22,7,22,9],[25,3,25,7],[202,1,203,2],[333,0,374,0],[377,2,377,9],[376,0,415,0],[397,7,397,8],[362,3,362,7],[364,8,364,9],[367,3,367,7],[368,1,369,2],[368,3,369,3],[368,4,369,4],[368,5,368,7],[368,9,369,9],[372,3,372,7],[338,4,338,5],[338,6,338,7],[347,7,347,9],[350,3,350,7],[351,3,351,7],[352,3,352,7],[355,7,355,9],[358,3,358,7],[50,11,51,12],[163,0,208,0],[164,2,164,9],[164,11,164,12],[165,1,166,3],[165,4,165,5],[165,10,165,11],[166,4,166,5],[167,2,167,7],[167,8,167,9],[168,1,169,2],[168,3,169,3],[168,4,168,5],[168,6,168,7],[173,7,173,9],[176,3,176,7],[177,3,177,7],[178,3,178,7],[181,7,181,9],[184,3,184,7],[185,7,185,9],[196,3,196,7],[198,8,198,9],[201,3,201,7]]}
[1,"1ª/GRD",{"$nulls":8},{"$f":"J37","v":11277.06},"Minas Gerais"]
[null,"OBRA:"," PAVIMENTAÇÃO EM BLOQUETE SEXTAVADOS - RUA DA COMUNIDADE OLIVEIRA NO MUNICÍPIO DE LADAINHA / MG",{"$nulls":8}," MARÇO/2026"]
[null,"Custo Unitário de Referência",null,null,"Minas Gerais"]
[{"$nulls":4}," MARÇO/2026",null,null,"Produção da equipe ",0.5,{"$f":"VLOOKUP(A1,ORÇAMENTO!$A$10:$L$59,7,1)","v":"GL"}]
[null,"CPU.1","MOBILIZAÇÃO E DESMOBILIZAÇÃO",{"$nulls":5},"Valores em reais (R$)"]
[null,"A - EQUIPAMENTOS",null,"Quantidade","Utilização",null,"Custo Horário",null,null,"Custo"]
[{"$nulls":4},"Operativa","Improdutiva","Produtivo","Improdutivo",null,"Horário Total"]
[null,"E9687","Caminhão carroceria com capacidade de 5 t - 120 kW",8,0.6,0.4,172.44059999999999,68.639300000000006,null,{"$f":"D8*(E8*G8+F8*H8)","v":1047.3606399999999}]
[null,"E9575","Caminhão basculante com caçamba estanque com capacidade de 14 m³ - 210 kW",8,1,0,323.19150000000002,97.611199999999997,null,{"$f":"D9*(E9*G9+F9*H9)","v":2585.5320000000002}]
[{"$nulls":7},"Custo horário total de equipamentos",null,{"$f":"SUM(J8:J9)","v":3632.89264}]
[null,"B - MÃO DE OBRA",null,"Quantidade","Unidade",null,"Custo Horário","Custo Horário Total"]
[null,"P9824","Servente",8,"h",null,21.684899999999999,null,null,{"$f":"D12*G12","v":173.47919999999999}]
[null,"-","-",null,"-",null,0,null,null,{"$f":"D13*G13","v":0}]
[null,null,null,"Custo horário total de mão de obra",{"$nulls":5},{"$f":"SUM(J12:J13)","v":173.47919999999999}]
[null,null,null,"Custo horário total de execução",{"$nulls":5},{"$f":"J10+J14","v":3806.3718399999998}]
[null,null,null,"Custo unitário de execução",{"$nulls":5},{"$f":"J15/I4","v":7612.7436799999996}]
[{"$nulls":7},"Custo do FIC",null,0]
[{"$nulls":7},"Custo do FIT",null,0]
[null,"C - MATERIAL",null,"Quantidade","Unidade",null,"Preço Unitário","Custo Unitário"]
[null,"-","-",null,"-",null,0,null,null,{"$f":"D20*G20","v":0}]
[null,"-","-",null,"-",null,0,null,null,{"$f":"D21*G21","v":0}]
[null,null,null,"Custo unitário total de material",{"$nulls":5},{"$f":"SUM(J20:J21)","v":0}]
[null,"D - ATIVIDADES AUXILIARES",null,"Quantidade","Unidade",null,"Custo Unitário","Custo Unitário"]
[null,5914640,"Transporte com cavalo mecânico com semirreboque com capacidade de 32 t - rodovia pavimentada",6210.7080000000005,"tkm",null,0.59,null,null,{"$f":"D24*G24","v":3664.31772}]
[null,"-","-",0,"-",null,0,null,null,{"$f":"D25*G25","v":0}]
[null,null,null,"Custo total de atividades auxiliares",{"$nulls":5},{"$f":"SUM(J24:J25)","v":3664.31772}]
[{"$nulls":7},"Subtotal",null,{"$f":"J16+J22+J26+J17+J18","v":11277.061399999999}]
[null,"E - TEMPO FIXO",null,"Código","Quantidade","Unidade",null,"Custo Unitário","Custo Unitário"]
[null,"-","-","-",null,"-",null,0,null,{"$f":"ROUNDDOWN(E29*H29,4)","v":0}]
[null,"-","-","-",null,"-",null,0,null,{"$f":"ROUNDDOWN(E30*H30,4)","v":0}]
[null,null,null,"Custo unitário total de tempo fixo",{"$nulls":5},{"$f":"SUM(J29:J30)","v":0}]
[null,"F - MOMENTO DE TRANSPORTE",null,"Quantidade","Unidade","DMT",null,null,null,"Custo Unitário"]
[{"$nulls":5},"LN","RP","P"]
[null,"-","-",null,"tkm"]
[null,"-","-",null,"tkm"]
[null,null,null,"Custo unitário total de transporte"]
[{"$nulls":5},"Custo unitário direto total",null,null,null,{"$f":"TRUNC(J27+J31,2)","v":11277.06}]
[null,"Obs."]
[]
[2,"1ª/GRD",{"$nulls":8},{"$f":"J81","v":83819.3}]
[null,"OBRA:"," PAVIMENTAÇÃO EM BLOQUETE SEXTAVADOS - RUA DA COMUNIDADE OLIVEIRA NO MUNICÍPIO DE LADAINHA / MG"]
[null,"Custo Unitário de Referência",null,null,"Minas Gerais"]
[{"$nulls":4}," MARÇO/2026",null,null,"Produção da equipe ",{"$f":"1/5","v":0.2},{"$f":"VLOOKUP(A40,ORÇAMENTO!$A$10:$L$59,7,1)","v":"GL"}]
[null,"CPU.2","ADMINISTRAÇÃO LOCAL",{"$nulls":5},"Valores em reais (R$)"]
[null,"A - EQUIPAMENTOS",null,"Quantidade","Utilização",null,"Custo Horário",null,null,"Custo"]
[{"$nulls":4},"Operativa","Improdutiva","Produtivo","Improdutivo",null,"Horário Total"]
[null,"-","-",null,null,null,0,0,null,{"$f":"D47*(E47*G47+F47*H47)","v":0}]
[null,"-","-",null,null,null,0,0,null,{"$f":"D48*(E48*G48+F48*H48)","v":0}]
[{"$nulls":7},"Custo horário total de equipamentos",null,{"$f":"SUM(J47:J48)","v":0}]
[null,"B - MÃO DE OBRA",null,"Quantidade","Unidade",null,"Custo Horário","Custo Horário Total"]
[null,"P9812","Engenheiro - mensalista",0.16816043390264068,"mês",null,26982.6132,null,null,{"$f":"D51*G51","v":4537.4079435391195}]
[null,"P9840","Encarregado geral - mensalista",0.5,"mês",null,13706.441699999999,null,null,6853.2208499999997]
[null,"P9876","Técnico de segurança do trabalho - mensalista",0.25,"mês",null,8251.9032999999999,null,null,2062.975825]
[null,"P9858","Laboratorista - mensalista",0.25,"mês",null,6549.5189,null,null,1637.379725]
[null,"P9806","Auxiliar administrativo - mensalista",0.25,"mês",null,4706.5968999999996,null,null,1176.6492249999999]
[null,null,null,"Custo horário total de mão de obra",{"$nulls":5},{"$f":"SUM(J51:J55)","v":16267.633568539119}]
[null,null,null,"Custo horário total de execução",{"$nulls":5},{"$f":"J49+J56","v":16267.633568539119}]
[null,null,null,"Custo unitário de execução",{"$nulls":5},{"$f":"J57/I43","v":81338.167842695591}]
[{"$nulls":7},"Custo do FIC",null,"-"]
[{"$nulls":7},"Custo do FIT",null,"-"]
[null,"C - MATERIAL",null,"Quantidade","Unidade",null,"Preço Unitário","Custo Unitário"]
[null,"-","-",null,"-",null,0,null,null,{"$f":"D62*G62","v":0}]
[null,"-","-",null,"-",null,0,null,null,0]
[null,null,null,"Custo unitário total de material",{"$nulls":5},{"$f":"SUM(J62:J63)","v":0}]
[null,"D - ATIVIDADES AUXILIARES",null,"Quantidade","Unidade",null,"Custo Unitário","Custo Unitário"]
[null,14250,"Energia Elétrica",240,"kwh",null,1.1200000000000001,null,null,{"$f":"D66*G66","v":268.8}]
[null,44480,"Tarifa A - Água e Esgoto",18,"m³",null,21.19,null,null,{"$f":"D67*G67","v":381.42}]
[null,5212560,"Placa de advertência para sinalização de obras montada em suporte metálico móvel, lado 1,00 m - utilização de 600 ciclos - fornecimento, 01 implantação e 01 retirada diária",352,"un.dia",null,4.01,null,null,{"$f":"D68*G68","v":1411.52}]
[null,"Cotação","Telefone",6,"mês",null,69.900000000000006,null,null,{"$f":"D69*G69","v":419.40000000000003}]
[null,null,null,"Custo total de atividades auxiliares",{"$nulls":5},{"$f":"SUM(J66:J69)","v":2481.14}]
[{"$nulls":7},"Subtotal",null,{"$f":"J58+J64+J70","v":83819.307842695591}]
[null,"E - TEMPO FIXO",null,"Código","Quantidade","Unidade",null,"Custo Unitário","Custo Unitário"]
[null,"-","-","-",null,"-",null,0,null,{"$f":"ROUNDDOWN(E73*H73,4)","v":0}]
[null,"-","-","-",null,"-",null,0,null,{"$f":"ROUNDDOWN(E74*H74,4)","v":0}]
[null,null,null,"Custo unitário total de tempo fixo",{"$nulls":5},{"$f":"SUM(J73:J74)","v":0}]
[null,"F - MOMENTO DE TRANSPORTE",null,"Quantidade","Unidade","DMT",null,null,null,"Custo Unitário"]
[{"$nulls":5},"LN","RP","P"]
[null,"-","-",null,"tkm"]
[null,"-","-",null,"tkm"]
[null,null,null,"Custo unitário total de transporte"]
[{"$nulls":5},"Custo unitário direto total",null,null,null,{"$f":"TRUNC(J71+J75,2)","v":83819.3}]
[null,"Obs."]
[]
[3,"1ª/GRD",{"$nulls":8},{"$f":"J120","v":16481.150000000001}]
[null,"OBRA:"," PAVIMENTAÇÃO EM BLOQUETE SEXTAVADOS - RUA DA COMUNIDADE OLIVEIRA NO MUNICÍPIO DE LADAINHA / MG"]
[null,"Custo Unitário de Referência",null,null,"Minas Gerais"]
[{"$nulls":4}," MARÇO/2026",null,null,"Produção da equipe ",1,{"$f":"VLOOKUP(A84,ORÇAMENTO!$A$10:$L$59,7,1)","v":"GL"}]
[null,"CPU.3","CANTEIRO DE OBRAS",{"$nulls":5},"Valores em reais (R$)"]
[null,"A - EQUIPAMENTOS",null,"Quantidade","Utilização",null,"Custo Horário",null,null,"Custo"]
[{"$nulls":4},"Operativa","Improdutiva","Produtivo","Improdutivo",null,"Horário Total"]
[null,"-","-",null,null,null,0,0,null,{"$f":"D91*(E91*G91+F91*H91)","v":0}]
[null,"-","-",null,null,null,0,0,null,{"$f":"D92*(E92*G92+F92*H92)","v":0}]
[{"$nulls":7},"Custo horário total de equipamentos",null,{"$f":"SUM(J91:J92)","v":0}]
[null,"B - MÃO DE OBRA",null,"Quantidade","Unidade",null,"Custo Horário","Custo Horário Total"]
[null,"P9824","Servente",8,"h",null,21.684899999999999,null,null,{"$f":"D95*G95","v":173.47919999999999}]
[null,"P9808","Carpinteiro",8,"h",null,27.647099999999998,null,null,221.17679999999999]
[null,null,null,"Custo horário total de mão de obra",{"$nulls":5},{"$f":"SUM(J95:J96)","v":394.65599999999995}]
[null,null,null,"Custo horário total de execução",{"$nulls":5},{"$f":"J93+J97","v":394.65599999999995}]
[null,null,null,"Custo unitário de execução",{"$nulls":5},{"$f":"J98/I87","v":394.65599999999995}]
[{"$nulls":7},"Custo do FIC",null,"-"]
[{"$nulls":7},"Custo do FIT",null,"-"]
[null,"C - MATERIAL",null,"Quantidade","Unidade",null,"Preço Unitário","Custo Unitário"]
[null,"M0053","Tela plástica em polipropileno na cor laranja para tapume - L = 1,2 m",100,"m",null,1.79,null,null,{"$f":"D103*G103","v":179}]
[null,"-","-",0,"-",null,0,null,null,0]
[null,null,null,"Custo unitário total de material",{"$nulls":5},{"$f":"SUM(J103:J104)","v":179}]
[null,"D - ATIVIDADES AUXILIARES",null,"Quantidade","Unidade",null,"Custo Unitário","Custo Unitário"]
[null,10775,"Locação de container 2,30 X 6,00 m, alt. 2,50 m, com 1 sanitário, para escritório, completo, sem divisórias internas",7,"mês",null,1010,null,null,{"$f":"D107*G107","v":7070}]
[null,10779,"Locação de container 2,30 X 4,30 m, alt. 2,50 M, p/ sanitário, c/ 5 bacias, 1 lavatório e 4 mictórios",7,"mês",null,1262.5,null,null,{"$f":"D108*G108","v":8837.5}]
[null,null,null,"Custo total de atividades auxiliares",{"$nulls":5},{"$f":"SUM(J107:J108)","v":15907.5}]
[{"$nulls":7},"Subtotal",null,{"$f":"J99+J105+J109","v":16481.155999999999}]
[null,"E - TEMPO FIXO",null,"Código","Quantidade","Unidade",null,"Custo Unitário","Custo Unitário"]
[null,"-","-","-",null,"-",null,0,null,{"$f":"ROUNDDOWN(E112*H112,4)","v":0}]
[null,"-","-","-",null,"-",null,0,null,{"$f":"ROUNDDOWN(E113*H113,4)","v":0}]
[null,null,null,"Custo unitário total de tempo fixo",{"$nulls":5},{"$f":"SUM(J112:J113)","v":0}]
[null,"F - MOMENTO DE TRANSPORTE",null,"Quantidade","Unidade","DMT",null,null,null,"Custo Unitário"]
[{"$nulls":5},"LN","RP","P"]
[null,"-","-",null,"tkm"]
[null,"-","-",null,"tkm"]
[null,null,null,"Custo unitário total de transporte"]
[{"$nulls":5},"Custo unitário direto total",null,null,null,{"$f":"TRUNC(J110+J114,2)","v":16481.150000000001}]
[null,"Obs."]
[]
[4,"1ª/GRD",{"$nulls":8},{"$f":"J161","v":428.87}]
[null,"OBRA:"," PAVIMENTAÇÃO EM BLOQUETE SEXTAVADOS - RUA DA COMUNIDADE OLIVEIRA NO MUNICÍPIO DE LADAINHA / MG"]
[null,"Custo Unitário de Referência",null,null,"Minas Gerais"]
[{"$nulls":4}," MARÇO/2026",null,null,"Produção da equipe ",1,{"$f":"VLOOKUP(A123,ORÇAMENTO!$A$10:$L$59,7,1)","v":"M2"}]
[null,103689,"PLACA DE OBRA EM CHAPA DE AÇO GALVANIZADO",{"$nulls":5},"Valores em reais (R$)"]
[null,"A - EQUIPAMENTOS",null,"Quantidade","Utilização",null,"Custo Horário",null,null,"Custo"]
[{"$nulls":4},"Operativa","Improdutiva","Produtivo","Improdutivo",null,"Horário Total"]
[null,"-","-",null,null,null,0,0,null,{"$f":"D130*(E130*G130+F130*H130)","v":0}]
[null,"-","-",null,null,null,0,0,null,{"$f":"D131*(E131*G131+F131*H131)","v":0}]
[{"$nulls":7},"Custo horário total de equipamentos",null,{"$f":"SUM(J130:J131)","v":0}]
[null,"B - MÃO DE OBRA",null,"Quantidade","Unidade",null,"Custo Horário","Custo Horário Total"]
[null,"P9824","Servente",1.1186,"h",null,21.684899999999999,null,null,{"$f":"D134*G134","v":24.256729140000001}]
[null,"P9808","Carpinteiro",0.37290000000000001,"h",null,27.647099999999998,null,null,10.30960359]
[null,null,null,"Custo horário total de mão de obra",{"$nulls":5},{"$f":"SUM(J134:J135)","v":34.566332729999999}]
[null,null,null,"Custo horário total de execução",{"$nulls":5},{"$f":"J132+J136","v":34.566332729999999}]
[null,null,null,"Custo unitário de execução",{"$nulls":5},{"$f":"J137/I126","v":34.566332729999999}]
[{"$nulls":7},"Custo do FIC",null,"-"]
[{"$nulls":7},"Custo do FIT",null,"-"]
[null,"C - MATERIAL",null,"Quantidade","Unidade",null,"Preço Unitário","Custo Unitário"]
[null,"M1358","Sarrafo em madeira de terceira - E = 2,5 cm e L = 5 cm",6.4165999999999999,"m",null,2.1217000000000001,null,null,{"$f":"D142*G142","v":13.614100220000001}]
[null,"M1205","Prego de ferro",2.4500000000000001E-2,"kg",null,15.2544,null,null,0.37373280000000003]
[null,"M0998","Madeira estrutural de eucalipto",2.2608E-2,"m³",null,3000,null,null,67.823999999999998]
[null,4813,"Placa de obra (para construção civil) em chapa galvanizada *N. 22*, adesivada, de *2,4 X 1,2* m (sem postes para fixação)",1,"m²",null,312.5,null,null,{"$f":"D145*G145","v":312.5}]
[null,null,null,"Custo unitário total de material",{"$nulls":5},{"$f":"SUM(J142:J145)","v":394.31183301999999}]
[null,"D - ATIVIDADES AUXILIARES",null,"Quantidade","Unidade",null,"Custo Unitário","Custo Unitário"]
[null,"-","-",0,"-",null,0,null,null,{"$f":"D148*G148","v":0}]
[null,"-","-",0,"-",null,0,null,null,0]
[null,null,null,"Custo total de atividades auxiliares",{"$nulls":5},{"$f":"SUM(J148:J149)","v":0}]
[{"$nulls":7},"Subtotal",null,{"$f":"J138+J146+J150","v":428.87816574999999}]
[null,"E - TEMPO FIXO",null,"Código","Quantidade","Unidade",null,"Custo Unitário","Custo Unitário"]
[null,"-","-","-",null,"-",null,0,null,{"$f":"ROUNDDOWN(E153*H153,4)","v":0}]
[null,"-","-","-",null,"-",null,0,null,{"$f":"ROUNDDOWN(E154*H154,4)","v":0}]
[null,null,null,"Custo unitário total de tempo fixo",{"$nulls":5},{"$f":"SUM(J153:J154)","v":0}]
[null,"F - MOMENTO DE TRANSPORTE",null,"Quantidade","Unidade","DMT",null,null,null,"Custo Unitário"]
[{"$nulls":5},"LN","RP","P"]
[null,"-","-",null,"tkm"]
[null,"-","-",null,"tkm"]
[null,null,null,"Custo unitário total de transporte"]
[{"$nulls":5},"Custo unitário direto total",null,null,null,{"$f":"TRUNC(J151+J155,2)","v":428.87}]
[null,"Obs."]
[]
[5,"1ª/GRD",{"$nulls":8},{"$f":"J208","v":4346.6400000000003}]
[null,"OBRA:"," PAVIMENTAÇÃO EM BLOQUETE SEXTAVADOS - RUA DA COMUNIDADE OLIVEIRA NO MUNICÍPIO DE LADAINHA / MG"]
[null,"Custo Unitário de Referência",null,null,"Minas Gerais"]
[{"$nulls":4}," MARÇO/2026",null,null,"Produção da equipe ",1,{"$f":"VLOOKUP(A164,ORÇAMENTO!$A$10:$L$59,7,1)","v":"MÊS"}]
[null,"CPU.4","VEÍCULO PARA A FISCALIZAÇÃO, MÁXIMO 02 ANOS DE USO OU 50.000KM, PREFERENCIALMENTE NA COR BRANCA, COM IDENTIFICAÇÃO CONFORME ESPECIFICAÇÕES DA CODEVASF, INCLUSIVE COMBUSTÍVEL, MANUTENÇÃO, SEGURO E IMPOSTOS - CONFORME ESPECIFICAÇÕES",{"$nulls":5},"Valores em reais (R$)"]
[null,"A - EQUIPAMENTOS",null,"Quantidade","Utilização",null,"Custo Horário",null,null,"Custo"]
[{"$nulls":4},"Operativa","Improdutiva","Produtivo","Improdutivo",null,"Horário Total"]
[null,"-","-",null,null,null,0,0,null,{"$f":"D171*(E171*G171+F171*H171)","v":0}]
[null,"-","-",null,null,null,0,0,null,{"$f":"D172*(E172*G172+F172*H172)","v":0}]
[{"$nulls":7},"Custo horário total de equipamentos",null,{"$f":"SUM(J171:J172)","v":0}]
[null,"B - MÃO DE OBRA",null,"Quantidade","Unidade",null,"Custo Horário","Custo Horário Total"]
[null,"-","-",null,"-",null,0,null,null,{"$f":"D175*G175","v":0}]
[null,"-","-",null,"-",null,0,null,null,0]
[null,null,null,"Custo horário total de mão de obra",{"$nulls":5},{"$f":"SUM(J175:J176)","v":0}]
[null,null,null,"Custo horário total de execução",{"$nulls":5},{"$f":"J173+J177","v":0}]
[null,null,null,"Custo unitário de execução",{"$nulls":5},{"$f":"J178/I167","v":0}]
[{"$nulls":7},"Custo do FIC",null,"-"]
[{"$nulls":7},"Custo do FIT",null,"-"]
[null,"C - MATERIAL",null,"Quantidade","Unidade",null,"Preço Unitário","Custo Unitário"]
[null,"-","-",null,"-",null,0,null,null,{"$f":"D183*G183","v":0}]
[null,"-","-",null,"-",null,0,null,null,0]
[null,null,null,"Custo unitário total de material",{"$nulls":5},{"$f":"SUM(J183:J184)","v":0}]
[null,"D - ATIVIDADES AUXILIARES",null,"Quantidade","Unidade",null,"Custo Unitário","Custo Unitário"]
[null,"-","Depreciação",1,"vb",null,725.93333333333328,null,null,{"$f":"D187*G187","v":725.93333333333328}]
[null,"-","Oportunidade de Capital",1,"vb",null,544.45000000000005,null,null,{"$f":"D188*G188","v":544.45000000000005}]
[null,"-","Impostos e Licenciamento",1,"vb",null,362.97,null,null,362.97]
[null,"-","Seguro Total",1,"vb",null,281.58,null,null,281.58]
[null,"-","Combustível",1,"vb",null,1255.71,null,null,1255.71]
[null,"-","Manutenções Preventivas",1,"vb",null,254.02,null,null,254.02]
[null,"-","Limpeza",1,"vb",null,100,null,null,100]
[null,"-","Pneus",1,"vb",null,119.98,null,null,119.98]
[null,"-","Peças",1,"vb",null,74.790000000000006,null,null,74.790000000000006]
[null,"-","Manutenção Corretiva (%)",1,"vb",null,627.21,null,null,627.21]
[null,null,null,"Custo total de atividades auxiliares",{"$nulls":5},{"$f":"SUM(J187:J196)","v":4346.6433333333334}]
[{"$nulls":7},"Subtotal",null,{"$f":"J179+J185+J197","v":4346.6433333333334}]
[null,"E - TEMPO FIXO",null,"Código","Quantidade","Unidade",null,"Custo Unitário","Custo Unitário"]
[null,"-","-","-",null,"-",null,0,null,{"$f":"ROUNDDOWN(E200*H200,4)","v":0}]
[null,"-","-","-",null,"-",null,0,null,{"$f":"ROUNDDOWN(E201*H201,4)","v":0}]
[null,null,null,"Custo unitário total de tempo fixo",{"$nulls":5},{"$f":"SUM(J200:J201)","v":0}]
[null,"F - MOMENTO DE TRANSPORTE",null,"Quantidade","Unidade","DMT",null,null,null,"Custo Unitário"]
[{"$nulls":5},"LN","RP","P"]
[null,"-","-",null,"tkm"]
[null,"-","-",null,"tkm"]
[null,null,null,"Custo unitário total de transporte"]
[{"$nulls":5},"Custo unitário direto total",null,null,null,{"$f":"TRUNC(J198+J202,2)","v":4346.6400000000003}]
[null,"Obs."]
[]
[6,"1ª/GRD",{"$nulls":8},{"$f":"J249","v":0.48}]
[null,"OBRA:"," PAVIMENTAÇÃO EM BLOQUETE SEXTAVADOS - RUA DA COMUNIDADE OLIVEIRA NO MUNICÍPIO DE LADAINHA / MG"]
[null,"Custo Unitário de Referência",null,null,"Minas Gerais"]
[{"$nulls":4}," MARÇO/2026",null,null,"Produção da equipe ",1,{"$f":"VLOOKUP(A211,ORÇAMENTO!$A$10:$L$59,7,1)","v":"M2"}]
[null,78472,"SERVIÇOS TOPOGRÁFICOS PARA PAVIMENTAÇÃO, INCLUSIVE LEVANTAMENTO PLANIALTIMÉTRICO CADASTRAL, GERAÇÃO DE NOTAS DE SERVIÇO, SEÇÕES TRANSVERSAIS E GREIDE, ESTAQUEAMENTO E ACOMPANHAMENTO EXECUTIVO",{"$nulls":5},"Valores em reais (R$)"]
[null,"A - EQUIPAMENTOS",null,"Quantidade","Utilização",null,"Custo Horário",null,null,"Custo"]
[{"$nulls":4},"Operativa","Improdutiva","Produtivo","Improdutivo",null,"Horário Total"]
[null,92145,"Caminhonete cabine simples com motor 1.6 flex, câmbio manual, potência 101/104 cv, 2 portas",5.0000000000000001E-4,1,0,86.3,0,null,{"$f":"D218*(E218*G218+F218*H218)","v":4.3150000000000001E-2}]
[null,"-","-",0,1,0,0,0,null,{"$f":"D219*(E219*G219+F219*H219)","v":0}]
[{"$nulls":7},"Custo horário total de equipamentos",null,{"$f":"SUM(J218:J219)","v":4.3150000000000001E-2}]
[null,"B - MÃO DE OBRA",null,"Quantidade","Unidade",null,"Custo Horário","Custo Horário Total"]
[null,"P9949","Topógrafo - mensalista",1.2500000000000001E-5,"mês",null,7071.0056999999997,null,null,{"$f":"D222*G222","v":8.8387571250000005E-2}]
[null,"P9950","Auxiliar de topografia - mensalista",1.2500000000000001E-5,"mês",null,6461.7082,null,null,8.0771352500000004E-2]
[null,"P9824","Servente",7.4999999999999997E-3,"h",null,21.684899999999999,null,null,0.16263675]
[null,"P9848","Desenhista - mensalista",1.0000000000000001E-5,"mês",null,10938.037899999999,null,null,0.109380379]
[null,null,null,"Custo horário total de mão de obra",{"$nulls":5},{"$f":"SUM(J222:J225)","v":0.44117605275000005}]
[null,null,null,"Custo horário total de execução",{"$nulls":5},{"$f":"J220+J226","v":0.48432605275000007}]
[null,null,null,"Custo unitário de execução",{"$nulls":5},{"$f":"J227/I214","v":0.48432605275000007}]
[{"$nulls":7},"Custo do FIC",null,"-"]
[{"$nulls":7},"Custo do FIT",null,"-"]
[null,"C - MATERIAL",null,"Quantidade","Unidade",null,"Preço Unitário","Custo Unitário"]
[null,"-","-",0,"-",null,0,null,null,{"$f":"D232*G232","v":0}]
[null,"-","-",0,"-",null,0,null,null,0]
[null,null,null,"Custo unitário total de material",{"$nulls":5},{"$f":"SUM(J232:J233)","v":0}]
[null,"D - ATIVIDADES AUXILIARES",null,"Quantidade","Unidade",null,"Custo Unitário","Custo Unitário"]
[null,"-","-",0,"-",null,0,null,null,{"$f":"D236*G236","v":0}]
[null,"-","-",0,"-",null,0,null,null,0]
[null,null,null,"Custo total de atividades auxiliares",{"$nulls":5},{"$f":"SUM(J236:J237)","v":0}]
[{"$nulls":7},"Subtotal",null,{"$f":"J228+J234+J238","v":0.48432605275000007}]
[null,"E - TEMPO FIXO",null,"Código","Quantidade","Unidade",null,"Custo Unitário","Custo Unitário"]
[null,"-","-","-",null,"-",null,0,null,{"$f":"ROUNDDOWN(E241*H241,4)","v":0}]
[null,"-","-","-",null,"-",null,0,null,{"$f":"ROUNDDOWN(E242*H242,4)","v":0}]
[null,null,null,"Custo unitário total de tempo fixo",{"$nulls":5},{"$f":"SUM(J241:J242)","v":0}]
[null,"F - MOMENTO DE TRANSPORTE",null,"Quantidade","Unidade","DMT",null,null,null,"Custo Unitário"]
[{"$nulls":5},"LN","RP","P"]
[null,"-","-",null,"tkm"]
[null,"-","-",null,"tkm"]
[null,null,null,"Custo unitário total de transporte"]
[{"$nulls":5},"Custo unitário direto total",null,null,null,{"$f":"TRUNC(J239+J243,2)","v":0.48}]
[null,"Obs."]
[]
[7,"1ª/GRD",{"$nulls":8},{"$f":"J288","v":8.65}]
[null,"OBRA:"," PAVIMENTAÇÃO EM BLOQUETE SEXTAVADOS - RUA DA COMUNIDADE OLIVEIRA NO MUNICÍPIO DE LADAINHA / MG"]
[null,"Custo Unitário de Referência",null,null,"Minas Gerais"]
[{"$nulls":4}," MARÇO/2026",null,null,"Produção da equipe ",230.19,{"$f":"VLOOKUP(A252,ORÇAMENTO!$A$10:$L$59,7,1)","v":"M3"}]
[null,5502114,"ESCAVAÇÃO, CARGA E TRANSPORTE DE MATERIAL DE 1ª CATEGORIA - DMT 1.000 A 1.200M, CAMINHO DE SERVIÇO EM REVESTIMENTO PRIMÁRIO",{"$nulls":5},"Valores em reais (R$)"]
[null,"A - EQUIPAMENTOS",null,"Quantidade","Utilização",null,"Custo Horário",null,null,"Custo"]
[{"$nulls":4},"Operativa","Improdutiva","Produtivo","Improdutivo",null,"Horário Total"]
[null,"E9667","Caminhão basculante com capacidade de 14 m³ - 210 kW",5,0.96,0.04,322.66559999999998,97.340599999999995,null,{"$f":"D259*(E259*G259+F259*H259)","v":1568.2629999999997}]
[null,"E9515","Escavadeira hidráulica sobre esteiras com caçamba com capacidade de 1,56 m³ - 118 kW",1,1,0,331.48759999999999,152.93369999999999,null,331.48759999999999]
[{"$nulls":7},"Custo horário total de equipamentos",null,{"$f":"SUM(J259:J260)","v":1899.7505999999996}]
[null,"B - MÃO DE OBRA",null,"Quantidade","Unidade",null,"Custo Horário","Custo Horário Total"]
[null,"P9824","Servente",1,"h",null,21.684899999999999,null,null,{"$f":"D263*G263","v":21.684899999999999}]
[null,"-","-",null,"-",null,0,null,null,0]
[null,null,null,"Custo horário total de mão de obra",{"$nulls":5},{"$f":"SUM(J263:J264)","v":21.684899999999999}]
[null,null,null,"Custo horário total de execução",{"$nulls":5},{"$f":"J261+J265","v":1921.4354999999996}]
[null,null,null,"Custo unitário de execução",{"$nulls":5},{"$f":"J266/I255","v":8.3471719014726951}]
[{"$nulls":7},"Custo do FIC",null,0.31269999999999998]
[{"$nulls":7},"Custo do FIT",null,0]
[null,"C - MATERIAL",null,"Quantidade","Unidade",null,"Preço Unitário","Custo Unitário"]
[null,"-","-",null,"-",null,0,null,null,{"$f":"D271*G271","v":0}]
[null,"-","-",null,"-",null,0,null,null,0]
[null,null,null,"Custo unitário total de material",{"$nulls":5},{"$f":"SUM(J271:J272)","v":0}]
[null,"D - ATIVIDADES AUXILIARES",null,"Quantidade","Unidade",null,"Custo Unitário","Custo Unitário"]
[null,"-","-",0,"-",null,0,null,null,{"$f":"D275*G275","v":0}]
[null,"-","-",0,"-",null,0,null,null,0]
[null,null,null,"Custo total de atividades auxiliares",{"$nulls":5},{"$f":"SUM(J275:J276)","v":0}]
[{"$nulls":7},"Subtotal",null,{"$f":"J267+J273+J277+J268+J269","v":8.6598719014726946}]
[null,"E - TEMPO FIXO",null,"Código","Quantidade","Unidade",null,"Custo Unitário","Custo Unitário"]
[null,"-","-","-",null,"-",null,0,null,{"$f":"ROUNDDOWN(E280*H280,4)","v":0}]
[null,"-","-","-",null,"-",null,0,null,{"$f":"ROUNDDOWN(E281*H281,4)","v":0}]
[null,null,null,"Custo unitário total de tempo fixo",{"$nulls":5},{"$f":"SUM(J280:J281)","v":0}]
[null,"F - MOMENTO DE TRANSPORTE",null,"Quantidade","Unidade","DMT",null,null,null,"Custo Unitário"]
[{"$nulls":5},"LN","RP","P"]
[null,"-","-",null,"tkm"]
[null,"-","-",null,"tkm"]
[null,null,null,"Custo unitário total de transporte"]
[{"$nulls":5},"Custo unitário direto total",null,null,null,{"$f":"TRUNC(J278+J282,2)","v":8.65}]
[null,"Obs."]
[]
[8,"1ª/GRD",{"$nulls":8},{"$f":"J331","v":1.88}]
[null,"OBRA:"," PAVIMENTAÇÃO EM BLOQUETE SEXTAVADOS - RUA DA COMUNIDADE OLIVEIRA NO MUNICÍPIO DE LADAINHA / MG"]
[null,"Custo Unitário de Referência",null,null,"Minas Gerais"]
[{"$nulls":4}," MARÇO/2026",null,null,"Produção da equipe ",672.8,{"$f":"VLOOKUP(A291,ORÇAMENTO!$A$10:$L$59,7,1)","v":"M2"}]
[null,4011209,"REGULARIZAÇÃO DO SUBLEITO - 100% PROCTOR INTERMEDIÁRIO",{"$nulls":5},"Valores em reais (R$)"]
[null,"A - EQUIPAMENTOS",null,"Quantidade","Utilização",null,"Custo Horário",null,null,"Custo"]
[{"$nulls":4},"Operativa","Improdutiva","Produtivo","Improdutivo",null,"Horário Total"]
[null,"E9571","Caminhão tanque com capacidade de 10.000 l - 188 kW",1,0.61,0.39,358.54259999999999,97.3673,null,{"$f":"D298*(E298*G298+F298*H298)","v":256.68423300000001}]
[null,"E9518","Grade de 24 discos rebocável de D = 60 cm (24\")",1,0.41,0.59,4.9439000000000002,3.4428000000000001,null,4.0582510000000003]
[null,"E9524","Motoniveladora - 93 kW",1,0.43,0.56999999999999995,342.05520000000001,150.57470000000001,null,232.911315]
[null,"E9685","Rolo compactador pé de carneiro vibratório autopropelido por pneus de 11,6 t - 82 kW",1,1,0,248.25219999999999,114.1401,null,248.25219999999999]
[null,"E9762","Rolo compactador de pneus autopropelido de 27 t - 85 kW",1,0.96,0.04,331.78800000000001,164.60919999999999,null,{"$f":"D302*(E302*G302+F302*H302)","v":325.10084799999998}]
[null,"E9577","Trator agrícola sobre pneus - 77 kW",1,0.41,0.59,178.655,70.547200000000004,null,114.871398]
[{"$nulls":7},"Custo horário total de equipamentos",null,{"$f":"SUM(J298:J303)","v":1181.8782449999999}]
[null,"B - MÃO DE OBRA",null,"Quantidade","Unidade",null,"Custo Horário","Custo Horário Total"]
[null,"P9824","Servente",1,"h",null,21.684899999999999,null,null,{"$f":"D306*G306","v":21.684899999999999}]
[null,"-","-",0,"-",null,0,null,null,0]
[null,null,null,"Custo horário total de mão de obra",{"$nulls":5},{"$f":"SUM(J306:J307)","v":21.684899999999999}]
[null,null,null,"Custo horário total de execução",{"$nulls":5},{"$f":"J304+J308","v":1203.5631449999998}]
[null,null,null,"Custo unitário de execução",{"$nulls":5},{"$f":"J309/I294","v":1.788886957491082}]
[{"$nulls":7},"Custo do FIC",null,0.1007]
[{"$nulls":7},"Custo do FIT",null,0]
[null,"C - MATERIAL",null,"Quantidade","Unidade",null,"Preço Unitário","Custo Unitário"]
[null,"-","-",0,"-",null,0,null,null,{"$f":"D314*G314","v":0}]
[null,"-","-",0,"-",null,0,null,null,0]
[null,null,null,"Custo unitário total de material",{"$nulls":5},{"$f":"SUM(J314:J315)","v":0}]
[null,"D - ATIVIDADES AUXILIARES",null,"Quantidade","Unidade",null,"Custo Unitário","Custo Unitário"]
[null,"-","-",0,"-",null,0,null,null,{"$f":"D318*G318","v":0}]
[null,"-","-",0,"-",null,0,null,null,0]
[null,null,null,"Custo total de atividades auxiliares",{"$nulls":5},{"$f":"SUM(J318:J319)","v":0}]
[{"$nulls":7},"Subtotal",null,{"$f":"J310+J316+J320+J311+J312","v":1.889586957491082}]
[null,"E - TEMPO FIXO",null,"Código","Quantidade","Unidade",null,"Custo Unitário","Custo Unitário"]
[null,"-","-","-",null,"-",null,0,null,{"$f":"ROUNDDOWN(E323*H323,4)","v":0}]
[null,"-","-","-",null,"-",null,0,null,{"$f":"ROUNDDOWN(E324*H324,4)","v":0}]
[null,null,null,"Custo unitário total de tempo fixo",{"$nulls":5},{"$f":"SUM(J323:J324)","v":0}]
[null,"F - MOMENTO DE TRANSPORTE",null,"Quantidade","Unidade","DMT",null,null,null,"Custo Unitário"]
[{"$nulls":5},"LN","RP","P"]
[null,"-","-",null,"tkm"]
[null,"-","-",null,"tkm"]
[null,null,null,"Custo unitário total de transporte"]
[{"$nulls":5},"Custo unitário direto total",null,null,null,{"$f":"TRUNC(J321+J325,2)","v":1.88}]
[null,"Obs."]
[]
[9,"1ª/GRD",{"$nulls":8},{"$f":"J374","v":17.2}]
[null,"OBRA:"," PAVIMENTAÇÃO EM BLOQUETE SEXTAVADOS - RUA DA COMUNIDADE OLIVEIRA NO MUNICÍPIO DE LADAINHA / MG"]
[null,"Custo Unitário de Referência",null,null,"Minas Gerais"]
[{"$nulls":4}," MARÇO/2026",null,null,"Produção da equipe ",112.13,{"$f":"VLOOKUP(A334,ORÇAMENTO!$A$10:$L$59,7,1)","v":"M3"}]
[null,4011219,"BASE DE SOLO ESTABILIZADA GRANULOMETRICAMENTE SEM MISTURA COM MATERIAL DE JAZIDA - 100% PROCTOR MODIFICADO",{"$nulls":5},"Valores em reais (R$)"]
[null,"A - EQUIPAMENTOS",null,"Quantidade","Utilização",null,"Custo Horário",null,null,"Custo"]
[{"$nulls":4},"Operativa","Improdutiva","Produtivo","Improdutivo",null,"Horário Total"]
[null,"E9571","Caminhão tanque com capacidade de 10.000 l - 188 kW",1,0.62,0.38,358.54259999999999,97.3673,null,{"$f":"D341*(E341*G341+F341*H341)","v":259.29598600000003}]
[null,"E9518","Grade de 24 discos rebocável de D = 60 cm (24\")",1,0.34,0.65999999999999992,4.9439000000000002,3.4428000000000001,null,3.9531739999999997]
[null,"E9524","Motoniveladora - 93 kW",1,0.5,0.5,342.05520000000001,150.57470000000001,null,246.31495000000001]
[null,"E9685","Rolo compactador pé de carneiro vibratório autopropelido por pneus de 11,6 t - 82 kW",1,1,0,248.25219999999999,114.1401,null,248.25219999999999]
[null,"E9762","Rolo compactador de pneus autopropelido de 27 t - 85 kW",1,0.96,0.04,331.78800000000001,164.60919999999999,null,325.10084799999998]
[null,"E9577","Trator agrícola sobre pneus - 77 kW",1,0.34,0.65999999999999992,178.655,70.547200000000004,null,107.30385200000001]
[{"$nulls":7},"Custo horário total de equipamentos",null,{"$f":"SUM(J341:J346)","v":1190.22101}]
[null,"B - MÃO DE OBRA",null,"Quantidade","Unidade",null,"Custo Horário","Custo Horário Total"]
[null,"P9824","Servente",1,"h",null,21.684899999999999,null,null,{"$f":"D349*G349","v":21.684899999999999}]
[null,"-","-",0,"-",null,0,null,null,0]
[null,null,null,"Custo horário total de mão de obra",{"$nulls":5},{"$f":"SUM(J349:J350)","v":21.684899999999999}]
[null,null,null,"Custo horário total de execução",{"$nulls":5},{"$f":"J347+J351","v":1211.9059099999999}]
[null,null,null,"Custo unitário de execução",{"$nulls":5},{"$f":"J352/I337","v":10.808043431731026}]
[{"$nulls":7},"Custo do FIC",null,0.65449999999999997]
[{"$nulls":7},"Custo do FIT",null,0]
[null,"C - MATERIAL",null,"Quantidade","Unidade",null,"Preço Unitário","Custo Unitário"]
[null,"-","-",0,"-",null,0,null,null,{"$f":"D357*G357","v":0}]
[null,"-","-",0,"-",null,0,null,null,0]
[null,null,null,"Custo unitário total de material",{"$nulls":5},{"$f":"SUM(J357:J358)","v":0}]
[null,"D - ATIVIDADES AUXILIARES",null,"Quantidade","Unidade",null,"Custo Unitário","Custo Unitário"]
[null,4016096,"Escavação e carga de material de jazida com escavadeira hidráulica de 1,56 m³",1.1002700000000001,"m³",null,1.62,null,null,{"$f":"D361*G361","v":1.7824374000000003}]
[null,"-","-",0,"-",null,0,null,null,0]
[null,null,null,"Custo total de atividades auxiliares",{"$nulls":5},{"$f":"SUM(J361:J362)","v":1.7824374000000003}]
[{"$nulls":7},"Subtotal",null,{"$f":"J353+J359+J363+J354+J355","v":13.244980831731027}]
[null,"E - TEMPO FIXO",null,"Código","Quantidade","Unidade",null,"Custo Unitário","Custo Unitário"]
[null,4016096,"Escavação e carga de material de jazida com escavadeira hidráulica de 1,56 m³",5914354,2.0630099999999998,"m³",null,1.92,null,{"$f":"ROUNDDOWN(E366*H366,4)","v":3.9609000000000001}]
[null,"-","-","-",null,"-",null,0,null,{"$f":"ROUNDDOWN(E367*H367,4)","v":0}]
[null,null,null,"Custo unitário total de tempo fixo",{"$nulls":5},{"$f":"SUM(J366:J367)","v":3.9609000000000001}]
[null,"F - MOMENTO DE TRANSPORTE",null,"Quantidade","Unidade","DMT",null,null,null,"Custo Unitário"]
[{"$nulls":5},"LN","RP","P"]
[null,4016096,"Escavação e carga de material de jazida com escavadeira hidráulica de 1,56 m³",2.0630099999999998,"tkm",5914359,5914374,5914389]
[null,"-","-",null,"tkm"]
[null,null,null,"Custo unitário total de transporte"]
[{"$nulls":5},"Custo unitário direto total",null,null,null,{"$f":"TRUNC(J364+J368,2)","v":17.2}]
[null,"Obs."]
[]
[10,"1ª/GRD",{"$nulls":8},{"$f":"J414","v":70.03}]
[null,"OBRA:"," PAVIMENTAÇÃO EM BLOQUETE SEXTAVADOS - RUA DA COMUNIDADE OLIVEIRA NO MUNICÍPIO DE LADAINHA / MG"]
[null,"Custo Unitário de Referência",null,null,"Minas Gerais"]
[{"$nulls":4}," MARÇO/2026",null,null,"Produção da equipe ",{"$f":"2/0.1683","v":11.883541295306001},{"$f":"VLOOKUP(A377,ORÇAMENTO!$A$10:$L$59,7,1)","v":"M2"}]
[null,92394,"EXECUÇÃO DE PAVIMENTO EM PISO INTERTRAVADO, COM BLOCO SEXTAVADO DE CONCRETO DE 25 X 25 CM, ESPESSURA 8 CM",{"$nulls":5},"Valores em reais (R$)"]
[null,"A - EQUIPAMENTOS",null,"Quantidade","Utilização",null,"Custo Horário",null,null,"Custo"]
[{"$nulls":4},"Operativa","Improdutiva","Produtivo","Improdutivo",null,"Horário Total"]
[null,"E9587","Serra para corte de concreto - 4 kW",1,3.8E-3,8.0399999999999999E-2,10.114699999999999,1.6005,null,{"$f":"D384*(E384*G384+F384*H384)","v":0.16711605999999998}]
[null,"E9556","Compactador manual de placa vibratória - 3,00 kW",1,5.4999999999999997E-3,7.8700000000000006E-2,10.133900000000001,2.4565000000000001,null,0.24906300000000001]
[{"$nulls":7},"Custo horário total de equipamentos",null,{"$f":"SUM(J384:J385)","v":0.41617905999999999}]
[null,"B - MÃO DE OBRA",null,"Quantidade","Unidade",null,"Custo Horário","Custo Horário Total"]
[null,"P9824","Servente",2,"h",null,21.684899999999999,null,null,{"$f":"D388*G388","v":43.369799999999998}]
[null,"P9802","Ajudante especializado",2,"h",null,27.8186,null,null,55.6372]
[null,null,null,"Custo horário total de mão de obra",{"$nulls":5},{"$f":"SUM(J388:J389)","v":99.007000000000005}]
[null,null,null,"Custo horário total de execução",{"$nulls":5},{"$f":"J386+J390","v":99.42317906000001}]
[null,null,null,"Custo unitário de execução",{"$nulls":5},{"$f":"J391/I380","v":8.3664605178990001}]
[{"$nulls":7},"Custo do FIC",null,2.2700000000000001E-2]
[{"$nulls":7},"Custo do FIT",null,0]
[null,"C - MATERIAL",null,"Quantidade","Unidade",null,"Preço Unitário","Custo Unitário"]
[null,"M0028","Areia média",5.6800000000000003E-2,"m³",null,102.315,"MATTAR",null,{"$f":"D396*G396","v":5.8114920000000003}]
[null,"M1135","Pó de pedra",6.6E-3,"m³",null,95.174999999999997,"MATTAR",null,{"$f":"D397*G397","v":0.62815500000000002}]
[null,712,"BLOQUETE/PISO INTERTRAVADO DE CONCRETO - MODELO SEXTAVADO / HEXAGONAL, *25 X 25* CM, E = 8 CM, RESISTENCIA DE 35 MPA",1.0038,"m²",null,55,"MÉDIA DE VALORES (COTAÇÃO COM LAJES WOLFF E LAJES BRASIL)",null,55.209000000000003]
[null,null,null,"Custo unitário total de material",{"$nulls":5},{"$f":"SUM(J396:J398)","v":61.648647000000004}]
[null,"D - ATIVIDADES AUXILIARES",null,"Quantidade","Unidade",null,"Custo Unitário","Custo Unitário"]
[null,"-","-",0,"-",null,0,null,null,{"$f":"D401*G401","v":0}]
[null,"-","-",0,"-",null,0,null,null,0]
[null,null,null,"Custo total de atividades auxiliares",{"$nulls":5},{"$f":"SUM(J401:J402)","v":0}]
[{"$nulls":7},"Subtotal",null,{"$f":"J392+J399+J403+J393+J394","v":70.037807517898997}]
[null,"E - TEMPO FIXO",null,"Código","Quantidade","Unidade",null,"Custo Unitário","Custo Unitário"]
[null,"-","-","-",null,"-",null,0,null,{"$f":"ROUNDDOWN(E406*H406,4)","v":0}]
[null,"-","-","-",null,"-",null,0,null,{"$f":"ROUNDDOWN(E407*H407,4)","v":0}]
[null,null,null,"Custo unitário total de tempo fixo",{"$nulls":5},{"$f":"SUM(J406:J407)","v":0}]
[null,"F - MOMENTO DE TRANSPORTE",null,"Quantidade","Unidade","DMT",null,null,null,"Custo Unitário"]
[{"$nulls":5},"LN","RP","P"]
[null,"-","-",null,"tkm"]
[null,"-","-",null,"tkm"]
[null,null,null,"Custo unitário total de transporte"]
[{"$nulls":5},"Custo unitário direto total",null,null,null,{"$f":"TRUNC(J404+J408,2)","v":70.03}]
[null,"Obs."]
[]
[15,"1ª/GRD",{"$nulls":8},{"$f":"J453","v":0.68}]
[null,"OBRA:"," PAVIMENTAÇÃO EM BLOQUETE SEXTAVADOS - RUA DA COMUNIDADE OLIVEIRA NO MUNICÍPIO DE LADAINHA / MG"]
[null,"Custo Unitário de Referência",null,null,"Minas Gerais"]
[{"$nulls":4}," MARÇO/2026",null,null,"Produção da equipe ",470.61,{"$f":"VLOOKUP(A417,ORÇAMENTO!$A$10:$L$59,7,1)","v":"TXKM"}]
[null,5915321,"TRANSPORTE COM CAMINHÃO BASCULANTE, EM VIA URBANA PAVIMENTADA",{"$nulls":5},"Valores em reais (R$)"]
[null,"A - EQUIPAMENTOS",null,"Quantidade","Utilização",null,"Custo Horário",null,null,"Custo"]
[{"$nulls":4},"Operativa","Improdutiva","Produtivo","Improdutivo",null,"Horário Total"]
[null,"E9667","Caminhão basculante com capacidade de 14 m³ - 210 kW",1,1,0,322.66559999999998,97.340599999999995,null,{"$f":"D424*(E424*G424+F424*H424)","v":322.66559999999998}]
[null,"-","-",null,null,null,0,0,null,0]
[{"$nulls":7},"Custo horário total de equipamentos",null,{"$f":"SUM(J424:J425)","v":322.66559999999998}]
[null,"B - MÃO DE OBRA",null,"Quantidade","Unidade",null,"Custo Horário","Custo Horário Total"]
[null,"-","-",null,"-",null,0,null,null,{"$f":"D428*G428","v":0}]
[null,"-","-",null,"-",null,0,null,null,0]
[null,null,null,"Custo horário total de mão de obra",{"$nulls":5},{"$f":"SUM(J428:J429)","v":0}]
[null,null,null,"Custo horário total de execução",{"$nulls":5},{"$f":"J426+J430","v":322.66559999999998}]
[null,null,null,"Custo unitário de execução",{"$nulls":5},{"$f":"J431/I420","v":0.68563268948811107}]
[{"$nulls":7},"Custo do FIC",null,0]
[{"$nulls":7},"Custo do FIT",null,0]
[null,"C - MATERIAL",null,"Quantidade","Unidade",null,"Preço Unitário","Custo Unitário"]
[null,"-","-",0,"-",null,0,null,null,{"$f":"D436*G436","v":0}]
[null,"-","-",0,"-",null,0,null,null,0]
[null,null,null,"Custo unitário total de material",{"$nulls":5},{"$f":"SUM(J436:J437)","v":0}]
[null,"D - ATIVIDADES AUXILIARES",null,"Quantidade","Unidade",null,"Custo Unitário","Custo Unitário"]
[null,"-","-",0,"-",null,0,null,null,{"$f":"D440*G440","v":0}]
[null,"-","-",0,"-",null,0,null,null,0]
[null,null,null,"Custo total de atividades auxiliares",{"$nulls":5},{"$f":"SUM(J440:J441)","v":0}]
[{"$nulls":7},"Subtotal",null,{"$f":"J432+J438+J442+J433+J434","v":0.68563268948811107}]
[null,"E - TEMPO FIXO",null,"Código","Quantidade","Unidade",null,"Custo Unitário","Custo Unitário"]
[null,"-","-","-",null,"-",null,0,null,{"$f":"ROUNDDOWN(E445*H445,4)","v":0}]
[null,"-","-","-",null,"-",null,0,null,{"$f":"ROUNDDOWN(E446*H446,4)","v":0}]
[null,null,null,"Custo unitário total de tempo fixo",{"$nulls":5},{"$f":"SUM(J445:J446)","v":0}]
[null,"F - MOMENTO DE TRANSPORTE",null,"Quantidade","Unidade","DMT",null,null,null,"Custo Unitário"]
[{"$nulls":5},"LN","RP","P"]
[null,"-","-",null,"tkm"]
[null,"-","-",null,"tkm"]
[null,null,null,"Custo unitário total de transporte"]
[{"$nulls":5},"Custo unitário direto total",null,null,null,{"$f":"TRUNC(J443+J447,2)","v":0.68}]
[null,"Obs."]
[]
[16,"1ª/GRD",{"$nulls":8},{"$f":"J492","v":0.75}]
[null,"OBRA:"," PAVIMENTAÇÃO EM BLOQUETE SEXTAVADOS - RUA DA COMUNIDADE OLIVEIRA NO MUNICÍPIO DE LADAINHA / MG"]
[null,"Custo Unitário de Referência",null,null,"Minas Gerais"]
[{"$nulls":4}," MARÇO/2026",null,null,"Produção da equipe ",435.75,{"$f":"VLOOKUP(A456,ORÇAMENTO!$A$10:$L$59,7,1)","v":"TXKM"}]
[null,5915320,"TRANSPORTE COM CAMINHÃO BASCULANTE, EM VIA COM REVESTIMENTO PRIMÁRIO",{"$nulls":5},"Valores em reais (R$)"]
[null,"A - EQUIPAMENTOS",null,"Quantidade","Utilização",null,"Custo Horário",null,null,"Custo"]
[{"$nulls":4},"Operativa","Improdutiva","Produtivo","Improdutivo",null,"Horário Total"]
[null,"E9667","Caminhão basculante com capacidade de 14 m³ - 210 kW",1,1,0,322.66559999999998,97.340599999999995,null,{"$f":"D463*(E463*G463+F463*H463)","v":322.66559999999998}]
[null,"-","-",null,null,null,0,0,null,0]
[{"$nulls":7},"Custo horário total de equipamentos",null,{"$f":"SUM(J463:J464)","v":322.66559999999998}]
[null,"B - MÃO DE OBRA",null,"Quantidade","Unidade",null,"Custo Horário","Custo Horário Total"]
[null,"-","-",null,"-",null,0,null,null,{"$f":"D467*G467","v":0}]
[null,"-","-",null,"-",null,0,null,null,0]
[null,null,null,"Custo horário total de mão de obra",{"$nulls":5},{"$f":"SUM(J467:J468)","v":0}]
[null,null,null,"Custo horário total de execução",{"$nulls":5},{"$f":"J465+J469","v":322.66559999999998}]
[null,null,null,"Custo unitário de execução",{"$nulls":5},{"$f":"J470/I459","v":0.74048330464716006}]
[{"$nulls":7},"Custo do FIC",null,1.47E-2]
[{"$nulls":7},"Custo do FIT",null,0]
[null,"C - MATERIAL",null,"Quantidade","Unidade",null,"Preço Unitário","Custo Unitário"]
[null,"-","-",0,"-",null,0,null,null,{"$f":"D475*G475","v":0}]
[null,"-","-",0,"-",null,0,null,null,0]
[null,null,null,"Custo unitário total de material",{"$nulls":5},{"$f":"SUM(J475:J476)","v":0}]
[null,"D - ATIVIDADES AUXILIARES",null,"Quantidade","Unidade",null,"Custo Unitário","Custo Unitário"]
[null,"-","-",0,"-",null,0,null,null,{"$f":"D479*G479","v":0}]
[null,"-","-",0,"-",null,0,null,null,0]
[null,null,null,"Custo total de atividades auxiliares",{"$nulls":5},{"$f":"SUM(J479:J480)","v":0}]
[{"$nulls":7},"Subtotal",null,{"$f":"J471+J477+J481+J472+J473","v":0.7551833046471601}]
[null,"E - TEMPO FIXO",null,"Código","Quantidade","Unidade",null,"Custo Unitário","Custo Unitário"]
[null,"-","-","-",null,"-",null,0,null,{"$f":"ROUNDDOWN(E484*H484,4)","v":0}]
[null,"-","-","-",null,"-",null,0,null,{"$f":"ROUNDDOWN(E485*H485,4)","v":0}]
[null,null,null,"Custo unitário total de tempo fixo",{"$nulls":5},{"$f":"SUM(J484:J485)","v":0}]
[null,"F - MOMENTO DE TRANSPORTE",null,"Quantidade","Unidade","DMT",null,null,null,"Custo Unitário"]
[{"$nulls":5},"LN","RP","P"]
[null,"-","-",null,"tkm"]
[null,"-","-",null,"tkm"]
[null,null,null,"Custo unitário total de transporte"]
[{"$nulls":5},"Custo unitário direto total",null,null,null,{"$f":"TRUNC(J482+J486,2)","v":0.75}]
[null,"Obs."]
[]
[17,"1ª/GRD",{"$nulls":8},{"$f":"J531","v":0.83}]
[null,"OBRA:"," PAVIMENTAÇÃO EM BLOQUETE SEXTAVADOS - RUA DA COMUNIDADE OLIVEIRA NO MUNICÍPIO DE LADAINHA / MG"]
[null,"Custo Unitário de Referência",null,null,"Minas Gerais"]
[{"$nulls":4}," MARÇO/2026",null,null,"Produção da equipe ",231.3,{"$f":"VLOOKUP(A495,ORÇAMENTO!$A$10:$L$59,7,1)","v":"TXKM"}]
[null,5914434,"TRANSPORTE COM CAMINHÃO CARROCERIA, EM VIA URBANA PAVIMENTADA",{"$nulls":5},"Valores em reais (R$)"]
[null,"A - EQUIPAMENTOS",null,"Quantidade","Utilização",null,"Custo Horário",null,null,"Custo"]
[{"$nulls":4},"Operativa","Improdutiva","Produtivo","Improdutivo",null,"Horário Total"]
[null,"E9508","Caminhão carroceria com capacidade de 9 t - 136 kW",1,1,0,192.083,75.035300000000007,null,{"$f":"D502*(E502*G502+F502*H502)","v":192.083}]
[null,"-","-",null,null,null,0,0,null,0]
[{"$nulls":7},"Custo horário total de equipamentos",null,{"$f":"SUM(J502:J503)","v":192.083}]
[null,"B - MÃO DE OBRA",null,"Quantidade","Unidade",null,"Custo Horário","Custo Horário Total"]
[null,"-","-",0,"-",null,0,null,null,{"$f":"D506*G506","v":0}]
[null,"-","-",0,"-",null,0,null,null,0]
[null,null,null,"Custo horário total de mão de obra",{"$nulls":5},{"$f":"SUM(J506:J507)","v":0}]
[null,null,null,"Custo horário total de execução",{"$nulls":5},{"$f":"J504+J508","v":192.083}]
[null,null,null,"Custo unitário de execução",{"$nulls":5},{"$f":"J509/I498","v":0.8304496325118893}]
[{"$nulls":7},"Custo do FIC",null,0]
[{"$nulls":7},"Custo do FIT",null,0]
[null,"C - MATERIAL",null,"Quantidade","Unidade",null,"Preço Unitário","Custo Unitário"]
[null,"-","-",0,"-",null,0,null,null,{"$f":"D514*G514","v":0}]
[null,"-","-",0,"-",null,0,null,null,0]
[null,null,null,"Custo unitário total de material",{"$nulls":5},{"$f":"SUM(J514:J515)","v":0}]
[null,"D - ATIVIDADES AUXILIARES",null,"Quantidade","Unidade",null,"Custo Unitário","Custo Unitário"]
[null,"-","-",0,"-",null,0,null,null,{"$f":"D518*G518","v":0}]
[null,"-","-",0,"-",null,0,null,null,0]
[null,null,null,"Custo total de atividades auxiliares",{"$nulls":5},{"$f":"SUM(J518:J519)","v":0}]
[{"$nulls":7},"Subtotal",null,{"$f":"J510+J516+J520+J511+J512","v":0.8304496325118893}]
[null,"E - TEMPO FIXO",null,"Código","Quantidade","Unidade",null,"Custo Unitário","Custo Unitário"]
[null,"-","-","-",null,"-",null,0,null,{"$f":"ROUNDDOWN(E523*H523,4)","v":0}]
[null,"-","-","-",null,"-",null,0,null,{"$f":"ROUNDDOWN(E524*H524,4)","v":0}]
[null,null,null,"Custo unitário total de tempo fixo",{"$nulls":5},{"$f":"SUM(J523:J524)","v":0}]
[null,"F - MOMENTO DE TRANSPORTE",null,"Quantidade","Unidade","DMT",null,null,null,"Custo Unitário"]
[{"$nulls":5},"LN","RP","P"]
[null,"-","-",null,"tkm"]
[null,"-","-",null,"tkm"]
[null,null,null,"Custo unitário total de transporte"]
[{"$nulls":5},"Custo unitário direto total",null,null,null,{"$f":"TRUNC(J521+J525,2)","v":0.83}]
[null,"Obs."]
[]
[18,"1ª/GRD",{"$nulls":8},{"$f":"J570","v":1.01}]
[null,"OBRA:"," PAVIMENTAÇÃO EM BLOQUETE SEXTAVADOS - RUA DA COMUNIDADE OLIVEIRA NO MUNICÍPIO DE LADAINHA / MG"]
[null,"Custo Unitário de Referência",null,null,"Minas Gerais"]
[{"$nulls":4}," MARÇO/2026",null,null,"Produção da equipe ",192.75,{"$f":"VLOOKUP(A534,ORÇAMENTO!$A$10:$L$59,7,1)","v":"TXKM"}]
[null,5914419,"TRANSPORTE COM CAMINHÃO CARROCERIA, EM VIA COM REVESTIMENTO PRIMÁRIO",{"$nulls":5},"Valores em reais (R$)"]
[null,"A - EQUIPAMENTOS",null,"Quantidade","Utilização",null,"Custo Horário",null,null,"Custo"]
[{"$nulls":4},"Operativa","Improdutiva","Produtivo","Improdutivo",null,"Horário Total"]
[null,"E9508","Caminhão carroceria com capacidade de 9 t - 136 kW",1,1,0,192.083,75.035300000000007,null,{"$f":"D541*(E541*G541+F541*H541)","v":192.083}]
[null,"-","-",null,null,null,0,0,null,0]
[{"$nulls":7},"Custo horário total de equipamentos",null,{"$f":"SUM(J541:J542)","v":192.083}]
[null,"B - MÃO DE OBRA",null,"Quantidade","Unidade",null,"Custo Horário","Custo Horário Total"]
[null,"-","-",0,"-",null,0,null,null,{"$f":"D545*G545","v":0}]
[null,"-","-",0,"-",null,0,null,null,0]
[null,null,null,"Custo horário total de mão de obra",{"$nulls":5},{"$f":"SUM(J545:J546)","v":0}]
[null,null,null,"Custo horário total de execução",{"$nulls":5},{"$f":"J543+J547","v":192.083}]
[null,null,null,"Custo unitário de execução",{"$nulls":5},{"$f":"J548/I537","v":0.99653955901426716}]
[{"$nulls":7},"Custo do FIC",null,1.9400000000000001E-2]
[{"$nulls":7},"Custo do FIT",null,0]
[null,"C - MATERIAL",null,"Quantidade","Unidade",null,"Preço Unitário","Custo Unitário"]
[null,"-","-",0,"-",null,0,null,null,{"$f":"D553*G553","v":0}]
[null,"-","-",0,"-",null,0,null,null,0]
[null,null,null,"Custo unitário total de material",{"$nulls":5},{"$f":"SUM(J553:J554)","v":0}]
[null,"D - ATIVIDADES AUXILIARES",null,"Quantidade","Unidade",null,"Custo Unitário","Custo Unitário"]
[null,"-","-",0,"-",null,0,null,null,{"$f":"D557*G557","v":0}]
[null,"-","-",0,"-",null,0,null,null,0]
[null,null,null,"Custo total de atividades auxiliares",{"$nulls":5},{"$f":"SUM(J557:J558)","v":0}]
[{"$nulls":7},"Subtotal",null,{"$f":"J549+J555+J559+J550+J551","v":1.0159395590142672}]
[null,"E - TEMPO FIXO",null,"Código","Quantidade","Unidade",null,"Custo Unitário","Custo Unitário"]
[null,"-","-","-",null,"-",null,0,null,{"$f":"ROUNDDOWN(E562*H562,4)","v":0}]
[null,"-","-","-",null,"-",null,0,null,{"$f":"ROUNDDOWN(E563*H563,4)","v":0}]
[null,null,null,"Custo unitário total de tempo fixo",{"$nulls":5},{"$f":"SUM(J562:J563)","v":0}]
[null,"F - MOMENTO DE TRANSPORTE",null,"Quantidade","Unidade","DMT",null,null,null,"Custo Unitário"]
[{"$nulls":5},"LN","RP","P"]
[null,"-","-",null,"tkm"]
[null,"-","-",null,"tkm"]
[null,null,null,"Custo unitário total de transporte"]
[{"$nulls":5},"Custo unitário direto total",null,null,null,{"$f":"TRUNC(J560+J564,2)","v":1.01}]
[null,"Obs."]
[]
[20,"1ª/GRD",{"$nulls":8},{"$f":"J610","v":43.76}]
[null,"OBRA:"," PAVIMENTAÇÃO EM BLOQUETE SEXTAVADOS - RUA DA COMUNIDADE OLIVEIRA NO MUNICÍPIO DE LADAINHA / MG"]
[null,"Custo Unitário de Referência",null,null,"Minas Gerais"]
[{"$nulls":4}," MARÇO/2026",null,null,"Produção da equipe ",9.1491000000000007,{"$f":"VLOOKUP(A573,ORÇAMENTO!$A$10:$L$59,7,1)","v":"M"}]
[null,94267,"GUIA (MEIO-FIO) E SARJETA CONJUGADOS DE CONCRETO, MOLDADA  IN LOCO COM EXTRUSORA, 45 CM BASE (15 CM BASE DA GUIA + 30 CM SARJETA) X 22 CM ALTURA",{"$nulls":5},"Valores em reais (R$)"]
[null,"A - EQUIPAMENTOS",null,"Quantidade","Utilização",null,"Custo Horário",null,null,"Custo"]
[{"$nulls":4},"Operativa","Improdutiva","Produtivo","Improdutivo",null,"Horário Total"]
[null,"E9102","Extrusora para sarjeta de concreto - 10,44 kW",1,1.8200000000000001E-2,9.11E-2,48.447800000000001,34.157499999999999,null,{"$f":"D580*(E580*G580+F580*H580)","v":3.9934982099999998}]
[null,"-","-",null,null,null,0,0,null,0]
[{"$nulls":7},"Custo horário total de equipamentos",null,{"$f":"SUM(J580:J581)","v":3.9934982099999998}]
[null,"B - MÃO DE OBRA",null,"Quantidade","Unidade",null,"Custo Horário","Custo Horário Total"]
[null,"P9824","Servente",0.45300000000000001,"h",null,21.684899999999999,null,null,{"$f":"D584*G584","v":9.8232596999999995}]
[null,"P9802","Ajudante especializado",0.10929999999999999,"h",null,27.8186,null,null,3.0405729799999999]
[null,"P9821","Pedreiro",0.22650000000000001,"h",null,27.839500000000001,null,null,{"$f":"D586*G586","v":6.3056467500000002}]
[null,null,null,"Custo horário total de mão de obra",{"$nulls":5},{"$f":"SUM(J584:J586)","v":19.169479429999999}]
[null,null,null,"Custo horário total de execução",{"$nulls":5},{"$f":"J582+J587","v":23.162977639999998}]
[null,null,null,"Custo unitário de execução",{"$nulls":5},{"$f":"J588/I576","v":2.5317219879550992}]
[{"$nulls":7},"Custo do FIC",null,0]
[{"$nulls":7},"Custo do FIT",null,0]
[null,"C - MATERIAL",null,"Quantidade","Unidade",null,"Preço Unitário","Custo Unitário"]
[null,"M0082","Areia média lavada",1.49E-2,"m³",null,93,null,null,{"$f":"D593*G593","v":1.3856999999999999}]
[null,"M0451","Concreto usinado - fck = 20 MPa (comercial)",6.7299999999999999E-2,"m³",null,569.48,null,null,38.326003999999998]
[null,null,null,"Custo unitário total de material",{"$nulls":5},{"$f":"SUM(J593:J594)","v":39.711703999999997}]
[null,"D - ATIVIDADES AUXILIARES",null,"Quantidade","Unidade",null,"Custo Unitário","Custo Unitário"]
[null,1109671,"Argamassa de cimento e areia 1:4 - confecção em betoneira e lançamento manual - areia comercial",3.3E-3,"m³",null,459.88,null,null,{"$f":"D597*G597","v":1.517604}]
[null,"-","-",null,"-",null,0,null,null,0]
[null,null,null,"Custo total de atividades auxiliares",{"$nulls":5},{"$f":"SUM(J597:J598)","v":1.517604}]
[{"$nulls":7},"Subtotal",null,{"$f":"J589+J595+J599+J590+J591","v":43.761029987955098}]
[null,"E - TEMPO FIXO",null,"Código","Quantidade","Unidade",null,"Custo Unitário","Custo Unitário"]
[null,"-","-","-",null,"-",null,0,null,{"$f":"ROUNDDOWN(E602*H602,4)","v":0}]
[null,"-","-","-",null,"-",null,0,null,{"$f":"ROUNDDOWN(E603*H603,4)","v":0}]
[null,null,null,"Custo unitário total de tempo fixo",{"$nulls":5},{"$f":"SUM(J602:J603)","v":0}]
[null,"F - MOMENTO DE TRANSPORTE",null,"Quantidade","Unidade","DMT",null,null,null,"Custo Unitário"]
[{"$nulls":5},"LN","RP","P"]
[null,"-","-",null,"tkm"]
[null,"-","-",null,"tkm"]
[null,null,null,"Custo unitário total de transporte"]
[{"$nulls":5},"Custo unitário direto total",null,null,null,{"$f":"TRUNC(J600+J604,2)","v":43.76}]
[null,"Obs."]
[]
[22,"1ª/GRD",{"$nulls":8},{"$f":"J650","v":20.97}]
[null,"OBRA:"," PAVIMENTAÇÃO EM BLOQUETE SEXTAVADOS - RUA DA COMUNIDADE OLIVEIRA NO MUNICÍPIO DE LADAINHA / MG"]
[null,"Custo Unitário de Referência",null,null,"Minas Gerais"]
[{"$nulls":4}," MARÇO/2026",null,null,"Produção da equipe ",11.534000000000001,{"$f":"VLOOKUP(A613,ORÇAMENTO!$A$10:$L$59,7,1)","v":"M"}]
[null,94263,"GUIA (MEIO-FIO) CONCRETO, MOLDADA IN LOCO EM TRECHO RETO (PARA TRAVAMENTO), 13 CM BASE X 22 CM ALTURA",{"$nulls":5},"Valores em reais (R$)"]
[null,"A - EQUIPAMENTOS",null,"Quantidade","Utilização",null,"Custo Horário",null,null,"Custo"]
[{"$nulls":4},"Operativa","Improdutiva","Produtivo","Improdutivo",null,"Horário Total"]
[null,"E9102","Extrusora para sarjeta de concreto - 10,44 kW",1,1.44E-2,7.22E-2,48.447800000000001,34.157499999999999,null,{"$f":"D620*(E620*G620+F620*H620)","v":3.1638198199999996}]
[null,"-","-",null,null,null,0,0,null,0]
[{"$nulls":7},"Custo horário total de equipamentos",null,{"$f":"SUM(J620:J621)","v":3.1638198199999996}]
[null,"B - MÃO DE OBRA",null,"Quantidade","Unidade",null,"Custo Horário","Custo Horário Total"]
[null,"P9824","Servente",0.4078,"h",null,21.684899999999999,null,null,{"$f":"D624*G624","v":8.8431022199999987}]
[null,"P9802","Ajudante especializado",8.6699999999999999E-2,"h",null,27.8186,null,null,{"$f":"D625*G625","v":2.41187262}]
[null,"P9821","Pedreiro",0.2039,"h",null,27.839500000000001,null,null,{"$f":"D626*G626","v":5.6764740500000004}]
[null,null,null,"Custo horário total de mão de obra",{"$nulls":5},{"$f":"SUM(J624:J626)","v":16.931448889999999}]
[null,null,null,"Custo horário total de execução",{"$nulls":5},{"$f":"J622+J627","v":20.095268709999999}]
[null,null,null,"Custo unitário de execução",{"$nulls":5},{"$f":"J628/I616","v":1.742263630136986}]
[{"$nulls":7},"Custo do FIC",null,"-"]
[{"$nulls":7},"Custo do FIT",null,"-"]
[null,"C - MATERIAL",null,"Quantidade","Unidade",null,"Preço Unitário","Custo Unitário"]
[null,"M0082","Areia média lavada",6.6E-3,"m³",null,93,"MATTAR",null,{"$f":"D633*G633","v":0.61380000000000001}]
[null,"M0451","Concreto usinado - fck = 20 MPa (comercial)",3.1399999999999997E-2,"m³",null,569.48,null,null,17.881671999999998]
[null,null,null,"Custo unitário total de material",{"$nulls":5},{"$f":"SUM(J633:J634)","v":18.495471999999999}]
[null,"D - ATIVIDADES AUXILIARES",null,"Quantidade","Unidade",null,"Custo Unitário","Custo Unitário"]
[null,1109671,"Argamassa de cimento e areia 1:4 - confecção em betoneira e lançamento manual - areia comercial",1.6000000000000001E-3,"m³",null,459.88,null,null,{"$f":"D637*G637","v":0.73580800000000002}]
[null,"-","-",0,"-",null,0,null,null,0]
[null,null,null,"Custo total de atividades auxiliares",{"$nulls":5},{"$f":"SUM(J637:J638)","v":0.73580800000000002}]
[{"$nulls":7},"Subtotal",null,{"$f":"J629+J635+J639","v":20.973543630136984}]
[null,"E - TEMPO FIXO",null,"Código","Quantidade","Unidade",null,"Custo Unitário","Custo Unitário"]
[null,"-","-","-",null,"-",null,0,null,{"$f":"ROUNDDOWN(E642*H642,4)","v":0}]
[null,"-","-","-",null,"-",null,0,null,{"$f":"ROUNDDOWN(E643*H643,4)","v":0}]
[null,null,null,"Custo unitário total de tempo fixo",{"$nulls":5},{"$f":"SUM(J642:J643)","v":0}]
[null,"F - MOMENTO DE TRANSPORTE",null,"Quantidade","Unidade","DMT",null,null,null,"Custo Unitário"]
[{"$nulls":5},"LN","RP","P"]
[null,"-","-",null,"tkm"]
[null,"-","-",null,"tkm"]
[null,null,null,"Custo unitário total de transporte"]
[{"$nulls":5},"Custo unitário direto total",null,null,null,{"$f":"TRUNC(J640+J644,2)","v":20.97}]
[null,"Obs."]
[]
[46,"1ª/GRD",{"$nulls":8},{"$f":"J690","v":543.23}]
[null,"OBRA:"," PAVIMENTAÇÃO EM BLOQUETE SEXTAVADOS - RUA DA COMUNIDADE OLIVEIRA NO MUNICÍPIO DE LADAINHA / MG"]
[null,"Custo Unitário de Referência",null,null,"Minas Gerais"]
[{"$nulls":4}," MARÇO/2026",null,null,"Produção da equipe ",3,{"$f":"VLOOKUP(A653,ORÇAMENTO!$A$10:$L$59,7,1)","v":"UNID."}]
[null,"5213440+\n5213863a","FORNECIMENTO E INSTALAÇÃO DE PLACA DE SINALIZAÇÃO VIÁRIA - REGULAMENTAÇÃO 0,60MX0,60M, SUPORTE INCLUSO",{"$nulls":5},"Valores em reais (R$)"]
[null,"A - EQUIPAMENTOS",null,"Quantidade","Utilização",null,"Custo Horário",null,null,"Custo"]
[{"$nulls":4},"Operativa","Improdutiva","Produtivo","Improdutivo",null,"Horário Total"]
[null,"E9687","Caminhão carroceria com capacidade de 5 t - 120 kW",1,0.3,0.7,172.44059999999999,68.639300000000006,null,{"$f":"D660*(E660*G660+F660*H660)","v":99.779689999999988}]
[null,"-","-",null,null,null,0,0,null,0]
[{"$nulls":7},"Custo horário total de equipamentos",null,{"$f":"SUM(J660:J661)","v":99.779689999999988}]
[null,"B - MÃO DE OBRA",null,"Quantidade","Unidade",null,"Custo Horário","Custo Horário Total"]
[null,"P9830","Montador",1,"h",null,38.192900000000002,null,null,{"$f":"D664*G664","v":38.192900000000002}]
[null,"P9824","Servente",2,"h",null,21.684899999999999,null,null,43.369799999999998]
[null,null,null,"Custo horário total de mão de obra",{"$nulls":5},{"$f":"SUM(J664:J665)","v":81.562700000000007}]
[null,null,null,"Custo horário total de execução",{"$nulls":5},{"$f":"J662+J666","v":181.34238999999999}]
[null,null,null,"Custo unitário de execução",{"$nulls":5},{"$f":"J667/I656","v":60.447463333333332}]
[{"$nulls":7},"Custo do FIC",null,0]
[{"$nulls":7},"Custo do FIT",null,0]
[null,"C - MATERIAL",null,"Quantidade","Unidade",null,"Preço Unitário","Custo Unitário"]
[null,"M1614","Tubo em aço galvanizado com rosca BSP classe leve - D = 50 mm (2\")",3,"m",null,69.865799999999993,null,null,{"$f":"D672*G672","v":209.59739999999999}]
[null,"M0789","Conjunto para fixação de placas em aço galvanizado composto por barra chata, abraçadeira, parafusos, porcas e arruelas",0.69699999999999995,"kg",null,35.537799999999997,null,null,24.769846599999997]
[null,null,null,"Custo unitário total de material",{"$nulls":5},{"$f":"SUM(J672:J673)","v":234.36724659999999}]
[null,"D - ATIVIDADES AUXILIARES",null,"Quantidade","Unidade",null,"Custo Unitário","Custo Unitário"]
[null,5213414,"Placa em aço nº 16 galvanizado com película retrorrefletiva tipo I + SI - confecção",0.35993999999999998,"m²",null,617.20000000000005,null,null,{"$f":"D676*G676","v":222.154968}]
[null,1107892,"Concreto fck = 20 MPa - confecção em betoneira e lançamento manual - areia e brita comerciais",5.0270000000000002E-2,"m³",null,477.72,null,null,24.014984400000003]
[null,4805750,"Escavação manual em material de 1ª categoria na profundidade de até 1 m",5.0270000000000002E-2,"m³",null,44.69,null,null,2.2465663]
[null,null,null,"Custo total de atividades auxiliares",{"$nulls":5},{"$f":"SUM(J676:J678)","v":248.41651870000001}]
[{"$nulls":7},"Subtotal",null,{"$f":"J668+J674+J679+J669+J670","v":543.23122863333333}]
[null,"E - TEMPO FIXO",null,"Código","Quantidade","Unidade",null,"Custo Unitário","Custo Unitário"]
[null,"-","-","-",null,"-",null,0,null,{"$f":"ROUNDDOWN(E682*H682,4)","v":0}]
[null,"-","-","-",null,"-",null,0,null,{"$f":"ROUNDDOWN(E683*H683,4)","v":0}]
[null,null,null,"Custo unitário total de tempo fixo",{"$nulls":5},{"$f":"SUM(J682:J683)","v":0}]
[null,"F - MOMENTO DE TRANSPORTE",null,"Quantidade","Unidade","DMT",null,null,null,"Custo Unitário"]
[{"$nulls":5},"LN","RP","P"]
[null,"-","-",null,"tkm"]
[null,"-","-",null,"tkm"]
[null,null,null,"Custo unitário total de transporte"]
[{"$nulls":5},"Custo unitário direto total",null,null,null,{"$f":"TRUNC(J680+J684,2)","v":543.23}]
[null,"Obs."]
[]
[47,"1ª/GRD",{"$nulls":8},{"$f":"J729","v":130.30000000000001}]
[null,"OBRA:"," PAVIMENTAÇÃO EM BLOQUETE SEXTAVADOS - RUA DA COMUNIDADE OLIVEIRA NO MUNICÍPIO DE LADAINHA / MG"]
[null,"Custo Unitário de Referência",null,null,"Minas Gerais"]
[{"$nulls":4}," MARÇO/2026",null,null,"Produção da equipe ",3,{"$f":"VLOOKUP(A693,ORÇAMENTO!$A$10:$L$59,7,1)","v":"UNID."}]
[null,"CPU.5","FORNECIMENTO E INSTALAÇÃO DE PLACA DE IDENTIFICAÇÃO DE LOGRADOURO, SUPORTE EXISTENTE - CONFORME PROJETO",{"$nulls":5},"Valores em reais (R$)"]
[null,"A - EQUIPAMENTOS",null,"Quantidade","Utilização",null,"Custo Horário",null,null,"Custo"]
[{"$nulls":4},"Operativa","Improdutiva","Produtivo","Improdutivo",null,"Horário Total"]
[null,"-","-",null,null,null,0,0,null,{"$f":"D700*(E700*G700+F700*H700)","v":0}]
[null,"-","-",null,null,null,0,0,null,0]
[{"$nulls":7},"Custo horário total de equipamentos",null,{"$f":"SUM(J700:J701)","v":0}]
[null,"B - MÃO DE OBRA",null,"Quantidade","Unidade",null,"Custo Horário","Custo Horário Total"]
[null,"P9830","Montador",1,"h",null,38.192900000000002,null,null,{"$f":"D704*G704","v":38.192900000000002}]
[null,"P9824","Servente",2,"h",null,21.684899999999999,null,null,43.369799999999998]
[null,null,null,"Custo horário total de mão de obra",{"$nulls":5},{"$f":"SUM(J704:J705)","v":81.562700000000007}]
[null,null,null,"Custo horário total de execução",{"$nulls":5},{"$f":"J702+J706","v":81.562700000000007}]
[null,null,null,"Custo unitário de execução",{"$nulls":5},{"$f":"J707/I696","v":27.187566666666669}]
[{"$nulls":7},"Custo do FIC",null,0]
[{"$nulls":7},"Custo do FIT",null,0]
[null,"C - MATERIAL",null,"Quantidade","Unidade",null,"Preço Unitário","Custo Unitário"]
[null,13521,"PLACA DE ACO ESMALTADA PARA IDENTIFICACAO DE RUA, *45 CM X 20* CM, INCLUSIVE SUPORTE DE FIXAÇÃO ",1,"UNID.",null,103.12,null,null,{"$f":"D712*G712","v":103.12}]
[null,"-","-",0,"-",null,0,null,null,0]
[null,null,null,"Custo unitário total de material",{"$nulls":5},{"$f":"SUM(J712:J713)","v":103.12}]
[null,"D - ATIVIDADES AUXILIARES",null,"Quantidade","Unidade",null,"Custo Unitário","Custo Unitário"]
[null,"-","-",0,"-",null,0,null,null,{"$f":"D716*G716","v":0}]
[null,"-","-",0,"-",null,0,null,null,{"$f":"D717*G717","v":0}]
[null,null,null,"Custo total de atividades auxiliares",{"$nulls":5},{"$f":"SUM(J716:J717)","v":0}]
[{"$nulls":7},"Subtotal",null,{"$f":"J708+J714+J718+J709+J710","v":130.30756666666667}]
[null,"E - TEMPO FIXO",null,"Código","Quantidade","Unidade",null,"Custo Unitário","Custo Unitário"]
[null,"-","-","-",null,"-",null,0,null,{"$f":"ROUNDDOWN(E721*H721,4)","v":0}]
[null,"-","-","-",null,"-",null,0,null,{"$f":"ROUNDDOWN(E722*H722,4)","v":0}]
[null,null,null,"Custo unitário total de tempo fixo",{"$nulls":5},{"$f":"SUM(J721:J722)","v":0}]
[null,"F - MOMENTO DE TRANSPORTE",null,"Quantidade","Unidade","DMT",null,null,null,"Custo Unitário"]
[{"$nulls":5},"LN","RP","P"]
[null,"-","-",null,"tkm"]
[null,"-","-",null,"tkm"]
[null,null,null,"Custo unitário total de transporte"]
[{"$nulls":5},"Custo unitário direto total",null,null,null,{"$f":"TRUNC(J719+J723,2)","v":130.30000000000001}]
[null,"Obs."]

{"sheet":"AUX-VEIC.","index":2,"n_rows":31,"n_cols":5,"rows_kept":31,"cut":false,"hidden":false,"merged":[[25,2,25,3],[1,1,1,4],[2,1,2,2],[3,1,3,4],[17,1,17,4],[18,2,18,3],[19,2,19,3],[20,2,20,3],[21,2,21,3],[22,2,22,3],[23,2,23,3],[24,2,24,3],[26,2,26,3],[27,2,27,3],[28,2,28,3],[29,1,30,1],[29,2,29,3],[30,2,30,3]]}
[]
[null,"CÁLCULO DO CUSTO POR MÊS DE VEÍCULOS"]
[null,"Veículo: Polo TSI, Onix Turbo, Argo 1.3, HB-20 Turbo",null,"Data:","2026-01-20"]
[null,"DADOS ELEMENTARES DO VEÍCULO"]
[null,"Dados Básicos","Preço (R$)","Quantidade","Vida Útil"]
[null,"Quilometragem média mensal",null,3000]
[null,"Valor de Aquisição (VA)",108890]
[null,"Taxa de Juros (i)%",null,15]
[null,"IPVA e Seguro Obrigatório (4%)",4355.6000000000004]
[null,"Lavagem",50,2]
[null,"Pneus",499.9,4,50000]
[null,"Combustível",5.86,14]
[null,"Óleo Lubrificante + Filtros (revisão)",846.74400000000003,1,10000]
[null,"Seguro Total Anual",3378.94]
[null,"Jogo de Amortecedores",1246.5,null,50000]
[null,"Coeficiente de Manutenção",null,4.7999999999999998E-6]
[null,"Motorista",3038.2740182832176,1]
[null,"CÁLCULO DO CUSTO POR MÊS"]
[null,"DEPRECIAÇÃO","D = (VA-0,60xVA) / 12 x 5",null,725.93333333333328]
[null,"JUROS","J = (VA-0,60xVA) x i / 12",null,544.45000000000005]
[null,"LICENCIAMENTO","L = (IPVA=SEG.OBRIG.)/12",null,362.97]
[null,"SEGURO TOTAL","ST = SEGURO ANUAL/12",null,281.58]
[null,"COMBUSTÍVEL","OD = (Comb./Consu)x Km.mês",null,1255.71]
[null,"ÓLEO LUBRIFICANTE","OL = ((Ol. X Quant)/Vida Útil)xKm.mês)",null,254.02]
[null,"LAVAGEM","LL = Preço Lavagem x Quantidade",null,100]
[null,"PNEUS","P = ((P. PneusxQuant)/Vida Útil)xkm.mês)",null,119.98]
[null,"AMORTECEDORES","AM = (P. Amort/Vida Útil)xkm.mês",null,74.790000000000006]
[null,"MANUTENÇÃO","M = (VA-VPxK)xkm.mês",null,627.21]
[null,"MOTORISTA","MOT = SALÁRIO+LEIS SOCIAIS",null,5276.87]
[null,"CUSTO POR MÊS","SEM MOTORISTA",null,4346.6433333333334]
[null,null,"COM MOTORISTA",null,9623.5133333333324]

{"sheet":"BDI SERV","index":3,"n_rows":60,"n_cols":5,"rows_kept":60,"cut":false,"hidden":false,"merged":[[36,0,36,5],[38,1,38,4],[39,2,39,3],[35,0,35,5],[0,1,2,4],[25,1,25,3],[26,1,26,2],[26,3,26,4],[27,3,27,4]]}
[null,"DETALHAMENTO DO BDI - SERVIÇOS"]
[]
[]
[null,"Item","Descrição dos Serviços","% - PV","% - CD"]
[]
[null,1,"ADMINISTRAÇÃO CENTRAL"," ",{"$f":"SUM(E7:E9)","v":4.01}]
[null,"1.1","ESCRITÓRIO CENTRAL",null,4.01]
[null,"1.2","VIAGENS"]
[null,"1.3","OUTROS"]
[null," "," "," "," "]
[null,2,"IMPOSTOS E TAXAS",{"$f":"SUM(D12:D15)","v":5.7},{"$f":"SUM(E12:E15)","v":0}]
[null,"2.1","ISS - Proposta",{"$f":"D34*100","v":2.0500000000000003}]
[null,"2.2","PIS",0.65]
[null,"2.3","Cofins",3]
[null,"2.4","Contribuição Previdenciaria (CPRB)"]
[]
[null,3,"TAXA DE RISCO",null,{"$f":"SUM(E18:E20)","v":0.96}]
[null,"3.1","SEGURO",null,0.2]
[null,"3.2","RISCO",null,0.56000000000000005]
[null,"3.3","GARANTIA",null,0.2]
[]
[null,4,"DESPESAS FINANCEIRAS",null,1.1100000000000001]
[]
[null,5,"LUCRO",null,8]
[]
[null,"BDI APRESENTADO:",null,null,21.55]
[]
[null,null,"Legislação Municipal:","Lei Municipal N° 17"]
[null,null,"Município:","Ladainha - MG"]
[null,null,"Alíquota ISSQN:",0.05,"Município"]
[null,null,"Base de Cálculo:","Dedução - Material"]
[null,null,"Valor Serviço:",1101392.83]
[null,null,"Dedução - Material (estimado):",650000,{"$f":"D33/D32","v":0.5901618226441514}]
[null,null,"ISSQN BDI:",{"$f":"IF(D32=\"\",0,ROUND(IF(D31=D49,((1-(D33/D32))*D30),D30*D31),4))","v":2.0500000000000001E-2},"(*)"]
[]
["Acórdão nº 2.622/2013 - TCU Plenário"]
["BDI = ARRED((((((1+(AC+TR)/100)*(1+DF/100)*(1+L/100))/(1-IMP/100))-1)*100);2)"]
[]
[null,"(*) É obrigação da licitante a verificação da Legislação Tributária vigente no município, bem como o cálculo dos valores totais de serviços e materiais estimados, para apresentação de sua proposta."]
[]
[null,null,"Forma de Cálculo do BDI:","BDI - Acórdão nº 2.622/2013 - TCU"]
[]
[null,null,"BDI - Digitado",{"$f":"ROUND(E6+E11+E17+E22+E24,2)","v":14.08}]
[null,null,"BDI - Calculado",{"$f":"ROUND((((1+(E6/100+E22/100+E17/100))/(1-(D11/100+E24/100)))-1)*100,2)","v":22.92}]
[null,null,"BDI - Acórdão nº 2.622/2013 - TCU",{"$f":"ROUND((((((1+(E6+E17)/100)*(1+E22/100)*(1+E24/100))/(1-D11/100))-1)*100),2)","v":21.55}]
[]
[]
[]
[null,null,null,"Dedução - Material","Município"]
[null,null,null,0.1,"Simples Nacional"]
[null,null,null,0.2,"Municípios Indefinidos"]
[null,null,null,0.3]
[null,null,null,0.4]
[null,null,null,0.5]
[null,null,null,0.6]
[null,null,null,0.7]
[null,null,null,0.8]
[null,null,null,0.9]
[null,null,null,1]
[null,null,null,{"$f":"E31","v":0}]

{"sheet":"CRONOGRAMA","index":4,"n_rows":17,"n_cols":12,"rows_kept":17,"cut":false,"hidden":false,"merged":[[7,0,8,0],[9,0,10,0],[11,0,12,0],[0,1,0,11],[1,6,1,11],[2,6,2,11],[3,1,3,6],[5,0,6,0],[5,2,6,2],[1,1,2,1],[5,1,6,1],[1,2,2,4],[13,1,14,2],[16,1,20,11],[7,2,8,2],[9,2,10,2],[11,2,12,2],[7,1,8,1],[9,1,10,1],[11,1,12,1]]}
[null,"CRONOGRAMA FÍSICO-FINANCEIRO"]
[null,"OBRA: "," PAVIMENTAÇÃO EM BLOQUETE SEXTAVADOS - RUA DA COMUNIDADE OLIVEIRA NO MUNICÍPIO DE LADAINHA / MG",null,null,"VALOR:",1337000.0000000002]
[{"$nulls":5},"PRAZO: ","180 DIAS "]
[]
[null,"ITEM","ETAPAS/DESCRIÇAO","FISICO/  FINANCEIRO","TOTAL    ETAPAS","MÊS 1","MÊS 2","MÊS 3","MÊS 4","MÊS 5","MÊS 6","TOTAL"]
["A",1,"SERVIÇOS PRELIMINARES ","FISICO ",0.13800000000000001,0.2,0.2,0.15,0.15,0.15,0.15,1]
[null,null,null,"FINANCEIRO",184499.74,36899.949999999997,36899.949999999997,27674.959999999999,27674.959999999999,27674.959999999999,27674.959999999999,184499.73999999996]
["B",2,"TERRAPLANAGEM E PAVIMENTAÇÃO","FISICO ",0.60389999999999999,0.2,0.2,0.15,0.15,0.15,0.15,1]
[null,null,null,"FINANCEIRO",807368.9,161473.78,161473.78,121105.34,121105.34,121105.34,121105.34,807368.91999999993]
["C",3,"TRANSPORTE DE MATERIAIS","FISICO ",0.15809999999999999,0.15,0.15,0.2,0.2,0.15,0.15,1]
[null,null,null,"FINANCEIRO",211410,31711.5,31711.5,42282,42282,31711.5,31711.5,211410]
["D",4,"DRENAGEM E OBRAS COMPLEMENTARES","FISICO ",0.1,0.1,0.15,0.2,0.2,0.2,0.15,1]
[null,null,null,"FINANCEIRO",133721.34999999998,13372.14,20058.2,26744.27,26744.27,26744.27,20058.2,133721.35]
[null,"TOTAL",null,"FISICO ",0.5320922777269429,0.18209227510914189,0.18709306796629066,0.16290693465151032,0.16290693465151032,0.1550008014584951,0.15000000112191472,1.000000014958863]
[null,null,null,"FINANCEIRO",1336999.9900000002,243457.37,250143.43,217806.56999999998,217806.56999999998,207236.06999999998,200550,1337000.01]
[]
[null,"OBSERVAÇÕES:"]