{"text_format":"2","workbook":"xlsx","n_sheets":5,"sheets":["ORÇAMENTO","CPU-SERV","AUX-VEIC.","BDI SERV","CRONOGRAMA"],"not_rendered":{"charts":0,"images":3,"macros":0,"external_links":0,"defined_names":5,"comments":2,"pivot_tables":0},"unopened":[],"bounds":{"document_bytes":16777216,"sheet_cells":100000,"run_cost":"one","rows_first":2000,"rows_last":500,"rows_between":2000,"halvings":0,"cell_chars":16384,"cell_head_chars":4096},"cells_cut":0,"cells_raw":0,"read":"whole","date_system":"1900"}

{"sheet":"ORÇAMENTO","index":0,"n_rows":29,"n_cols":12,"rows_kept":29,"cut":false,"hidden":false,"merged":[[9,17,10,17],[8,13,9,13],[28,1,28,4],[0,0,8,0],[0,4,0,11],[1,4,1,11],[2,4,2,11],[7,1,7,11],[4,2,4,7],[5,2,5,7],[4,8,4,10],[5,8,5,10],[6,8,6,10],[6,1,6,4]]}
["<---- NUMERAR SERVIÇOS PARA CPU",null,null,null,"Ministério do Desenvolvimento Regional"]
[{"$nulls":4},"Companhia de Desenvolvimento dos Vales do São Francisco e do Parnaíba"]
[{"$nulls":4},"1ª Superintendência Regional"]
[]
[null,"OBRA: "," PAVIMENTAÇÃO EM BLOQUETE SEXTAVADOS - RUAS DIVERSAS DO MUNICÍPIO DE MATA VERDE / MG",{"$nulls":5},"BDI Serviços (%):",null,null,{"$f":"'BDI SERV'!E26","v":25.48}]
[null,"DATA:"," JANEIRO/2026",{"$nulls":5},"BDI Diferenciado Serviços (%):",null,null,15]
[null,"PRAZO DE EXECUÇÃO:    180 DIAS",{"$nulls":6},"BDI Fornecimentos (%):",null,null,15]
[null,"PLANILHA DE ORÇAMENTAÇÃO"]
[null,"ITEM","CÓDIGO","FONTE","DISCRIMINAÇÃO","TIPO","UNID.","QUANT.","VR.UNIT.S/BDI","PR. UNIT.C/BDI","C. TOT.S/BDI","P. TOT.C/BDI"]
["A",1,null,null,"SERVIÇOS PRELIMINARES ",{"$nulls":5},{"$f":"SUM(K11:K16)","v":146058.09},{"$f":"SUM(L11:L16)","v":183251.37}]
[1,"1.1","CPU.1","CODEVASF","MOBILIZAÇÃO E DESMOBILIZAÇÃO","SERV","GL",1,{"$f":"VLOOKUP(A11,'CPU-SERV'!A:K,11,0)","v":11625.22},{"$f":"TRUNC(_xlfn.IFS(F11=\"SERV\",I11*(1+$L$5/100),F11=\"SERV DIF\",I11*(1+$L$6/100),F11=\"FORN\",I11*(1+$L$7/100)),2)","v":14587.32},{"$f":"TRUNC(H11*I11,2)","v":11625.22},{"$f":"TRUNC(H11*J11,2)","v":14587.32}]
[2,"1.2","CPU.2","CODEVASF","ADMINISTRAÇÃO LOCAL","SERV","GL",1,{"$f":"VLOOKUP(A12,'CPU-SERV'!A:K,11,0)","v":79158.720000000001},{"$f":"TRUNC(_xlfn.IFS(F12=\"SERV\",I12*(1+$L$5/100),F12=\"SERV DIF\",I12*(1+$L$6/100),F12=\"FORN\",I12*(1+$L$7/100)),2)","v":99328.36},{"$f":"TRUNC(H12*I12,2)","v":79158.720000000001},{"$f":"TRUNC(H12*J12,2)","v":99328.36}]
[3,"1.3","CPU.3","CODEVASF","CANTEIRO DE OBRAS","SERV","GL",1,{"$f":"VLOOKUP(A13,'CPU-SERV'!A:K,11,0)","v":14208.65},{"$f":"TRUNC(_xlfn.IFS(F13=\"SERV\",I13*(1+$L$5/100),F13=\"SERV DIF\",I13*(1+$L$6/100),F13=\"FORN\",I13*(1+$L$7/100)),2)","v":17829.009999999998},14208.65,17829.009999999998]
[4,"1.4",103689,"SINAPI","PLACA DE OBRA EM CHAPA DE AÇO GALVANIZADO","SERV","M2",2,{"$f":"VLOOKUP(A14,'CPU-SERV'!A:K,11,0)","v":555.87},{"$f":"TRUNC(_xlfn.IFS(F14=\"SERV\",I14*(1+$L$5/100),F14=\"SERV DIF\",I14*(1+$L$6/100),F14=\"FORN\",I14*(1+$L$7/100)),2)","v":697.5},1111.74,1395]
[5,"1.5","CPU.4","CODEVASF","VEÍCULO PARA A FISCALIZAÇÃO, MÁXIMO 02 ANOS DE USO OU 50.000KM, PREFERENCIALMENTE NA COR BRANCA, COM IDENTIFICAÇÃO CONFORME ESPECIFICAÇÕES DA CODEVASF, INCLUSIVE COMBUSTÍVEL, MANUTENÇÃO, SEGURO E IMPOSTOS - CONFORME ESPECIFICAÇÕES","SERV","MÊS",8,{"$f":"VLOOKUP(A15,'CPU-SERV'!A:K,11,0)","v":4415.22},{"$f":"TRUNC(_xlfn.IFS(F15=\"SERV\",I15*(1+$L$5/100),F15=\"SERV DIF\",I15*(1+$L$6/100),F15=\"FORN\",I15*(1+$L$7/100)),2)","v":5540.21},{"$f":"TRUNC(H15*I15,2)","v":35321.760000000002},{"$f":"TRUNC(H15*J15,2)","v":44321.68}]
[6,"1.6",78472,"SINAPI","SERVIÇOS TOPOGRÁFICOS PARA PAVIMENTAÇÃO, INCLUSIVE LEVANTAMENTO PLANIALTIMÉTRICO CADASTRAL, GERAÇÃO DE NOTAS DE SERVIÇO, SEÇÕES TRANSVERSAIS E GREIDE, ESTAQUEAMENTO E ACOMPANHAMENTO EXECUTIVO","SERV","M2",9650,{"$f":"VLOOKUP(A16,'CPU-SERV'!A:K,11,0)","v":0.48},{"$f":"TRUNC(_xlfn.IFS(F16=\"SERV\",I16*(1+$L$5/100),F16=\"SERV DIF\",I16*(1+$L$6/100),F16=\"FORN\",I16*(1+$L$7/100)),2)","v":0.6},4632,5790]
["B",2,null,null,"TERRAPLANAGEM E PAVIMENTAÇÃO",{"$nulls":5},{"$f":"SUM(K18:K21)","v":631607.5},{"$f":"SUM(L18:L21)","v":792393.5}]
[7,"2.1",5502114,"SICRO","ESCAVAÇÃO, CARGA E TRANSPORTE DE MATERIAL DE 1ª CATEGORIA - DMT 1.000 A 1.200M, CAMINHO DE SERVIÇO EM REVESTIMENTO PRIMÁRIO","SERV","M3",1450,{"$f":"VLOOKUP(A18,'CPU-SERV'!A:K,11,0)","v":8.65},{"$f":"TRUNC(_xlfn.IFS(F18=\"SERV\",I18*(1+$L$5/100),F18=\"SERV DIF\",I18*(1+$L$6/100),F18=\"FORN\",I18*(1+$L$7/100)),2)","v":10.85},{"$f":"TRUNC(H18*I18,2)","v":12542.5},{"$f":"TRUNC(H18*J18,2)","v":15732.5}]
[8,"2.2",4011209,"SICRO","REGULARIZAÇÃO DO SUBLEITO - 100% PROCTOR INTERMEDIÁRIO","SERV","M2",9650,{"$f":"VLOOKUP(A19,'CPU-SERV'!A:K,11,0)","v":1.88},{"$f":"TRUNC(_xlfn.IFS(F19=\"SERV\",I19*(1+$L$5/100),F19=\"SERV DIF\",I19*(1+$L$6/100),F19=\"FORN\",I19*(1+$L$7/100)),2)","v":2.35},18142,22677.5]
[9,"2.3",4011219,"SICRO","BASE DE SOLO ESTABILIZADA GRANULOMETRICAMENTE SEM MISTURA COM MATERIAL DE JAZIDA - 100% PROCTOR MODIFICADO","SERV","M3",1450,{"$f":"VLOOKUP(A20,'CPU-SERV'!A:K,11,0)","v":17.2},{"$f":"TRUNC(_xlfn.IFS(F20=\"SERV\",I20*(1+$L$5/100),F20=\"SERV DIF\",I20*(1+$L$6/100),F20=\"FORN\",I20*(1+$L$7/100)),2)","v":21.58},{"$f":"TRUNC(H20*I20,2)","v":24940},{"$f":"TRUNC(H20*J20,2)","v":31291}]
[10,"2.4",92394,"SINAPI","EXECUÇÃO DE PAVIMENTO EM PISO INTERTRAVADO, COM BLOCO SEXTAVADO DE CONCRETO DE 25 X 25 CM, ESPESSURA 8 CM","SERV","M2",8350,{"$f":"VLOOKUP(A21,'CPU-SERV'!A:K,11,0)","v":68.98},{"$f":"TRUNC(_xlfn.IFS(F21=\"SERV\",I21*(1+$L$5/100),F21=\"SERV DIF\",I21*(1+$L$6/100),F21=\"FORN\",I21*(1+$L$7/100)),2)","v":86.55},575983,722692.5]
["C",3,null,null,"TRANSPORTE DE MATERIAIS",{"$nulls":5},{"$f":"SUM(K23:K25)","v":177245},{"$f":"SUM(L23:L25)","v":221945}]
[15,"3.1",5915321,"SICRO","TRANSPORTE COM CAMINHÃO BASCULANTE, EM VIA URBANA PAVIMENTADA","SERV","TXKM",58500,{"$f":"VLOOKUP(A23,'CPU-SERV'!A:K,11,0)","v":0.68},{"$f":"TRUNC(_xlfn.IFS(F23=\"SERV\",I23*(1+$L$5/100),F23=\"SERV DIF\",I23*(1+$L$6/100),F23=\"FORN\",I23*(1+$L$7/100)),2)","v":0.85},{"$f":"TRUNC(H23*I23,2)","v":39780},{"$f":"TRUNC(H23*J23,2)","v":49725}]
[16,"3.2",5915320,"SICRO","TRANSPORTE COM CAMINHÃO BASCULANTE, EM VIA COM REVESTIMENTO PRIMÁRIO","SERV","TXKM",3500,{"$f":"VLOOKUP(A24,'CPU-SERV'!A:K,11,0)","v":0.74},{"$f":"TRUNC(_xlfn.IFS(F24=\"SERV\",I24*(1+$L$5/100),F24=\"SERV DIF\",I24*(1+$L$6/100),F24=\"FORN\",I24*(1+$L$7/100)),2)","v":0.92},2590,3220]
[17,"3.3",5914434,"SICRO","TRANSPORTE COM CAMINHÃO CARROCERIA, EM VIA URBANA PAVIMENTADA","SERV","TXKM",162500,{"$f":"VLOOKUP(A25,'CPU-SERV'!A:K,11,0)","v":0.83},{"$f":"TRUNC(_xlfn.IFS(F25=\"SERV\",I25*(1+$L$5/100),F25=\"SERV DIF\",I25*(1+$L$6/100),F25=\"FORN\",I25*(1+$L$7/100)),2)","v":1.04},134875,169000]
["D",4,null,null,"DRENAGEM E OBRAS COMPLEMENTARES",{"$nulls":5},{"$f":"SUM(K27:K28)","v":241026.5},{"$f":"SUM(L27:L28)","v":302411}]
[20,"4.1",94273,"SINAPI","ASSENTAMENTO DE GUIA (MEIO-FIO) EM TRECHO RETO, CONFECCIONADA EM CONCRETO PRÉ-FABRICADO, DIMENSÕES 100X15X13X30 CM (COMPRIMENTO X BASE INFERIOR X BASE SUPERIOR X ALTURA). ","SERV","M",2950,{"$f":"VLOOKUP(A27,'CPU-SERV'!A:K,11,0)","v":50.18},{"$f":"TRUNC(_xlfn.IFS(F27=\"SERV\",I27*(1+$L$5/100),F27=\"SERV DIF\",I27*(1+$L$6/100),F27=\"FORN\",I27*(1+$L$7/100)),2)","v":62.96},{"$f":"TRUNC(H27*I27,2)","v":148031},{"$f":"TRUNC(H27*J27,2)","v":185732}]
[22,"4.2","94287a","SINAPI","EXECUÇÃO DE SARJETA DE CONCRETO USINADO, MOLDADA IN LOCO EM TRECHO RETO, 30 CM BASE X 5 CM ALTURA. ","SERV","M",2850,{"$f":"VLOOKUP(A28,'CPU-SERV'!A:K,11,0)","v":32.630000000000003},{"$f":"TRUNC(_xlfn.IFS(F28=\"SERV\",I28*(1+$L$5/100),F28=\"SERV DIF\",I28*(1+$L$6/100),F28=\"FORN\",I28*(1+$L$7/100)),2)","v":40.94},92995.5,116679]
[null,"TOTAL GERAL DA OBRA COM BDI ",{"$nulls":8},{"$f":"SUM(K10,K17,K22,K26)","v":1195937.0899999999},{"$f":"SUM(L10,L17,L22,L26)","v":1500000.87}]

{"sheet":"CPU-SERV","index":1,"n_rows":611,"n_cols":12,"rows_kept":611,"cut":false,"hidden":false,"merged":[[163,0,208,0],[164,2,164,9],[164,11,164,12],[165,1,166,3],[165,4,165,5],[165,10,165,11],[166,4,166,5],[167,2,167,7],[167,8,167,9],[168,1,169,2],[168,3,169,3],[168,4,168,5],[168,6,168,7],[173,7,173,9],[176,3,176,7],[177,3,177,7],[178,3,178,7],[181,7,181,9],[184,3,184,7],[185,7,185,9],[196,3,196,7],[198,8,198,9],[201,3,201,7],[22,7,22,9],[25,3,25,7],[202,1,203,2],[333,0,373,0],[376,2,376,9],[375,0,414,0],[396,7,396,8],[361,3,361,7],[363,8,363,9],[366,3,366,7],[367,1,368,2],[367,3,368,3],[367,4,368,4],[367,5,367,7],[367,9,368,9],[371,3,371,7],[338,4,338,5],[338,6,338,7],[347,7,347,9],[349,3,349,7],[350,3,350,7],[351,3,351,7],[354,7,354,9],[357,3,357,7],[13,3,13,7],[14,3,14,7],[15,3,15,7],[15,11,15,13],[18,7,18,9],[21,3,21,7],[5,1,6,2],[5,3,6,3],[5,4,5,5],[5,6,5,7],[7,13,7,15],[10,7,10,9],[0,11,0,12],[1,2,1,9],[1,11,1,12],[2,1,3,3],[2,4,2,5],[2,10,2,11],[3,4,3,5],[4,2,4,7],[4,8,4,9],[27,8,27,9],[30,3,30,7],[31,1,32,2],[31,3,32,3],[31,4,32,4],[31,5,31,7],[31,9,32,9],[44,3,45,3],[44,4,44,5],[44,6,44,7],[49,7,49,9],[55,3,55,7],[56,3,56,7],[35,3,35,7],[36,5,36,7],[39,0,81,0],[40,2,40,9],[41,1,42,3],[41,4,41,5],[42,4,42,5],[43,2,43,7],[43,8,43,9],[44,1,45,2],[0,0,37,0],[74,3,74,7],[75,1,76,2],[75,3,76,3],[75,4,76,4],[75,5,75,7],[75,9,76,9],[57,3,57,7],[60,7,60,9],[63,3,63,7],[64,7,64,9],[69,3,69,7],[71,8,71,9],[88,3,89,3],[88,4,88,5],[88,6,88,7],[93,7,93,9],[96,3,96,7],[97,3,97,7],[79,3,79,7],[80,5,80,7],[83,0,120,0],[84,2,84,9],[85,1,86,3],[85,4,85,5],[86,4,86,5],[87,2,87,7],[87,8,87,9],[88,1,89,2],[113,3,113,7],[114,1,115,2],[114,3,115,3],[114,4,115,4],[114,5,114,7],[114,9,115,9],[98,3,98,7],[101,7,101,9],[104,3,104,7],[105,7,105,9],[108,3,108,7],[110,8,110,9],[127,3,128,3],[127,4,127,5],[127,6,127,7],[132,7,132,9],[135,3,135,7],[136,3,136,7],[118,3,118,7],[119,5,119,7],[122,0,161,0],[123,2,123,9],[124,1,125,3],[124,4,124,5],[125,4,125,5],[126,2,126,7],[126,8,126,9],[127,1,128,2],[154,3,154,7],[155,1,156,2],[155,3,156,3],[155,4,156,4],[155,5,155,7],[155,9,156,9],[137,3,137,7],[140,7,140,9],[145,3,145,7],[146,7,146,9],[149,3,149,7],[151,8,151,9],[215,3,216,3],[215,4,215,5],[215,6,215,7],[220,7,220,9],[225,3,225,7],[202,3,203,3],[202,4,203,4],[202,5,202,7],[202,9,203,9],[206,3,206,7],[207,5,207,7],[226,3,226,7],[159,3,159,7],[160,5,160,7],[210,0,249,0],[211,2,211,9],[212,1,213,3],[212,4,212,5],[213,4,213,5],[214,2,214,7],[214,8,214,9],[215,1,216,2],[247,3,247,7],[248,5,248,7],[242,3,242,7],[243,1,244,2],[243,3,244,3],[243,4,244,4],[243,5,243,7],[243,9,244,9],[227,3,227,7],[230,7,230,9],[233,3,233,7],[234,7,234,9],[237,3,237,7],[239,8,239,9],[256,3,257,3],[256,4,256,5],[256,6,256,7],[261,7,261,9],[264,3,264,7],[265,3,265,7],[251,0,288,0],[252,2,252,9],[253,1,254,3],[253,4,253,5],[254,4,254,5],[255,2,255,7],[255,8,255,9],[256,1,257,2],[281,3,281,7],[282,1,283,2],[282,3,283,3],[282,4,283,4],[282,5,282,7],[282,9,283,9],[266,3,266,7],[269,7,269,9],[272,3,272,7],[273,7,273,9],[276,3,276,7],[278,8,278,9],[295,3,296,3],[295,4,295,5],[295,6,295,7],[304,7,304,9],[307,3,307,7],[308,3,308,7],[286,3,286,7],[287,5,287,7],[290,0,331,0],[291,2,291,9],[292,1,293,3],[292,4,292,5],[293,4,293,5],[294,2,294,7],[294,8,294,9],[295,1,296,2],[324,3,324,7],[325,1,326,2],[325,3,326,3],[325,4,326,4],[325,5,325,7],[325,9,326,9],[309,3,309,7],[312,7,312,9],[315,3,315,7],[316,7,316,9],[319,3,319,7],[321,8,321,9],[380,6,380,7],[385,7,385,9],[388,3,388,7],[389,3,389,7],[329,3,329,7],[330,5,330,7],[377,1,378,3],[377,4,377,5],[378,4,378,5],[379,2,379,7],[379,8,379,9],[380,1,381,2],[334,2,334,9],[335,1,336,3],[335,4,335,5],[336,4,336,5],[337,2,337,7],[337,8,337,9],[338,1,339,2],[338,3,339,3],[372,5,372,7],[380,4,380,5],[358,7,358,9],[380,3,381,3],[411,3,411,7],[412,5,412,7],[406,3,406,7],[407,1,408,2],[407,3,408,3],[407,4,408,4],[407,5,407,7],[407,9,408,9],[390,3,390,7],[393,7,393,9],[397,3,397,7],[398,7,398,9],[401,3,401,7],[403,8,403,9],[394,7,394,8],[395,7,395,8],[420,3,421,3],[420,4,420,5],[420,6,420,7],[425,7,425,9],[428,3,428,7],[429,3,429,7],[415,0,452,0],[416,2,416,9],[417,1,418,3],[417,4,417,5],[418,4,418,5],[419,2,419,7],[419,8,419,9],[420,1,421,2],[445,3,445,7],[446,1,447,2],[446,3,447,3],[446,4,447,4],[446,5,446,7],[446,9,447,9],[430,3,430,7],[433,7,433,9],[436,3,436,7],[437,7,437,9],[440,3,440,7],[442,8,442,9],[459,3,460,3],[459,4,459,5],[459,6,459,7],[464,7,464,9],[467,3,467,7],[468,3,468,7],[450,3,450,7],[451,5,451,7],[458,8,458,9],[459,1,460,2],[484,3,484,7],[485,1,486,2],[485,3,486,3],[485,4,486,4],[485,5,485,7],[485,9,486,9],[469,3,469,7],[472,7,472,9],[475,3,475,7],[476,7,476,9],[479,3,479,7],[481,8,481,9],[489,3,489,7],[490,5,490,7],[493,0,530,0],[494,2,494,9],[495,1,496,3],[495,4,495,5],[496,4,496,5],[497,2,497,7],[497,8,497,9],[498,1,499,2],[523,3,523,7],[524,1,525,2],[524,3,525,3],[524,4,525,4],[524,5,524,7],[524,9,525,9],[508,3,508,7],[511,7,511,9],[454,0,491,0],[455,2,455,9],[456,1,457,3],[456,4,456,5],[457,4,457,5],[458,2,458,7],[528,3,528,7],[529,5,529,7],[514,3,514,7],[515,7,515,9],[518,3,518,7],[520,8,520,9],[498,3,499,3],[498,4,498,5],[498,6,498,7],[503,7,503,9],[506,3,506,7],[507,3,507,7],[532,0,569,0],[533,2,533,9],[534,1,535,3],[534,4,534,5],[535,4,535,5],[536,2,536,7],[536,8,536,9],[537,1,538,2],[562,3,562,7],[563,1,564,2],[563,3,564,3],[563,4,564,4],[563,5,563,7],[563,9,564,9],[547,3,547,7],[550,7,550,9],[553,3,553,7],[537,6,537,7],[542,7,542,9],[545,3,545,7],[546,3,546,7],[567,3,567,7],[568,5,568,7],[551,7,551,8],[552,7,552,8],[554,7,554,9],[557,3,557,7],[559,8,559,9],[571,0,610,0],[572,2,572,9],[573,1,574,3],[573,4,573,5],[574,4,574,5],[575,2,575,7],[575,8,575,9],[576,1,577,2],[608,3,608,7],[609,5,609,7],[603,3,603,7],[604,1,605,2],[604,3,605,3],[604,4,605,4],[604,5,604,7],[604,9,605,9],[598,3,598,7],[600,8,600,9],[589,7,589,9],[576,3,577,3],[576,4,576,5],[576,6,576,7],[41,10,41,11],[84,11,84,12],[85,10,85,11],[123,11,123,12],[124,10,124,11],[211,11,211,12],[40,11,40,12],[292,10,292,11],[373,11,373,12],[50,11,51,12],[377,10,377,11],[416,11,416,12],[417,10,417,11],[455,11,455,12],[212,10,212,11],[252,11,252,12],[253,10,253,11],[594,3,594,7],[595,7,595,9],[590,7,590,8],[581,7,581,9],[584,3,584,7],[585,3,585,7],[291,11,291,12],[534,10,534,11],[572,11,572,12],[573,10,573,11],[456,10,456,11],[494,11,494,12],[495,10,495,11],[533,11,533,12],[586,3,586,7],[537,3,538,3],[537,4,537,5]]}
[1,"1ª/GRD",{"$nulls":8},{"$f":"J37","v":11625.22},"Minas Gerais"]
[null,"OBRA:"," PAVIMENTAÇÃO EM BLOQUETE SEXTAVADOS - RUAS DIVERSAS DO MUNICÍPIO DE MATA VERDE / MG",{"$nulls":8}," Janeiro/2026"]
[null,"Custo Unitário de Referência",null,null,"Minas Gerais"]
[{"$nulls":4}," Janeiro/2026",null,null,"Produção da equipe ",0.5,{"$f":"VLOOKUP(A1,ORÇAMENTO!$A$10:$L$56,7,1)","v":"GL"}]
[null,"CPU.1","MOBILIZAÇÃO E DESMOBILIZAÇÃO",{"$nulls":5},"Valores em reais (R$)"]
[null,"A - EQUIPAMENTOS",null,"Quantidade","Utilização",null,"Custo Horário",null,null,"Custo"]
[{"$nulls":4},"Operativa","Improdutiva","Produtivo","Improdutivo",null,"Horário Total"]
[null,"E9687","Caminhão carroceria com capacidade de 5 t - 120 kW",8,0.6,0.4,172.44059999999999,68.639300000000006,null,{"$f":"D8*(E8*G8+F8*H8)","v":1047.3606399999999}]
[null,"E9575","Caminhão basculante com caçamba estanque com capacidade de 14 m³ - 210 kW",8,1,0,323.19150000000002,97.611199999999997,null,{"$f":"D9*(E9*G9+F9*H9)","v":2585.5320000000002}]
[{"$nulls":7},"Custo horário total de equipamentos",null,{"$f":"SUM(J8:J9)","v":3632.89264}]
[null,"B - MÃO DE OBRA",null,"Quantidade","Unidade",null,"Custo Horário","Custo Horário Total"]
[null,"P9824","Servente",8,"h",null,21.684899999999999,null,null,{"$f":"D12*G12","v":173.47919999999999}]
[{"$nulls":9},{"$f":"D13*G13","v":0}]
[null,null,null,"Custo horário total de mão de obra",{"$nulls":5},{"$f":"SUM(J12:J13)","v":173.47919999999999}]
[null,null,null,"Custo horário total de execução",{"$nulls":5},{"$f":"J10+J14","v":3806.3718399999998}]
[null,null,null,"Custo unitário de execução",{"$nulls":5},{"$f":"J15/I4","v":7612.7436799999996}]
[{"$nulls":7},"Custo do FIC",null,0]
[{"$nulls":7},"Custo do FIT",null,0]
[null,"C - MATERIAL",null,"Quantidade","Unidade",null,"Preço Unitário","Custo Unitário"]
[null,"-","-",null,"-",null,0,null,null,{"$f":"D20*G20","v":0}]
[null,"-","-",null,"-",null,0,null,null,{"$f":"D21*G21","v":0}]
[null,null,null,"Custo unitário total de material",{"$nulls":5},{"$f":"SUM(J20:J21)","v":0}]
[null,"D - ATIVIDADES AUXILIARES",null,"Quantidade","Unidade",null,"Custo Unitário","Custo Unitário"]
[null,5914640,"Transporte com cavalo mecânico com semirreboque com capacidade de 32 t - rodovia pavimentada",6800.8220000000001,"tkm",null,0.59,null,null,{"$f":"D24*G24","v":4012.4849799999997}]
[null,"-","-",0,"-",null,0,null,null,{"$f":"D25*G25","v":0}]
[null,null,null,"Custo total de atividades auxiliares",{"$nulls":5},{"$f":"SUM(J24:J25)","v":4012.4849799999997}]
[{"$nulls":7},"Subtotal",null,{"$f":"J16+J22+J26+J17+J18","v":11625.228659999999}]
[null,"E - TEMPO FIXO",null,"Código","Quantidade","Unidade",null,"Custo Unitário","Custo Unitário"]
[null,"-","-","-",null,"-",null,0,null,{"$f":"ROUNDDOWN(E29*H29,4)","v":0}]
[null,"-","-","-",null,"-",null,0,null,{"$f":"ROUNDDOWN(E30*H30,4)","v":0}]
[null,null,null,"Custo unitário total de tempo fixo",{"$nulls":5},{"$f":"SUM(J29:J30)","v":0}]
[null,"F - MOMENTO DE TRANSPORTE",null,"Quantidade","Unidade","DMT",null,null,null,"Custo Unitário"]
[{"$nulls":5},"LN","RP","P"]
[null,"-","-",null,"tkm"]
[null,"-","-",null,"tkm"]
[null,null,null,"Custo unitário total de transporte"]
[{"$nulls":5},"Custo unitário direto total",null,null,null,{"$f":"TRUNC(J27+J31,2)","v":11625.22}]
[null,"Obs."]
[]
[2,"1ª/GRD",{"$nulls":8},{"$f":"J81","v":79158.720000000001}]
{"$rows_left_out":572}
{"sheet":"AUX-VEIC.","index":2,"n_rows":31,"n_cols":5,"rows_kept":31,"cut":false,"hidden":false,"merged":[[26,2,26,3],[27,2,27,3],[28,2,28,3],[29,1,30,1],[29,2,29,3],[30,2,30,3],[25,2,25,3],[1,1,1,4],[2,1,2,2],[3,1,3,4],[17,1,17,4],[18,2,18,3],[19,2,19,3],[20,2,20,3],[21,2,21,3],[22,2,22,3],[23,2,23,3],[24,2,24,3]]}
[]
[null,"CÁLCULO DO CUSTO POR MÊS DE VEÍCULOS"]
[null,"Veículo: Polo TSI, Onix Turbo, Argo 1.3, HB-20 Turbo",null,"Data:","2026-01-20"]
[null,"DADOS ELEMENTARES DO VEÍCULO"]
[null,"Dados Básicos","Preço (R$)","Quantidade","Vida Útil"]
[null,"Quilometragem média mensal",null,3000]
[null,"Valor de Aquisição (VA)",108890]
[null,"Taxa de Juros (i)%",null,15]
[null,"IPVA e Seguro Obrigatório (4%)",4355.6000000000004]
[null,"Lavagem",50,2]
[null,"Pneus",499.9,4,50000]
[null,"Combustível",6.18,14]
[null,"Óleo Lubrificante + Filtros (revisão)",846.74400000000003,1,10000]
[null,"Seguro Total Anual",3378.94]
[null,"Jogo de Amortecedores",1246.5,null,50000]
[null,"Coeficiente de Manutenção",null,4.7999999999999998E-6]
[null,"Motorista",3038.2740182832176,1]
[null,"CÁLCULO DO CUSTO POR MÊS"]
[null,"DEPRECIAÇÃO","D = (VA-0,60xVA) / 12 x 5",null,725.93333333333328]
[null,"JUROS","J = (VA-0,60xVA) x i / 12",null,544.45000000000005]
[null,"LICENCIAMENTO","L = (IPVA=SEG.OBRIG.)/12",null,362.97]
[null,"SEGURO TOTAL","ST = SEGURO ANUAL/12",null,281.58]
[null,"COMBUSTÍVEL","OD = (Comb./Consu)x Km.mês",null,1324.29]
[null,"ÓLEO LUBRIFICANTE","OL = ((Ol. X Quant)/Vida Útil)xKm.mês)",null,254.02]
[null,"LAVAGEM","LL = Preço Lavagem x Quantidade",null,100]
[null,"PNEUS","P = ((P. PneusxQuant)/Vida Útil)xkm.mês)",null,119.98]
[null,"AMORTECEDORES","AM = (P. Amort/Vida Útil)xkm.mês",null,74.790000000000006]
[null,"MANUTENÇÃO","M = (VA-VPxK)xkm.mês",null,627.21]
[null,"MOTORISTA","MOT = SALÁRIO+LEIS SOCIAIS",null,5276.87]
[null,"CUSTO POR MÊS","SEM MOTORISTA",null,4415.2233333333334]
[null,null,"COM MOTORISTA",null,9692.0933333333342]

{"sheet":"BDI SERV","index":3,"n_rows":60,"n_cols":5,"rows_kept":60,"cut":false,"hidden":false,"merged":[[36,0,36,5],[38,1,38,4],[39,2,39,3],[35,0,35,5],[0,1,2,4],[25,1,25,3],[26,1,26,2],[26,3,26,4],[27,3,27,4]]}
[null,"DETALHAMENTO DO BDI - SERVIÇOS"]
[]
[]
[null,"Item","Descrição dos Serviços","% - PV","% - CD"]
[]
[null,1,"ADMINISTRAÇÃO CENTRAL"," ",{"$f":"SUM(E7:E9)","v":4.01}]
[null,"1.1","ESCRITÓRIO CENTRAL",null,4.01]
[null,"1.2","VIAGENS"]
[null,"1.3","OUTROS"]
[null," "," "," "," "]
[null,2,"IMPOSTOS E TAXAS",{"$f":"SUM(D12:D15)","v":8.65},{"$f":"SUM(E12:E15)","v":0}]
[null,"2.1","ISS - Proposta",{"$f":"D34*100","v":5}]
[null,"2.2","PIS",0.65]
[null,"2.3","Cofins",3]
[null,"2.4","Contribuição Previdenciaria (CPRB)"]
[]
[null,3,"TAXA DE RISCO",null,{"$f":"SUM(E18:E20)","v":0.96}]
[null,"3.1","SEGURO",null,0.2]
[null,"3.2","RISCO",null,0.56000000000000005]
[null,"3.3","GARANTIA",null,0.2]
[]
[null,4,"DESPESAS FINANCEIRAS",null,1.1100000000000001]
[]
[null,5,"LUCRO",null,8]
[]
[null,"BDI APRESENTADO:",null,null,{"$f":"IF($D$41=$C$43,$D$43,IF($D$41=$C$44,$D$44,IF($D$41=$C$44,$D$44,IF($D$41=$C$45,$D$45,0))))","v":25.48}]
[]
[null,null,"Legislação Municipal:","Lei nº 087/95"]
[null,null,"Município:","Mata Verde"]
[null,null,"Alíquota ISSQN:",0.05,"Município"]
[null,null,"Base de Cálculo:",1,"Mata Verde"]
[null,null,"Valor Serviço:",1195937.0900000001]
[null,null,"Dedução - Material (estimado):",null,{"$f":"D33/D32","v":0}]
[null,null,"ISSQN BDI:",{"$f":"IF(D32=\"\",0,ROUND(IF(D31=D49,((1-(D33/D32))*D30),D30*D31),4))","v":0.05},"(*)"]
[]
["Acórdão nº 2.622/2013 - TCU Plenário"]
["BDI = ARRED((((((1+(AC+TR)/100)*(1+DF/100)*(1+L/100))/(1-IMP/100))-1)*100);2)"]
[]
[null,"(*) É obrigação da licitante a verificação da Legislação Tributária vigente no município, bem como o cálculo dos valores totais de serviços e materiais estimados, para apresentação de sua proposta."]
[]
{"$rows_left_out":21}
{"sheet":"CRONOGRAMA","index":4,"n_rows":17,"n_cols":12,"rows_kept":17,"cut":false,"hidden":false,"merged":[[13,1,14,2],[16,1,20,11],[7,2,8,2],[9,2,10,2],[11,2,12,2],[7,1,8,1],[9,1,10,1],[11,1,12,1],[7,0,8,0],[9,0,10,0],[11,0,12,0],[0,1,0,11],[1,6,1,11],[2,6,2,11],[3,1,3,6],[5,0,6,0],[5,2,6,2],[1,1,2,1],[5,1,6,1],[1,2,2,4]]}
[null,"CRONOGRAMA FÍSICO-FINANCEIRO"]
[null,"OBRA: ",{"$f":"ORÇAMENTO!C5","v":" PAVIMENTAÇÃO EM BLOQUETE SEXTAVADOS - RUAS DIVERSAS DO MUNICÍPIO DE MATA VERDE / MG"},null,null,"VALOR:",{"$f":"ORÇAMENTO!L29","v":1500000.87}]
[{"$nulls":5},"PRAZO: ","180 DIAS "]
[]
[null,"ITEM","ETAPAS/DESCRIÇAO","FISICO/  FINANCEIRO","TOTAL    ETAPAS","MÊS 1","MÊS 2","MÊS 3","MÊS 4","MÊS 5","MÊS 6","TOTAL"]
["A",{"$f":"VLOOKUP(A6,ORÇAMENTO!$A$10:$L$29,2)","v":1},{"$f":"VLOOKUP(A6,ORÇAMENTO!$A$10:$L$29,5)","v":"SERVIÇOS PRELIMINARES "},"FISICO ",{"$f":"ROUND(E7/$G$2,4)","v":0.1222},0.2,0.2,0.15,0.15,0.15,0.15,{"$f":"SUM(F6:K6)","v":1}]
[null,null,null,"FINANCEIRO",{"$f":"ORÇAMENTO!L10","v":183251.37},{"$f":"ROUND($E$7*F6,2)","v":36650.269999999997},{"$f":"ROUND($E$7*G6,2)","v":36650.269999999997},{"$f":"ROUND($E$7*H6,2)","v":27487.71},{"$f":"ROUND($E$7*I6,2)","v":27487.71},{"$f":"ROUND($E$7*J6,2)","v":27487.71},27487.71,183251.37999999998]
["B",{"$f":"VLOOKUP(A8,ORÇAMENTO!$A$10:$L$29,2)","v":2},{"$f":"VLOOKUP(A8,ORÇAMENTO!$A$10:$L$29,5)","v":"TERRAPLANAGEM E PAVIMENTAÇÃO"},"FISICO ",{"$f":"ROUND(E9/$G$2,4)","v":0.52829999999999999},0.2,0.2,0.2,0.15,0.15,0.1,1.0000000000000002]
[null,null,null,"FINANCEIRO",{"$f":"ORÇAMENTO!L17","v":792393.5},{"$f":"ROUND($E$9*F8,2)","v":158478.70000000001},{"$f":"ROUND($E$9*G8,2)","v":158478.70000000001},{"$f":"ROUND($E$9*H8,2)","v":158478.70000000001},{"$f":"ROUND($E$9*I8,2)","v":118859.03},{"$f":"ROUND($E$9*J8,2)","v":118859.03},79239.350000000006,792393.51]
["C",{"$f":"VLOOKUP(A10,ORÇAMENTO!$A$10:$L$29,2)","v":3},{"$f":"VLOOKUP(A10,ORÇAMENTO!$A$10:$L$29,5)","v":"TRANSPORTE DE MATERIAIS"},"FISICO ",{"$f":"ROUND(E11/$G$2,4)","v":0.14799999999999999},0.15,0.15,0.2,0.2,0.15,0.15,1]
[null,null,null,"FINANCEIRO",{"$f":"ORÇAMENTO!L22","v":221945},{"$f":"ROUND($E$11*F10,2)","v":33291.75},{"$f":"ROUND($E$11*G10,2)","v":33291.75},{"$f":"ROUND($E$11*H10,2)","v":44389},{"$f":"ROUND($E$11*I10,2)","v":44389},{"$f":"ROUND($E$11*J10,2)","v":33291.75},33291.75,221945]
["D",{"$f":"VLOOKUP(A12,ORÇAMENTO!$A$10:$L$29,2)","v":4},{"$f":"VLOOKUP(A12,ORÇAMENTO!$A$10:$L$29,5)","v":"DRENAGEM E OBRAS COMPLEMENTARES"},"FISICO ",{"$f":"ROUND(E13/$G$2,4)","v":0.2016},0.1,0.1,0.2,0.2,0.2,0.2,1]
[null,null,null,"FINANCEIRO",{"$f":"ORÇAMENTO!L26","v":302411},{"$f":"ROUND($E$13*F12,2)","v":30241.1},{"$f":"ROUND($E$13*G12,2)","v":30241.1},{"$f":"ROUND($E$13*H12,2)","v":60482.2},{"$f":"ROUND($E$13*I12,2)","v":60482.2},{"$f":"ROUND($E$13*J12,2)","v":60482.2},60482.2,302411]
[null,"TOTAL",null,"FISICO ",{"$f":"SUM(F14:H14)","v":0.53877385417783119},{"$f":"F15/E15","v":0.1724411133174876},{"$f":"G15/$E$15","v":0.1724411133174876},{"$f":"H15/$E$15","v":0.19389162754285599},{"$f":"I15/$E$15","v":0.16747852952911954},{"$f":"J15/$E$15","v":0.16008036715338705},0.13366726247298777,1.0000000133333256]
[null,null,null,"FINANCEIRO",{"$f":"E11+E9+E7+E13","v":1500000.87},{"$f":"F11+F9+F7+F13","v":258661.82},{"$f":"G11+G9+G7+G13","v":258661.82},{"$f":"H11+H9+H7+H13","v":290837.61},{"$f":"I11+I9+I7+I13","v":251217.94},{"$f":"J11+J9+J7+J13","v":240120.69},200501.01,{"$f":"ROUNDUP(SUM(F15:K15),2)-0.02","v":1500000.8699999999}]
[]
[null,"OBSERVAÇÕES:"]