{"text_format":"2","workbook":"xlsx","n_sheets":5,"sheets":["ORÇAMENTO","CPU-SERV","AUX-VEIC.","BDI SERV","CRONOGRAMA"],"not_rendered":{"charts":0,"images":3,"macros":0,"external_links":0,"defined_names":5,"comments":2,"pivot_tables":0},"unopened":[],"bounds":{"document_bytes":16777216,"sheet_cells":100000,"run_cost":"one","rows_first":2000,"rows_last":500,"rows_between":2000,"halvings":0,"cell_chars":16384,"cell_head_chars":4096},"cells_cut":0,"cells_raw":0,"read":"whole","date_system":"1900"}

{"sheet":"ORÇAMENTO","index":0,"n_rows":29,"n_cols":12,"rows_kept":29,"cut":false,"hidden":false,"merged":[[9,17,10,17],[8,13,9,13],[28,1,28,4],[0,0,8,0],[0,4,0,11],[1,4,1,11],[2,4,2,11],[7,1,7,11],[4,2,4,7],[5,2,5,7],[4,8,4,10],[5,8,5,10],[6,8,6,10],[6,1,6,4]]}
["<---- NUMERAR SERVIÇOS PARA CPU",null,null,null,"Ministério do Desenvolvimento Regional"]
[{"$nulls":4},"Companhia de Desenvolvimento dos Vales do São Francisco e do Parnaíba"]
[{"$nulls":4},"1ª Superintendência Regional"]
[]
[null,"OBRA: "," PAVIMENTAÇÃO EM BLOQUETE SEXTAVADOS - RUAS DIVERSAS DO MUNICÍPIO DE MATA VERDE / MG",{"$nulls":5},"BDI Serviços (%):",null,null,{"$f":"'BDI SERV'!E26","v":25.48}]
[null,"DATA:"," JANEIRO/2026",{"$nulls":5},"BDI Diferenciado Serviços (%):",null,null,15]
[null,"PRAZO DE EXECUÇÃO:    180 DIAS",{"$nulls":6},"BDI Fornecimentos (%):",null,null,15]
[null,"PLANILHA DE ORÇAMENTAÇÃO"]
[null,"ITEM","CÓDIGO","FONTE","DISCRIMINAÇÃO","TIPO","UNID.","QUANT.","VR.UNIT.S/BDI","PR. UNIT.C/BDI","C. TOT.S/BDI","P. TOT.C/BDI"]
["A",1,null,null,"SERVIÇOS PRELIMINARES ",{"$nulls":5},{"$f":"SUM(K11:K16)","v":146058.09},{"$f":"SUM(L11:L16)","v":183251.37}]
[1,"1.1","CPU.1","CODEVASF","MOBILIZAÇÃO E DESMOBILIZAÇÃO","SERV","GL",1,{"$f":"VLOOKUP(A11,'CPU-SERV'!A:K,11,0)","v":11625.22},{"$f":"TRUNC(_xlfn.IFS(F11=\"SERV\",I11*(1+$L$5/100),F11=\"SERV DIF\",I11*(1+$L$6/100),F11=\"FORN\",I11*(1+$L$7/100)),2)","v":14587.32},{"$f":"TRUNC(H11*I11,2)","v":11625.22},{"$f":"TRUNC(H11*J11,2)","v":14587.32}]
[2,"1.2","CPU.2","CODEVASF","ADMINISTRAÇÃO LOCAL","SERV","GL",1,{"$f":"VLOOKUP(A12,'CPU-SERV'!A:K,11,0)","v":79158.720000000001},{"$f":"TRUNC(_xlfn.IFS(F12=\"SERV\",I12*(1+$L$5/100),F12=\"SERV DIF\",I12*(1+$L$6/100),F12=\"FORN\",I12*(1+$L$7/100)),2)","v":99328.36},{"$f":"TRUNC(H12*I12,2)","v":79158.720000000001},{"$f":"TRUNC(H12*J12,2)","v":99328.36}]
[3,"1.3","CPU.3","CODEVASF","CANTEIRO DE OBRAS","SERV","GL",1,{"$f":"VLOOKUP(A13,'CPU-SERV'!A:K,11,0)","v":14208.65},{"$f":"TRUNC(_xlfn.IFS(F13=\"SERV\",I13*(1+$L$5/100),F13=\"SERV DIF\",I13*(1+$L$6/100),F13=\"FORN\",I13*(1+$L$7/100)),2)","v":17829.009999999998},14208.65,17829.009999999998]
[4,"1.4",103689,"SINAPI","PLACA DE OBRA EM CHAPA DE AÇO GALVANIZADO","SERV","M2",2,{"$f":"VLOOKUP(A14,'CPU-SERV'!A:K,11,0)","v":555.87},{"$f":"TRUNC(_xlfn.IFS(F14=\"SERV\",I14*(1+$L$5/100),F14=\"SERV DIF\",I14*(1+$L$6/100),F14=\"FORN\",I14*(1+$L$7/100)),2)","v":697.5},1111.74,1395]
[5,"1.5","CPU.4","CODEVASF","VEÍCULO PARA A FISCALIZAÇÃO, MÁXIMO 02 ANOS DE USO OU 50.000KM, PREFERENCIALMENTE NA COR BRANCA, COM IDENTIFICAÇÃO CONFORME ESPECIFICAÇÕES DA CODEVASF, INCLUSIVE COMBUSTÍVEL, MANUTENÇÃO, SEGURO E IMPOSTOS - CONFORME ESPECIFICAÇÕES","SERV","MÊS",8,{"$f":"VLOOKUP(A15,'CPU-SERV'!A:K,11,0)","v":4415.22},{"$f":"TRUNC(_xlfn.IFS(F15=\"SERV\",I15*(1+$L$5/100),F15=\"SERV DIF\",I15*(1+$L$6/100),F15=\"FORN\",I15*(1+$L$7/100)),2)","v":5540.21},{"$f":"TRUNC(H15*I15,2)","v":35321.760000000002},{"$f":"TRUNC(H15*J15,2)","v":44321.68}]
[6,"1.6",78472,"SINAPI","SERVIÇOS TOPOGRÁFICOS PARA PAVIMENTAÇÃO, INCLUSIVE LEVANTAMENTO PLANIALTIMÉTRICO CADASTRAL, GERAÇÃO DE NOTAS DE SERVIÇO, SEÇÕES TRANSVERSAIS E GREIDE, ESTAQUEAMENTO E ACOMPANHAMENTO EXECUTIVO","SERV","M2",9650,{"$f":"VLOOKUP(A16,'CPU-SERV'!A:K,11,0)","v":0.48},{"$f":"TRUNC(_xlfn.IFS(F16=\"SERV\",I16*(1+$L$5/100),F16=\"SERV DIF\",I16*(1+$L$6/100),F16=\"FORN\",I16*(1+$L$7/100)),2)","v":0.6},4632,5790]
["B",2,null,null,"TERRAPLANAGEM E PAVIMENTAÇÃO",{"$nulls":5},{"$f":"SUM(K18:K21)","v":631607.5},{"$f":"SUM(L18:L21)","v":792393.5}]
[7,"2.1",5502114,"SICRO","ESCAVAÇÃO, CARGA E TRANSPORTE DE MATERIAL DE 1ª CATEGORIA - DMT 1.000 A 1.200M, CAMINHO DE SERVIÇO EM REVESTIMENTO PRIMÁRIO","SERV","M3",1450,{"$f":"VLOOKUP(A18,'CPU-SERV'!A:K,11,0)","v":8.65},{"$f":"TRUNC(_xlfn.IFS(F18=\"SERV\",I18*(1+$L$5/100),F18=\"SERV DIF\",I18*(1+$L$6/100),F18=\"FORN\",I18*(1+$L$7/100)),2)","v":10.85},{"$f":"TRUNC(H18*I18,2)","v":12542.5},{"$f":"TRUNC(H18*J18,2)","v":15732.5}]
[8,"2.2",4011209,"SICRO","REGULARIZAÇÃO DO SUBLEITO - 100% PROCTOR INTERMEDIÁRIO","SERV","M2",9650,{"$f":"VLOOKUP(A19,'CPU-SERV'!A:K,11,0)","v":1.88},{"$f":"TRUNC(_xlfn.IFS(F19=\"SERV\",I19*(1+$L$5/100),F19=\"SERV DIF\",I19*(1+$L$6/100),F19=\"FORN\",I19*(1+$L$7/100)),2)","v":2.35},18142,22677.5]
[9,"2.3",4011219,"SICRO","BASE DE SOLO ESTABILIZADA GRANULOMETRICAMENTE SEM MISTURA COM MATERIAL DE JAZIDA - 100% PROCTOR MODIFICADO","SERV","M3",1450,{"$f":"VLOOKUP(A20,'CPU-SERV'!A:K,11,0)","v":17.2},{"$f":"TRUNC(_xlfn.IFS(F20=\"SERV\",I20*(1+$L$5/100),F20=\"SERV DIF\",I20*(1+$L$6/100),F20=\"FORN\",I20*(1+$L$7/100)),2)","v":21.58},{"$f":"TRUNC(H20*I20,2)","v":24940},{"$f":"TRUNC(H20*J20,2)","v":31291}]
[10,"2.4",92394,"SINAPI","EXECUÇÃO DE PAVIMENTO EM PISO INTERTRAVADO, COM BLOCO SEXTAVADO DE CONCRETO DE 25 X 25 CM, ESPESSURA 8 CM","SERV","M2",8350,{"$f":"VLOOKUP(A21,'CPU-SERV'!A:K,11,0)","v":68.98},{"$f":"TRUNC(_xlfn.IFS(F21=\"SERV\",I21*(1+$L$5/100),F21=\"SERV DIF\",I21*(1+$L$6/100),F21=\"FORN\",I21*(1+$L$7/100)),2)","v":86.55},575983,722692.5]
["C",3,null,null,"TRANSPORTE DE MATERIAIS",{"$nulls":5},{"$f":"SUM(K23:K25)","v":177245},{"$f":"SUM(L23:L25)","v":221945}]
[15,"3.1",5915321,"SICRO","TRANSPORTE COM CAMINHÃO BASCULANTE, EM VIA URBANA PAVIMENTADA","SERV","TXKM",58500,{"$f":"VLOOKUP(A23,'CPU-SERV'!A:K,11,0)","v":0.68},{"$f":"TRUNC(_xlfn.IFS(F23=\"SERV\",I23*(1+$L$5/100),F23=\"SERV DIF\",I23*(1+$L$6/100),F23=\"FORN\",I23*(1+$L$7/100)),2)","v":0.85},{"$f":"TRUNC(H23*I23,2)","v":39780},{"$f":"TRUNC(H23*J23,2)","v":49725}]
[16,"3.2",5915320,"SICRO","TRANSPORTE COM CAMINHÃO BASCULANTE, EM VIA COM REVESTIMENTO PRIMÁRIO","SERV","TXKM",3500,{"$f":"VLOOKUP(A24,'CPU-SERV'!A:K,11,0)","v":0.74},{"$f":"TRUNC(_xlfn.IFS(F24=\"SERV\",I24*(1+$L$5/100),F24=\"SERV DIF\",I24*(1+$L$6/100),F24=\"FORN\",I24*(1+$L$7/100)),2)","v":0.92},2590,3220]
[17,"3.3",5914434,"SICRO","TRANSPORTE COM CAMINHÃO CARROCERIA, EM VIA URBANA PAVIMENTADA","SERV","TXKM",162500,{"$f":"VLOOKUP(A25,'CPU-SERV'!A:K,11,0)","v":0.83},{"$f":"TRUNC(_xlfn.IFS(F25=\"SERV\",I25*(1+$L$5/100),F25=\"SERV DIF\",I25*(1+$L$6/100),F25=\"FORN\",I25*(1+$L$7/100)),2)","v":1.04},134875,169000]
["D",4,null,null,"DRENAGEM E OBRAS COMPLEMENTARES",{"$nulls":5},{"$f":"SUM(K27:K28)","v":241026.5},{"$f":"SUM(L27:L28)","v":302411}]
[20,"4.1",94273,"SINAPI","ASSENTAMENTO DE GUIA (MEIO-FIO) EM TRECHO RETO, CONFECCIONADA EM CONCRETO PRÉ-FABRICADO, DIMENSÕES 100X15X13X30 CM (COMPRIMENTO X BASE INFERIOR X BASE SUPERIOR X ALTURA). ","SERV","M",2950,{"$f":"VLOOKUP(A27,'CPU-SERV'!A:K,11,0)","v":50.18},{"$f":"TRUNC(_xlfn.IFS(F27=\"SERV\",I27*(1+$L$5/100),F27=\"SERV DIF\",I27*(1+$L$6/100),F27=\"FORN\",I27*(1+$L$7/100)),2)","v":62.96},{"$f":"TRUNC(H27*I27,2)","v":148031},{"$f":"TRUNC(H27*J27,2)","v":185732}]
[22,"4.2","94287a","SINAPI","EXECUÇÃO DE SARJETA DE CONCRETO USINADO, MOLDADA IN LOCO EM TRECHO RETO, 30 CM BASE X 5 CM ALTURA. ","SERV","M",2850,{"$f":"VLOOKUP(A28,'CPU-SERV'!A:K,11,0)","v":32.630000000000003},{"$f":"TRUNC(_xlfn.IFS(F28=\"SERV\",I28*(1+$L$5/100),F28=\"SERV DIF\",I28*(1+$L$6/100),F28=\"FORN\",I28*(1+$L$7/100)),2)","v":40.94},92995.5,116679]
[null,"TOTAL GERAL DA OBRA COM BDI ",{"$nulls":8},{"$f":"SUM(K10,K17,K22,K26)","v":1195937.0899999999},{"$f":"SUM(L10,L17,L22,L26)","v":1500000.87}]

{"sheet":"CPU-SERV","index":1,"n_rows":611,"n_cols":12,"rows_kept":611,"cut":false,"hidden":false,"merged":[[163,0,208,0],[164,2,164,9],[164,11,164,12],[165,1,166,3],[165,4,165,5],[165,10,165,11],[166,4,166,5],[167,2,167,7],[167,8,167,9],[168,1,169,2],[168,3,169,3],[168,4,168,5],[168,6,168,7],[173,7,173,9],[176,3,176,7],[177,3,177,7],[178,3,178,7],[181,7,181,9],[184,3,184,7],[185,7,185,9],[196,3,196,7],[198,8,198,9],[201,3,201,7],[22,7,22,9],[25,3,25,7],[202,1,203,2],[333,0,373,0],[376,2,376,9],[375,0,414,0],[396,7,396,8],[361,3,361,7],[363,8,363,9],[366,3,366,7],[367,1,368,2],[367,3,368,3],[367,4,368,4],[367,5,367,7],[367,9,368,9],[371,3,371,7],[338,4,338,5],[338,6,338,7],[347,7,347,9],[349,3,349,7],[350,3,350,7],[351,3,351,7],[354,7,354,9],[357,3,357,7],[13,3,13,7],[14,3,14,7],[15,3,15,7],[15,11,15,13],[18,7,18,9],[21,3,21,7],[5,1,6,2],[5,3,6,3],[5,4,5,5],[5,6,5,7],[7,13,7,15],[10,7,10,9],[0,11,0,12],[1,2,1,9],[1,11,1,12],[2,1,3,3],[2,4,2,5],[2,10,2,11],[3,4,3,5],[4,2,4,7],[4,8,4,9],[27,8,27,9],[30,3,30,7],[31,1,32,2],[31,3,32,3],[31,4,32,4],[31,5,31,7],[31,9,32,9],[44,3,45,3],[44,4,44,5],[44,6,44,7],[49,7,49,9],[55,3,55,7],[56,3,56,7],[35,3,35,7],[36,5,36,7],[39,0,81,0],[40,2,40,9],[41,1,42,3],[41,4,41,5],[42,4,42,5],[43,2,43,7],[43,8,43,9],[44,1,45,2],[0,0,37,0],[74,3,74,7],[75,1,76,2],[75,3,76,3],[75,4,76,4],[75,5,75,7],[75,9,76,9],[57,3,57,7],[60,7,60,9],[63,3,63,7],[64,7,64,9],[69,3,69,7],[71,8,71,9],[88,3,89,3],[88,4,88,5],[88,6,88,7],[93,7,93,9],[96,3,96,7],[97,3,97,7],[79,3,79,7],[80,5,80,7],[83,0,120,0],[84,2,84,9],[85,1,86,3],[85,4,85,5],[86,4,86,5],[87,2,87,7],[87,8,87,9],[88,1,89,2],[113,3,113,7],[114,1,115,2],[114,3,115,3],[114,4,115,4],[114,5,114,7],[114,9,115,9],[98,3,98,7],[101,7,101,9],[104,3,104,7],[105,7,105,9],[108,3,108,7],[110,8,110,9],[127,3,128,3],[127,4,127,5],[127,6,127,7],[132,7,132,9],[135,3,135,7],[136,3,136,7],[118,3,118,7],[119,5,119,7],[122,0,161,0],[123,2,123,9],[124,1,125,3],[124,4,124,5],[125,4,125,5],[126,2,126,7],[126,8,126,9],[127,1,128,2],[154,3,154,7],[155,1,156,2],[155,3,156,3],[155,4,156,4],[155,5,155,7],[155,9,156,9],[137,3,137,7],[140,7,140,9],[145,3,145,7],[146,7,146,9],[149,3,149,7],[151,8,151,9],[215,3,216,3],[215,4,215,5],[215,6,215,7],[220,7,220,9],[225,3,225,7],[202,3,203,3],[202,4,203,4],[202,5,202,7],[202,9,203,9],[206,3,206,7],[207,5,207,7],[226,3,226,7],[159,3,159,7],[160,5,160,7],[210,0,249,0],[211,2,211,9],[212,1,213,3],[212,4,212,5],[213,4,213,5],[214,2,214,7],[214,8,214,9],[215,1,216,2],[247,3,247,7],[248,5,248,7],[242,3,242,7],[243,1,244,2],[243,3,244,3],[243,4,244,4],[243,5,243,7],[243,9,244,9],[227,3,227,7],[230,7,230,9],[233,3,233,7],[234,7,234,9],[237,3,237,7],[239,8,239,9],[256,3,257,3],[256,4,256,5],[256,6,256,7],[261,7,261,9],[264,3,264,7],[265,3,265,7],[251,0,288,0],[252,2,252,9],[253,1,254,3],[253,4,253,5],[254,4,254,5],[255,2,255,7],[255,8,255,9],[256,1,257,2],[281,3,281,7],[282,1,283,2],[282,3,283,3],[282,4,283,4],[282,5,282,7],[282,9,283,9],[266,3,266,7],[269,7,269,9],[272,3,272,7],[273,7,273,9],[276,3,276,7],[278,8,278,9],[295,3,296,3],[295,4,295,5],[295,6,295,7],[304,7,304,9],[307,3,307,7],[308,3,308,7],[286,3,286,7],[287,5,287,7],[290,0,331,0],[291,2,291,9],[292,1,293,3],[292,4,292,5],[293,4,293,5],[294,2,294,7],[294,8,294,9],[295,1,296,2],[324,3,324,7],[325,1,326,2],[325,3,326,3],[325,4,326,4],[325,5,325,7],[325,9,326,9],[309,3,309,7],[312,7,312,9],[315,3,315,7],[316,7,316,9],[319,3,319,7],[321,8,321,9],[380,6,380,7],[385,7,385,9],[388,3,388,7],[389,3,389,7],[329,3,329,7],[330,5,330,7],[377,1,378,3],[377,4,377,5],[378,4,378,5],[379,2,379,7],[379,8,379,9],[380,1,381,2],[334,2,334,9],[335,1,336,3],[335,4,335,5],[336,4,336,5],[337,2,337,7],[337,8,337,9],[338,1,339,2],[338,3,339,3],[372,5,372,7],[380,4,380,5],[358,7,358,9],[380,3,381,3],[411,3,411,7],[412,5,412,7],[406,3,406,7],[407,1,408,2],[407,3,408,3],[407,4,408,4],[407,5,407,7],[407,9,408,9],[390,3,390,7],[393,7,393,9],[397,3,397,7],[398,7,398,9],[401,3,401,7],[403,8,403,9],[394,7,394,8],[395,7,395,8],[420,3,421,3],[420,4,420,5],[420,6,420,7],[425,7,425,9],[428,3,428,7],[429,3,429,7],[415,0,452,0],[416,2,416,9],[417,1,418,3],[417,4,417,5],[418,4,418,5],[419,2,419,7],[419,8,419,9],[420,1,421,2],[445,3,445,7],[446,1,447,2],[446,3,447,3],[446,4,447,4],[446,5,446,7],[446,9,447,9],[430,3,430,7],[433,7,433,9],[436,3,436,7],[437,7,437,9],[440,3,440,7],[442,8,442,9],[459,3,460,3],[459,4,459,5],[459,6,459,7],[464,7,464,9],[467,3,467,7],[468,3,468,7],[450,3,450,7],[451,5,451,7],[458,8,458,9],[459,1,460,2],[484,3,484,7],[485,1,486,2],[485,3,486,3],[485,4,486,4],[485,5,485,7],[485,9,486,9],[469,3,469,7],[472,7,472,9],[475,3,475,7],[476,7,476,9],[479,3,479,7],[481,8,481,9],[489,3,489,7],[490,5,490,7],[493,0,530,0],[494,2,494,9],[495,1,496,3],[495,4,495,5],[496,4,496,5],[497,2,497,7],[497,8,497,9],[498,1,499,2],[523,3,523,7],[524,1,525,2],[524,3,525,3],[524,4,525,4],[524,5,524,7],[524,9,525,9],[508,3,508,7],[511,7,511,9],[454,0,491,0],[455,2,455,9],[456,1,457,3],[456,4,456,5],[457,4,457,5],[458,2,458,7],[528,3,528,7],[529,5,529,7],[514,3,514,7],[515,7,515,9],[518,3,518,7],[520,8,520,9],[498,3,499,3],[498,4,498,5],[498,6,498,7],[503,7,503,9],[506,3,506,7],[507,3,507,7],[532,0,569,0],[533,2,533,9],[534,1,535,3],[534,4,534,5],[535,4,535,5],[536,2,536,7],[536,8,536,9],[537,1,538,2],[562,3,562,7],[563,1,564,2],[563,3,564,3],[563,4,564,4],[563,5,563,7],[563,9,564,9],[547,3,547,7],[550,7,550,9],[553,3,553,7],[537,6,537,7],[542,7,542,9],[545,3,545,7],[546,3,546,7],[567,3,567,7],[568,5,568,7],[551,7,551,8],[552,7,552,8],[554,7,554,9],[557,3,557,7],[559,8,559,9],[571,0,610,0],[572,2,572,9],[573,1,574,3],[573,4,573,5],[574,4,574,5],[575,2,575,7],[575,8,575,9],[576,1,577,2],[608,3,608,7],[609,5,609,7],[603,3,603,7],[604,1,605,2],[604,3,605,3],[604,4,605,4],[604,5,604,7],[604,9,605,9],[598,3,598,7],[600,8,600,9],[589,7,589,9],[576,3,577,3],[576,4,576,5],[576,6,576,7],[41,10,41,11],[84,11,84,12],[85,10,85,11],[123,11,123,12],[124,10,124,11],[211,11,211,12],[40,11,40,12],[292,10,292,11],[373,11,373,12],[50,11,51,12],[377,10,377,11],[416,11,416,12],[417,10,417,11],[455,11,455,12],[212,10,212,11],[252,11,252,12],[253,10,253,11],[594,3,594,7],[595,7,595,9],[590,7,590,8],[581,7,581,9],[584,3,584,7],[585,3,585,7],[291,11,291,12],[534,10,534,11],[572,11,572,12],[573,10,573,11],[456,10,456,11],[494,11,494,12],[495,10,495,11],[533,11,533,12],[586,3,586,7],[537,3,538,3],[537,4,537,5]]}
[1,"1ª/GRD",{"$nulls":8},{"$f":"J37","v":11625.22},"Minas Gerais"]
[null,"OBRA:"," PAVIMENTAÇÃO EM BLOQUETE SEXTAVADOS - RUAS DIVERSAS DO MUNICÍPIO DE MATA VERDE / MG",{"$nulls":8}," Janeiro/2026"]
[null,"Custo Unitário de Referência",null,null,"Minas Gerais"]
[{"$nulls":4}," Janeiro/2026",null,null,"Produção da equipe ",0.5,{"$f":"VLOOKUP(A1,ORÇAMENTO!$A$10:$L$56,7,1)","v":"GL"}]
[null,"CPU.1","MOBILIZAÇÃO E DESMOBILIZAÇÃO",{"$nulls":5},"Valores em reais (R$)"]
[null,"A - EQUIPAMENTOS",null,"Quantidade","Utilização",null,"Custo Horário",null,null,"Custo"]
[{"$nulls":4},"Operativa","Improdutiva","Produtivo","Improdutivo",null,"Horário Total"]
[null,"E9687","Caminhão carroceria com capacidade de 5 t - 120 kW",8,0.6,0.4,172.44059999999999,68.639300000000006,null,{"$f":"D8*(E8*G8+F8*H8)","v":1047.3606399999999}]
[null,"E9575","Caminhão basculante com caçamba estanque com capacidade de 14 m³ - 210 kW",8,1,0,323.19150000000002,97.611199999999997,null,{"$f":"D9*(E9*G9+F9*H9)","v":2585.5320000000002}]
[{"$nulls":7},"Custo horário total de equipamentos",null,{"$f":"SUM(J8:J9)","v":3632.89264}]
[null,"B - MÃO DE OBRA",null,"Quantidade","Unidade",null,"Custo Horário","Custo Horário Total"]
[null,"P9824","Servente",8,"h",null,21.684899999999999,null,null,{"$f":"D12*G12","v":173.47919999999999}]
[{"$nulls":9},{"$f":"D13*G13","v":0}]
[null,null,null,"Custo horário total de mão de obra",{"$nulls":5},{"$f":"SUM(J12:J13)","v":173.47919999999999}]
[null,null,null,"Custo horário total de execução",{"$nulls":5},{"$f":"J10+J14","v":3806.3718399999998}]
[null,null,null,"Custo unitário de execução",{"$nulls":5},{"$f":"J15/I4","v":7612.7436799999996}]
[{"$nulls":7},"Custo do FIC",null,0]
[{"$nulls":7},"Custo do FIT",null,0]
[null,"C - MATERIAL",null,"Quantidade","Unidade",null,"Preço Unitário","Custo Unitário"]
[null,"-","-",null,"-",null,0,null,null,{"$f":"D20*G20","v":0}]
[null,"-","-",null,"-",null,0,null,null,{"$f":"D21*G21","v":0}]
[null,null,null,"Custo unitário total de material",{"$nulls":5},{"$f":"SUM(J20:J21)","v":0}]
[null,"D - ATIVIDADES AUXILIARES",null,"Quantidade","Unidade",null,"Custo Unitário","Custo Unitário"]
[null,5914640,"Transporte com cavalo mecânico com semirreboque com capacidade de 32 t - rodovia pavimentada",6800.8220000000001,"tkm",null,0.59,null,null,{"$f":"D24*G24","v":4012.4849799999997}]
[null,"-","-",0,"-",null,0,null,null,{"$f":"D25*G25","v":0}]
[null,null,null,"Custo total de atividades auxiliares",{"$nulls":5},{"$f":"SUM(J24:J25)","v":4012.4849799999997}]
[{"$nulls":7},"Subtotal",null,{"$f":"J16+J22+J26+J17+J18","v":11625.228659999999}]
[null,"E - TEMPO FIXO",null,"Código","Quantidade","Unidade",null,"Custo Unitário","Custo Unitário"]
[null,"-","-","-",null,"-",null,0,null,{"$f":"ROUNDDOWN(E29*H29,4)","v":0}]
[null,"-","-","-",null,"-",null,0,null,{"$f":"ROUNDDOWN(E30*H30,4)","v":0}]
[null,null,null,"Custo unitário total de tempo fixo",{"$nulls":5},{"$f":"SUM(J29:J30)","v":0}]
[null,"F - MOMENTO DE TRANSPORTE",null,"Quantidade","Unidade","DMT",null,null,null,"Custo Unitário"]
[{"$nulls":5},"LN","RP","P"]
[null,"-","-",null,"tkm"]
[null,"-","-",null,"tkm"]
[null,null,null,"Custo unitário total de transporte"]
[{"$nulls":5},"Custo unitário direto total",null,null,null,{"$f":"TRUNC(J27+J31,2)","v":11625.22}]
[null,"Obs."]
[]
[2,"1ª/GRD",{"$nulls":8},{"$f":"J81","v":79158.720000000001}]
[null,"OBRA:"," PAVIMENTAÇÃO EM BLOQUETE SEXTAVADOS - RUAS DIVERSAS DO MUNICÍPIO DE MATA VERDE / MG"]
[null,"Custo Unitário de Referência",null,null,"Minas Gerais"]
[{"$nulls":4}," Janeiro/2026",null,null,"Produção da equipe ",0.2,{"$f":"VLOOKUP(A40,ORÇAMENTO!$A$10:$L$56,7,1)","v":"GL"}]
[null,"CPU.2","ADMINISTRAÇÃO LOCAL",{"$nulls":5},"Valores em reais (R$)"]
[null,"A - EQUIPAMENTOS",null,"Quantidade","Utilização",null,"Custo Horário",null,null,"Custo"]
[{"$nulls":4},"Operativa","Improdutiva","Produtivo","Improdutivo",null,"Horário Total"]
[null,"-","-",null,null,null,0,0,null,{"$f":"D47*(E47*G47+F47*H47)","v":0}]
[null,"-","-",null,null,null,0,0,null,{"$f":"D48*(E48*G48+F48*H48)","v":0}]
[{"$nulls":7},"Custo horário total de equipamentos",null,{"$f":"SUM(J47:J48)","v":0}]
[null,"B - MÃO DE OBRA",null,"Quantidade","Unidade",null,"Custo Horário","Custo Horário Total"]
[null,"P9812","Engenheiro - mensalista",0.17201571934910762,"mês",null,26982.6132,null,null,{"$f":"D51*G51","v":4641.4336195167261}]
[null,"P9840","Encarregado geral - mensalista",0.5,"mês",null,10965.15336,null,null,5482.5766800000001]
[null,"P9876","Técnico de segurança do trabalho - mensalista",0.25,"mês",null,6601.5226400000001,null,null,1650.38066]
[null,"P9858","Laboratorista - mensalista",0.5,"mês",null,5239.6151200000004,null,null,2619.8075600000002]
[null,"P9806","Auxiliar administrativo - mensalista",0.25,"mês",null,3765.2775199999996,null,null,941.31937999999991]
[null,null,null,"Custo horário total de mão de obra",{"$nulls":5},{"$f":"SUM(J51:J55)","v":15335.517899516726}]
[null,null,null,"Custo horário total de execução",{"$nulls":5},{"$f":"J49+J56","v":15335.517899516726}]
[null,null,null,"Custo unitário de execução",{"$nulls":5},{"$f":"J57/I43","v":76677.589497583627}]
[{"$nulls":7},"Custo do FIC",null,"-"]
[{"$nulls":7},"Custo do FIT",null,"-"]
[null,"C - MATERIAL",null,"Quantidade","Unidade",null,"Preço Unitário","Custo Unitário"]
[null,"-","-",null,"-",null,0,null,null,{"$f":"D62*G62","v":0}]
[null,"-","-",null,"-",null,0,null,null,0]
[null,null,null,"Custo unitário total de material",{"$nulls":5},{"$f":"SUM(J62:J63)","v":0}]
[null,"D - ATIVIDADES AUXILIARES",null,"Quantidade","Unidade",null,"Custo Unitário","Custo Unitário"]
[null,14250,"Energia Elétrica",240,"kwh",null,1.1200000000000001,null,null,{"$f":"D66*G66","v":268.8}]
[null,44480,"Tarifa A - Água e Esgoto",18,"m³",null,21.19,null,null,{"$f":"D67*G67","v":381.42}]
[null,5212560,"Placa de advertência para sinalização de obras montada em suporte metálico móvel, lado 1,00 m - utilização de 600 ciclos - fornecimento, 01 implantação e 01 retirada diária",352,"un.dia",null,4.01,null,null,{"$f":"D68*G68","v":1411.52}]
[null,"Cotação","Telefone",6,"mês",null,69.900000000000006,null,null,{"$f":"D69*G69","v":419.40000000000003}]
[null,null,null,"Custo total de atividades auxiliares",{"$nulls":5},{"$f":"SUM(J66:J69)","v":2481.14}]
[{"$nulls":7},"Subtotal",null,{"$f":"J58+J64+J70","v":79158.729497583627}]
[null,"E - TEMPO FIXO",null,"Código","Quantidade","Unidade",null,"Custo Unitário","Custo Unitário"]
[null,"-","-","-",null,"-",null,0,null,{"$f":"ROUNDDOWN(E73*H73,4)","v":0}]
[null,"-","-","-",null,"-",null,0,null,{"$f":"ROUNDDOWN(E74*H74,4)","v":0}]
[null,null,null,"Custo unitário total de tempo fixo",{"$nulls":5},{"$f":"SUM(J73:J74)","v":0}]
[null,"F - MOMENTO DE TRANSPORTE",null,"Quantidade","Unidade","DMT",null,null,null,"Custo Unitário"]
[{"$nulls":5},"LN","RP","P"]
[null,"-","-",null,"tkm"]
[null,"-","-",null,"tkm"]
[null,null,null,"Custo unitário total de transporte"]
[{"$nulls":5},"Custo unitário direto total",null,null,null,{"$f":"TRUNC(J71+J75,2)","v":79158.720000000001}]
[null,"Obs."]
[]
[3,"1ª/GRD",{"$nulls":8},{"$f":"J120","v":14208.65}]
[null,"OBRA:"," PAVIMENTAÇÃO EM BLOQUETE SEXTAVADOS - RUAS DIVERSAS DO MUNICÍPIO DE MATA VERDE / MG"]
[null,"Custo Unitário de Referência",null,null,"Minas Gerais"]
[{"$nulls":4}," Janeiro/2026",null,null,"Produção da equipe ",1,{"$f":"VLOOKUP(A84,ORÇAMENTO!$A$10:$L$56,7,1)","v":"GL"}]
[null,"CPU.3","CANTEIRO DE OBRAS",{"$nulls":5},"Valores em reais (R$)"]
[null,"A - EQUIPAMENTOS",null,"Quantidade","Utilização",null,"Custo Horário",null,null,"Custo"]
[{"$nulls":4},"Operativa","Improdutiva","Produtivo","Improdutivo",null,"Horário Total"]
[null,"-","-",null,null,null,0,0,null,{"$f":"D91*(E91*G91+F91*H91)","v":0}]
[null,"-","-",null,null,null,0,0,null,{"$f":"D92*(E92*G92+F92*H92)","v":0}]
[{"$nulls":7},"Custo horário total de equipamentos",null,{"$f":"SUM(J91:J92)","v":0}]
[null,"B - MÃO DE OBRA",null,"Quantidade","Unidade",null,"Custo Horário","Custo Horário Total"]
[null,"P9824","Servente",8,"h",null,21.684899999999999,null,null,{"$f":"D95*G95","v":173.47919999999999}]
[null,"P9808","Carpinteiro",8,"h",null,27.647099999999998,null,null,221.17679999999999]
[null,null,null,"Custo horário total de mão de obra",{"$nulls":5},{"$f":"SUM(J95:J96)","v":394.65599999999995}]
[null,null,null,"Custo horário total de execução",{"$nulls":5},{"$f":"J93+J97","v":394.65599999999995}]
[null,null,null,"Custo unitário de execução",{"$nulls":5},{"$f":"J98/I87","v":394.65599999999995}]
[{"$nulls":7},"Custo do FIC",null,"-"]
[{"$nulls":7},"Custo do FIT",null,"-"]
[null,"C - MATERIAL",null,"Quantidade","Unidade",null,"Preço Unitário","Custo Unitário"]
[null,"M0053","Tela plástica em polipropileno na cor laranja para tapume - L = 1,2 m",100,"m",null,1.79,null,null,{"$f":"D103*G103","v":179}]
[null,"-","-",0,"-",null,0,null,null,0]
[null,null,null,"Custo unitário total de material",{"$nulls":5},{"$f":"SUM(J103:J104)","v":179}]
[null,"D - ATIVIDADES AUXILIARES",null,"Quantidade","Unidade",null,"Custo Unitário","Custo Unitário"]
[null,10775,"Locação de container 2,30 X 6,00 m, alt. 2,50 m, com 1 sanitário, para escritório, completo, sem divisórias internas",6,"mês",null,1010,null,null,{"$f":"D107*G107","v":6060}]
[null,10779,"Locação de container 2,30 X 4,30 m, alt. 2,50 M, p/ sanitário, c/ 5 bacias, 1 lavatório e 4 mictórios",6,"mês",null,1262.5,null,null,{"$f":"D108*G108","v":7575}]
[null,null,null,"Custo total de atividades auxiliares",{"$nulls":5},{"$f":"SUM(J107:J108)","v":13635}]
[{"$nulls":7},"Subtotal",null,{"$f":"J99+J105+J109","v":14208.655999999999}]
[null,"E - TEMPO FIXO",null,"Código","Quantidade","Unidade",null,"Custo Unitário","Custo Unitário"]
[null,"-","-","-",null,"-",null,0,null,{"$f":"ROUNDDOWN(E112*H112,4)","v":0}]
[null,"-","-","-",null,"-",null,0,null,{"$f":"ROUNDDOWN(E113*H113,4)","v":0}]
[null,null,null,"Custo unitário total de tempo fixo",{"$nulls":5},{"$f":"SUM(J112:J113)","v":0}]
[null,"F - MOMENTO DE TRANSPORTE",null,"Quantidade","Unidade","DMT",null,null,null,"Custo Unitário"]
[{"$nulls":5},"LN","RP","P"]
[null,"-","-",null,"tkm"]
[null,"-","-",null,"tkm"]
[null,null,null,"Custo unitário total de transporte"]
[{"$nulls":5},"Custo unitário direto total",null,null,null,{"$f":"TRUNC(J110+J114,2)","v":14208.65}]
[null,"Obs."]
[]
[4,"1ª/GRD",{"$nulls":8},{"$f":"J161","v":555.87}]
[null,"OBRA:"," PAVIMENTAÇÃO EM BLOQUETE SEXTAVADOS - RUAS DIVERSAS DO MUNICÍPIO DE MATA VERDE / MG"]
[null,"Custo Unitário de Referência",null,null,"Minas Gerais"]
[{"$nulls":4}," Janeiro/2026",null,null,"Produção da equipe ",1,{"$f":"VLOOKUP(A123,ORÇAMENTO!$A$10:$L$56,7,1)","v":"M2"}]
[null,103689,"PLACA DE OBRA EM CHAPA DE AÇO GALVANIZADO",{"$nulls":5},"Valores em reais (R$)"]
[null,"A - EQUIPAMENTOS",null,"Quantidade","Utilização",null,"Custo Horário",null,null,"Custo"]
[{"$nulls":4},"Operativa","Improdutiva","Produtivo","Improdutivo",null,"Horário Total"]
[null,"-","-",null,null,null,0,0,null,{"$f":"D130*(E130*G130+F130*H130)","v":0}]
[null,"-","-",null,null,null,0,0,null,{"$f":"D131*(E131*G131+F131*H131)","v":0}]
[{"$nulls":7},"Custo horário total de equipamentos",null,{"$f":"SUM(J130:J131)","v":0}]
[null,"B - MÃO DE OBRA",null,"Quantidade","Unidade",null,"Custo Horário","Custo Horário Total"]
[null,"P9824","Servente",1.1186,"h",null,21.684899999999999,null,null,{"$f":"D134*G134","v":24.256729140000001}]
[null,"P9808","Carpinteiro",0.37290000000000001,"h",null,27.647099999999998,null,null,10.30960359]
[null,null,null,"Custo horário total de mão de obra",{"$nulls":5},{"$f":"SUM(J134:J135)","v":34.566332729999999}]
[null,null,null,"Custo horário total de execução",{"$nulls":5},{"$f":"J132+J136","v":34.566332729999999}]
[null,null,null,"Custo unitário de execução",{"$nulls":5},{"$f":"J137/I126","v":34.566332729999999}]
[{"$nulls":7},"Custo do FIC",null,"-"]
[{"$nulls":7},"Custo do FIT",null,"-"]
[null,"C - MATERIAL",null,"Quantidade","Unidade",null,"Preço Unitário","Custo Unitário"]
[null,"M1358","Sarrafo em madeira de terceira - E = 2,5 cm e L = 5 cm",6.4165999999999999,"m",null,2.1217000000000001,null,null,{"$f":"D142*G142","v":13.614100220000001}]
[null,"M1205","Prego de ferro",2.4500000000000001E-2,"kg",null,15.2544,null,null,0.37373280000000003]
[null,"M0998","Madeira estrutural de eucalipto",2.2608E-2,"m³",null,3000,null,null,67.823999999999998]
[null,4813,"Placa de obra (para construção civil) em chapa galvanizada *N. 22*, adesivada, de *2,4 X 1,2* m (sem postes para fixação)",1,"m²",null,439.5,null,null,{"$f":"D145*G145","v":439.5}]
[null,null,null,"Custo unitário total de material",{"$nulls":5},{"$f":"SUM(J142:J145)","v":521.31183301999999}]
[null,"D - ATIVIDADES AUXILIARES",null,"Quantidade","Unidade",null,"Custo Unitário","Custo Unitário"]
[null,"-","-",0,"-",null,0,null,null,{"$f":"D148*G148","v":0}]
[null,"-","-",0,"-",null,0,null,null,0]
[null,null,null,"Custo total de atividades auxiliares",{"$nulls":5},{"$f":"SUM(J148:J149)","v":0}]
[{"$nulls":7},"Subtotal",null,{"$f":"J138+J146+J150","v":555.87816574999999}]
[null,"E - TEMPO FIXO",null,"Código","Quantidade","Unidade",null,"Custo Unitário","Custo Unitário"]
[null,"-","-","-",null,"-",null,0,null,{"$f":"ROUNDDOWN(E153*H153,4)","v":0}]
[null,"-","-","-",null,"-",null,0,null,{"$f":"ROUNDDOWN(E154*H154,4)","v":0}]
[null,null,null,"Custo unitário total de tempo fixo",{"$nulls":5},{"$f":"SUM(J153:J154)","v":0}]
[null,"F - MOMENTO DE TRANSPORTE",null,"Quantidade","Unidade","DMT",null,null,null,"Custo Unitário"]
[{"$nulls":5},"LN","RP","P"]
[null,"-","-",null,"tkm"]
[null,"-","-",null,"tkm"]
[null,null,null,"Custo unitário total de transporte"]
[{"$nulls":5},"Custo unitário direto total",null,null,null,{"$f":"TRUNC(J151+J155,2)","v":555.87}]
[null,"Obs."]
[]
[5,"1ª/GRD",{"$nulls":8},{"$f":"J208","v":4415.22}]
[null,"OBRA:"," PAVIMENTAÇÃO EM BLOQUETE SEXTAVADOS - RUAS DIVERSAS DO MUNICÍPIO DE MATA VERDE / MG"]
[null,"Custo Unitário de Referência",null,null,"Minas Gerais"]
[{"$nulls":4}," Janeiro/2026",null,null,"Produção da equipe ",1,{"$f":"VLOOKUP(A164,ORÇAMENTO!$A$10:$L$56,7,1)","v":"MÊS"}]
[null,"CPU.4","VEÍCULO PARA A FISCALIZAÇÃO, MÁXIMO 02 ANOS DE USO OU 50.000KM, PREFERENCIALMENTE NA COR BRANCA, COM IDENTIFICAÇÃO CONFORME ESPECIFICAÇÕES DA CODEVASF, INCLUSIVE COMBUSTÍVEL, MANUTENÇÃO, SEGURO E IMPOSTOS - CONFORME ESPECIFICAÇÕES",{"$nulls":5},"Valores em reais (R$)"]
[null,"A - EQUIPAMENTOS",null,"Quantidade","Utilização",null,"Custo Horário",null,null,"Custo"]
[{"$nulls":4},"Operativa","Improdutiva","Produtivo","Improdutivo",null,"Horário Total"]
[null,"-","-",null,null,null,0,0,null,{"$f":"D171*(E171*G171+F171*H171)","v":0}]
[null,"-","-",null,null,null,0,0,null,{"$f":"D172*(E172*G172+F172*H172)","v":0}]
[{"$nulls":7},"Custo horário total de equipamentos",null,{"$f":"SUM(J171:J172)","v":0}]
[null,"B - MÃO DE OBRA",null,"Quantidade","Unidade",null,"Custo Horário","Custo Horário Total"]
[null,"-","-",null,"-",null,0,null,null,{"$f":"D175*G175","v":0}]
[null,"-","-",null,"-",null,0,null,null,0]
[null,null,null,"Custo horário total de mão de obra",{"$nulls":5},{"$f":"SUM(J175:J176)","v":0}]
[null,null,null,"Custo horário total de execução",{"$nulls":5},{"$f":"J173+J177","v":0}]
[null,null,null,"Custo unitário de execução",{"$nulls":5},{"$f":"J178/I167","v":0}]
[{"$nulls":7},"Custo do FIC",null,"-"]
[{"$nulls":7},"Custo do FIT",null,"-"]
[null,"C - MATERIAL",null,"Quantidade","Unidade",null,"Preço Unitário","Custo Unitário"]
[null,"-","-",null,"-",null,0,null,null,{"$f":"D183*G183","v":0}]
[null,"-","-",null,"-",null,0,null,null,0]
[null,null,null,"Custo unitário total de material",{"$nulls":5},{"$f":"SUM(J183:J184)","v":0}]
[null,"D - ATIVIDADES AUXILIARES",null,"Quantidade","Unidade",null,"Custo Unitário","Custo Unitário"]
[null,"-","Depreciação",1,"vb",null,725.93333333333328,null,null,{"$f":"D187*G187","v":725.93333333333328}]
[null,"-","Oportunidade de Capital",1,"vb",null,544.45000000000005,null,null,{"$f":"D188*G188","v":544.45000000000005}]
[null,"-","Impostos e Licenciamento",1,"vb",null,362.97,null,null,362.97]
[null,"-","Seguro Total",1,"vb",null,281.58,null,null,281.58]
[null,"-","Combustível",1,"vb",null,1324.29,null,null,1324.29]
[null,"-","Manutenções Preventivas",1,"vb",null,254.02,null,null,254.02]
[null,"-","Limpeza",1,"vb",null,100,null,null,100]
[null,"-","Pneus",1,"vb",null,119.98,null,null,119.98]
[null,"-","Peças",1,"vb",null,74.790000000000006,null,null,74.790000000000006]
[null,"-","Manutenção Corretiva (%)",1,"vb",null,627.21,null,null,627.21]
[null,null,null,"Custo total de atividades auxiliares",{"$nulls":5},{"$f":"SUM(J187:J196)","v":4415.2233333333334}]
[{"$nulls":7},"Subtotal",null,{"$f":"J179+J185+J197","v":4415.2233333333334}]
[null,"E - TEMPO FIXO",null,"Código","Quantidade","Unidade",null,"Custo Unitário","Custo Unitário"]
[null,"-","-","-",null,"-",null,0,null,{"$f":"ROUNDDOWN(E200*H200,4)","v":0}]
[null,"-","-","-",null,"-",null,0,null,{"$f":"ROUNDDOWN(E201*H201,4)","v":0}]
[null,null,null,"Custo unitário total de tempo fixo",{"$nulls":5},{"$f":"SUM(J200:J201)","v":0}]
[null,"F - MOMENTO DE TRANSPORTE",null,"Quantidade","Unidade","DMT",null,null,null,"Custo Unitário"]
[{"$nulls":5},"LN","RP","P"]
[null,"-","-",null,"tkm"]
[null,"-","-",null,"tkm"]
[null,null,null,"Custo unitário total de transporte"]
[{"$nulls":5},"Custo unitário direto total",null,null,null,{"$f":"TRUNC(J198+J202,2)","v":4415.22}]
[null,"Obs."]
[]
[6,"1ª/GRD",{"$nulls":8},{"$f":"J249","v":0.48}]
[null,"OBRA:"," PAVIMENTAÇÃO EM BLOQUETE SEXTAVADOS - RUAS DIVERSAS DO MUNICÍPIO DE MATA VERDE / MG"]
[null,"Custo Unitário de Referência",null,null,"Minas Gerais"]
[{"$nulls":4}," Janeiro/2026",null,null,"Produção da equipe ",1,{"$f":"VLOOKUP(A211,ORÇAMENTO!$A$10:$L$56,7,1)","v":"M2"}]
[null,78472,"SERVIÇOS TOPOGRÁFICOS PARA PAVIMENTAÇÃO, INCLUSIVE LEVANTAMENTO PLANIALTIMÉTRICO CADASTRAL, GERAÇÃO DE NOTAS DE SERVIÇO, SEÇÕES TRANSVERSAIS E GREIDE, ESTAQUEAMENTO E ACOMPANHAMENTO EXECUTIVO",{"$nulls":5},"Valores em reais (R$)"]
[null,"A - EQUIPAMENTOS",null,"Quantidade","Utilização",null,"Custo Horário",null,null,"Custo"]
[{"$nulls":4},"Operativa","Improdutiva","Produtivo","Improdutivo",null,"Horário Total"]
[null,92145,"Caminhonete cabine simples com motor 1.6 flex, câmbio manual, potência 101/104 cv, 2 portas",5.0000000000000001E-4,1,0,83.65,0,null,{"$f":"D218*(E218*G218+F218*H218)","v":4.1825000000000001E-2}]
[null,"-","-",0,1,0,0,0,null,{"$f":"D219*(E219*G219+F219*H219)","v":0}]
[{"$nulls":7},"Custo horário total de equipamentos",null,{"$f":"SUM(J218:J219)","v":4.1825000000000001E-2}]
[null,"B - MÃO DE OBRA",null,"Quantidade","Unidade",null,"Custo Horário","Custo Horário Total"]
[null,"P9949","Topógrafo - mensalista",1.2500000000000001E-5,"mês",null,7071.0056999999997,null,null,{"$f":"D222*G222","v":8.8387571250000005E-2}]
[null,"P9950","Auxiliar de topografia - mensalista",1.2500000000000001E-5,"mês",null,6461.7082,null,null,8.0771352500000004E-2]
[null,"P9824","Servente",7.4999999999999997E-3,"h",null,21.684899999999999,null,null,0.16263675]
[null,"P9848","Desenhista - mensalista",1.0000000000000001E-5,"mês",null,10938.037899999999,null,null,0.109380379]
[null,null,null,"Custo horário total de mão de obra",{"$nulls":5},{"$f":"SUM(J222:J225)","v":0.44117605275000005}]
[null,null,null,"Custo horário total de execução",{"$nulls":5},{"$f":"J220+J226","v":0.48300105275000005}]
[null,null,null,"Custo unitário de execução",{"$nulls":5},{"$f":"J227/I214","v":0.48300105275000005}]
[{"$nulls":7},"Custo do FIC",null,"-"]
[{"$nulls":7},"Custo do FIT",null,"-"]
[null,"C - MATERIAL",null,"Quantidade","Unidade",null,"Preço Unitário","Custo Unitário"]
[null,"-","-",0,"-",null,0,null,null,{"$f":"D232*G232","v":0}]
[null,"-","-",0,"-",null,0,null,null,0]
[null,null,null,"Custo unitário total de material",{"$nulls":5},{"$f":"SUM(J232:J233)","v":0}]
[null,"D - ATIVIDADES AUXILIARES",null,"Quantidade","Unidade",null,"Custo Unitário","Custo Unitário"]
[null,"-","-",0,"-",null,0,null,null,{"$f":"D236*G236","v":0}]
[null,"-","-",0,"-",null,0,null,null,0]
[null,null,null,"Custo total de atividades auxiliares",{"$nulls":5},{"$f":"SUM(J236:J237)","v":0}]
[{"$nulls":7},"Subtotal",null,{"$f":"J228+J234+J238","v":0.48300105275000005}]
[null,"E - TEMPO FIXO",null,"Código","Quantidade","Unidade",null,"Custo Unitário","Custo Unitário"]
[null,"-","-","-",null,"-",null,0,null,{"$f":"ROUNDDOWN(E241*H241,4)","v":0}]
[null,"-","-","-",null,"-",null,0,null,{"$f":"ROUNDDOWN(E242*H242,4)","v":0}]
[null,null,null,"Custo unitário total de tempo fixo",{"$nulls":5},{"$f":"SUM(J241:J242)","v":0}]
[null,"F - MOMENTO DE TRANSPORTE",null,"Quantidade","Unidade","DMT",null,null,null,"Custo Unitário"]
[{"$nulls":5},"LN","RP","P"]
[null,"-","-",null,"tkm"]
[null,"-","-",null,"tkm"]
[null,null,null,"Custo unitário total de transporte"]
[{"$nulls":5},"Custo unitário direto total",null,null,null,{"$f":"TRUNC(J239+J243,2)","v":0.48}]
[null,"Obs."]
[]
[7,"1ª/GRD",{"$nulls":8},{"$f":"J288","v":8.65}]
[null,"OBRA:"," PAVIMENTAÇÃO EM BLOQUETE SEXTAVADOS - RUAS DIVERSAS DO MUNICÍPIO DE MATA VERDE / MG"]
[null,"Custo Unitário de Referência",null,null,"Minas Gerais"]
[{"$nulls":4}," Janeiro/2026",null,null,"Produção da equipe ",230.19,{"$f":"VLOOKUP(A252,ORÇAMENTO!$A$10:$L$56,7,1)","v":"M3"}]
[null,5502114,"ESCAVAÇÃO, CARGA E TRANSPORTE DE MATERIAL DE 1ª CATEGORIA - DMT 1.000 A 1.200M, CAMINHO DE SERVIÇO EM REVESTIMENTO PRIMÁRIO",{"$nulls":5},"Valores em reais (R$)"]
[null,"A - EQUIPAMENTOS",null,"Quantidade","Utilização",null,"Custo Horário",null,null,"Custo"]
[{"$nulls":4},"Operativa","Improdutiva","Produtivo","Improdutivo",null,"Horário Total"]
[null,"E9667","Caminhão basculante com capacidade de 14 m³ - 210 kW",5,0.96,0.04,322.66559999999998,97.340599999999995,null,{"$f":"D259*(E259*G259+F259*H259)","v":1568.2629999999997}]
[null,"E9515","Escavadeira hidráulica sobre esteiras com caçamba com capacidade de 1,56 m³ - 118 kW",1,1,0,331.48759999999999,152.93369999999999,null,331.48759999999999]
[{"$nulls":7},"Custo horário total de equipamentos",null,{"$f":"SUM(J259:J260)","v":1899.7505999999996}]
[null,"B - MÃO DE OBRA",null,"Quantidade","Unidade",null,"Custo Horário","Custo Horário Total"]
[null,"P9824","Servente",1,"h",null,21.684899999999999,null,null,{"$f":"D263*G263","v":21.684899999999999}]
[null,"-","-",null,"-",null,0,null,null,0]
[null,null,null,"Custo horário total de mão de obra",{"$nulls":5},{"$f":"SUM(J263:J264)","v":21.684899999999999}]
[null,null,null,"Custo horário total de execução",{"$nulls":5},{"$f":"J261+J265","v":1921.4354999999996}]
[null,null,null,"Custo unitário de execução",{"$nulls":5},{"$f":"J266/I255","v":8.3471719014726951}]
[{"$nulls":7},"Custo do FIC",null,0.31269999999999998]
[{"$nulls":7},"Custo do FIT",null,0]
[null,"C - MATERIAL",null,"Quantidade","Unidade",null,"Preço Unitário","Custo Unitário"]
[null,"-","-",null,"-",null,0,null,null,{"$f":"D271*G271","v":0}]
[null,"-","-",null,"-",null,0,null,null,0]
[null,null,null,"Custo unitário total de material",{"$nulls":5},{"$f":"SUM(J271:J272)","v":0}]
[null,"D - ATIVIDADES AUXILIARES",null,"Quantidade","Unidade",null,"Custo Unitário","Custo Unitário"]
[null,"-","-",0,"-",null,0,null,null,{"$f":"D275*G275","v":0}]
[null,"-","-",0,"-",null,0,null,null,0]
[null,null,null,"Custo total de atividades auxiliares",{"$nulls":5},{"$f":"SUM(J275:J276)","v":0}]
[{"$nulls":7},"Subtotal",null,{"$f":"J267+J273+J277+J268+J269","v":8.6598719014726946}]
[null,"E - TEMPO FIXO",null,"Código","Quantidade","Unidade",null,"Custo Unitário","Custo Unitário"]
[null,"-","-","-",null,"-",null,0,null,{"$f":"ROUNDDOWN(E280*H280,4)","v":0}]
[null,"-","-","-",null,"-",null,0,null,{"$f":"ROUNDDOWN(E281*H281,4)","v":0}]
[null,null,null,"Custo unitário total de tempo fixo",{"$nulls":5},{"$f":"SUM(J280:J281)","v":0}]
[null,"F - MOMENTO DE TRANSPORTE",null,"Quantidade","Unidade","DMT",null,null,null,"Custo Unitário"]
[{"$nulls":5},"LN","RP","P"]
[null,"-","-",null,"tkm"]
[null,"-","-",null,"tkm"]
[null,null,null,"Custo unitário total de transporte"]
[{"$nulls":5},"Custo unitário direto total",null,null,null,{"$f":"TRUNC(J278+J282,2)","v":8.65}]
[null,"Obs."]
[]
[8,"1ª/GRD",{"$nulls":8},{"$f":"J331","v":1.88}]
[null,"OBRA:"," PAVIMENTAÇÃO EM BLOQUETE SEXTAVADOS - RUAS DIVERSAS DO MUNICÍPIO DE MATA VERDE / MG"]
[null,"Custo Unitário de Referência",null,null,"Minas Gerais"]
[{"$nulls":4}," Janeiro/2026",null,null,"Produção da equipe ",672.8,{"$f":"VLOOKUP(A291,ORÇAMENTO!$A$10:$L$56,7,1)","v":"M2"}]
[null,4011209,"REGULARIZAÇÃO DO SUBLEITO - 100% PROCTOR INTERMEDIÁRIO",{"$nulls":5},"Valores em reais (R$)"]
[null,"A - EQUIPAMENTOS",null,"Quantidade","Utilização",null,"Custo Horário",null,null,"Custo"]
[{"$nulls":4},"Operativa","Improdutiva","Produtivo","Improdutivo",null,"Horário Total"]
[null,"E9571","Caminhão tanque com capacidade de 10.000 l - 188 kW",1,0.61,0.39,358.54259999999999,97.3673,null,{"$f":"D298*(E298*G298+F298*H298)","v":256.68423300000001}]
[null,"E9518","Grade de 24 discos rebocável de D = 60 cm (24\")",1,0.41,0.59,4.9439000000000002,3.4428000000000001,null,4.0582510000000003]
[null,"E9524","Motoniveladora - 93 kW",1,0.43,0.56999999999999995,342.05520000000001,150.57470000000001,null,232.911315]
[null,"E9762","Rolo compactador de pneus autopropelido de 27 t - 85 kW",1,0.96,0.04,331.78800000000001,164.60919999999999,null,325.10084799999998]
[null,"E9685","Rolo compactador pé de carneiro vibratório autopropelido por pneus de 11,6 t - 82 kW",1,1,0,248.25219999999999,114.1401,null,{"$f":"D302*(E302*G302+F302*H302)","v":248.25219999999999}]
[null,"E9577","Trator agrícola sobre pneus - 77 kW",1,0.41,0.59,178.655,70.547200000000004,null,114.871398]
[{"$nulls":7},"Custo horário total de equipamentos",null,{"$f":"SUM(J298:J303)","v":1181.8782449999999}]
[null,"B - MÃO DE OBRA",null,"Quantidade","Unidade",null,"Custo Horário","Custo Horário Total"]
[null,"P9824","Servente",1,"h",null,21.684899999999999,null,null,{"$f":"D306*G306","v":21.684899999999999}]
[null,"-","-",0,"-",null,0,null,null,0]
[null,null,null,"Custo horário total de mão de obra",{"$nulls":5},{"$f":"SUM(J306:J307)","v":21.684899999999999}]
[null,null,null,"Custo horário total de execução",{"$nulls":5},{"$f":"J304+J308","v":1203.5631449999998}]
[null,null,null,"Custo unitário de execução",{"$nulls":5},{"$f":"J309/I294","v":1.788886957491082}]
[{"$nulls":7},"Custo do FIC",null,0.1007]
[{"$nulls":7},"Custo do FIT",null,0]
[null,"C - MATERIAL",null,"Quantidade","Unidade",null,"Preço Unitário","Custo Unitário"]
[null,"-","-",0,"-",null,0,null,null,{"$f":"D314*G314","v":0}]
[null,"-","-",0,"-",null,0,null,null,0]
[null,null,null,"Custo unitário total de material",{"$nulls":5},{"$f":"SUM(J314:J315)","v":0}]
[null,"D - ATIVIDADES AUXILIARES",null,"Quantidade","Unidade",null,"Custo Unitário","Custo Unitário"]
[null,"-","-",0,"-",null,0,null,null,{"$f":"D318*G318","v":0}]
[null,"-","-",0,"-",null,0,null,null,0]
[null,null,null,"Custo total de atividades auxiliares",{"$nulls":5},{"$f":"SUM(J318:J319)","v":0}]
[{"$nulls":7},"Subtotal",null,{"$f":"J310+J316+J320+J311+J312","v":1.889586957491082}]
[null,"E - TEMPO FIXO",null,"Código","Quantidade","Unidade",null,"Custo Unitário","Custo Unitário"]
[null,"-","-","-",null,"-",null,0,null,{"$f":"ROUNDDOWN(E323*H323,4)","v":0}]
[null,"-","-","-",null,"-",null,0,null,{"$f":"ROUNDDOWN(E324*H324,4)","v":0}]
[null,null,null,"Custo unitário total de tempo fixo",{"$nulls":5},{"$f":"SUM(J323:J324)","v":0}]
[null,"F - MOMENTO DE TRANSPORTE",null,"Quantidade","Unidade","DMT",null,null,null,"Custo Unitário"]
[{"$nulls":5},"LN","RP","P"]
[null,"-","-",null,"tkm"]
[null,"-","-",null,"tkm"]
[null,null,null,"Custo unitário total de transporte"]
[{"$nulls":5},"Custo unitário direto total",null,null,null,{"$f":"TRUNC(J321+J325,2)","v":1.88}]
[null,"Obs."]
[]
[9,"1ª/GRD",{"$nulls":8},{"$f":"J373","v":17.2}]
[null,"OBRA:"," PAVIMENTAÇÃO EM BLOQUETE SEXTAVADOS - RUAS DIVERSAS DO MUNICÍPIO DE MATA VERDE / MG"]
[null,"Custo Unitário de Referência",null,null,"Minas Gerais"]
[{"$nulls":4}," Janeiro/2026",null,null,"Produção da equipe ",112.13,{"$f":"VLOOKUP(A334,ORÇAMENTO!$A$10:$L$56,7,1)","v":"M3"}]
[null,4011219,"BASE DE SOLO ESTABILIZADA GRANULOMETRICAMENTE SEM MISTURA COM MATERIAL DE JAZIDA - 100% PROCTOR MODIFICADO",{"$nulls":5},"Valores em reais (R$)"]
[null,"A - EQUIPAMENTOS",null,"Quantidade","Utilização",null,"Custo Horário",null,null,"Custo"]
[{"$nulls":4},"Operativa","Improdutiva","Produtivo","Improdutivo",null,"Horário Total"]
[null,"E9571","Caminhão tanque com capacidade de 10.000 l - 188 kW",1,0.62,0.38,358.54259999999999,97.3673,null,{"$f":"D341*(E341*G341+F341*H341)","v":259.29598600000003}]
[null,"E9518","Grade de 24 discos rebocável de D = 60 cm (24\")",1,0.34,0.65999999999999992,4.9439000000000002,3.4428000000000001,null,3.9531739999999997]
[null,"E9524","Motoniveladora - 93 kW",1,0.5,0.5,342.05520000000001,150.57470000000001,null,246.31495000000001]
[null,"E9762","Rolo compactador de pneus autopropelido de 27 t - 85 kW",1,0.96,0.04,331.78800000000001,164.60919999999999,null,325.10084799999998]
[null,"E9685","Rolo compactador pé de carneiro vibratório autopropelido por pneus de 11,6 t - 82 kW",1,1,0,248.25219999999999,114.1401,null,248.25219999999999]
[null,"E9577","Trator agrícola sobre pneus - 77 kW",1,0.34,0.65999999999999992,178.655,70.547200000000004,null,107.30385200000001]
[{"$nulls":7},"Custo horário total de equipamentos",null,{"$f":"SUM(J341:J346)","v":1190.22101}]
[null,"B - MÃO DE OBRA",null,"Quantidade","Unidade",null,"Custo Horário","Custo Horário Total"]
[null,"P9824","Servente",1,"h",null,21.684899999999999,null,null,{"$f":"D349*G349","v":21.684899999999999}]
[null,null,null,"Custo horário total de mão de obra",{"$nulls":5},{"$f":"SUM(J349:J349)","v":21.684899999999999}]
[null,null,null,"Custo horário total de execução",{"$nulls":5},{"$f":"J347+J350","v":1211.9059099999999}]
[null,null,null,"Custo unitário de execução",{"$nulls":5},{"$f":"J351/I337","v":10.808043431731026}]
[{"$nulls":7},"Custo do FIC",null,0.65449999999999997]
[{"$nulls":7},"Custo do FIT",null,0]
[null,"C - MATERIAL",null,"Quantidade","Unidade",null,"Preço Unitário","Custo Unitário"]
[null,"-","-",0,"-",null,0,null,null,{"$f":"D356*G356","v":0}]
[null,"-","-",0,"-",null,0,null,null,0]
[null,null,null,"Custo unitário total de material",{"$nulls":5},{"$f":"SUM(J356:J357)","v":0}]
[null,"D - ATIVIDADES AUXILIARES",null,"Quantidade","Unidade",null,"Custo Unitário","Custo Unitário"]
[null,4016096,"Escavação e carga de material de jazida com escavadeira hidráulica de 1,56 m³",1.1002700000000001,"m³",null,1.62,null,null,{"$f":"D360*G360","v":1.7824374000000003}]
[null,"-","-",0,"-",null,0,null,null,0]
[null,null,null,"Custo total de atividades auxiliares",{"$nulls":5},{"$f":"SUM(J360:J361)","v":1.7824374000000003}]
[{"$nulls":7},"Subtotal",null,{"$f":"J352+J358+J362+J353+J354","v":13.244980831731027}]
[null,"E - TEMPO FIXO",null,"Código","Quantidade","Unidade",null,"Custo Unitário","Custo Unitário"]
[null,4016096,"Escavação e carga de material de jazida com escavadeira hidráulica de 1,56 m³",5914354,2.0630099999999998,"m³",null,1.92,null,{"$f":"ROUNDDOWN(E365*H365,4)","v":3.9609000000000001}]
[null,"-","-","-",null,"-",null,0,null,{"$f":"ROUNDDOWN(E366*H366,4)","v":0}]
[null,null,null,"Custo unitário total de tempo fixo",{"$nulls":5},{"$f":"SUM(J365:J366)","v":3.9609000000000001}]
[null,"F - MOMENTO DE TRANSPORTE",null,"Quantidade","Unidade","DMT",null,null,null,"Custo Unitário"]
[{"$nulls":5},"LN","RP","P"]
[null,4016096,"Escavação e carga de material de jazida com escavadeira hidráulica de 1,56 m³",2.0630099999999998,"tkm",5914359,5914374,5914389]
[null,"-","-",null,"tkm"]
[null,null,null,"Custo unitário total de transporte"]
[{"$nulls":5},"Custo unitário direto total",null,null,null,{"$f":"TRUNC(J363+J367,2)","v":17.2}]
[null,"Obs."]
[]
[10,"1ª/GRD",{"$nulls":8},{"$f":"J413","v":68.98}]
[null,"OBRA:"," PAVIMENTAÇÃO EM BLOQUETE SEXTAVADOS - RUAS DIVERSAS DO MUNICÍPIO DE MATA VERDE / MG"]
[null,"Custo Unitário de Referência",null,null,"Minas Gerais"]
[{"$nulls":4}," Janeiro/2026",null,null,"Produção da equipe ",11.883541295306001,{"$f":"VLOOKUP(A376,ORÇAMENTO!$A$10:$L$56,7,1)","v":"M2"}]
[null,92394,"EXECUÇÃO DE PAVIMENTO EM PISO INTERTRAVADO, COM BLOCO SEXTAVADO DE CONCRETO DE 25 X 25 CM, ESPESSURA 8 CM",{"$nulls":5},"Valores em reais (R$)"]
[null,"A - EQUIPAMENTOS",null,"Quantidade","Utilização",null,"Custo Horário",null,null,"Custo"]
[{"$nulls":4},"Operativa","Improdutiva","Produtivo","Improdutivo",null,"Horário Total"]
[null,"E9587","Serra para corte de concreto - 4 kW",1,3.8E-3,8.0399999999999999E-2,10.114699999999999,1.6005,null,{"$f":"D383*(E383*G383+F383*H383)","v":0.16711605999999998}]
[null,"E9556","Compactador manual de placa vibratória - 3,00 kW",1,5.4999999999999997E-3,7.8700000000000006E-2,10.133900000000001,2.4565000000000001,null,0.24906300000000001]
[{"$nulls":7},"Custo horário total de equipamentos",null,{"$f":"SUM(J383:J384)","v":0.41617905999999999}]
[null,"B - MÃO DE OBRA",null,"Quantidade","Unidade",null,"Custo Horário","Custo Horário Total"]
[null,"P9824","Servente",2,"h",null,21.684899999999999,null,null,{"$f":"D387*G387","v":43.369799999999998}]
[null,"P9802","Ajudante especializado",2,"h",null,27.8186,null,null,55.6372]
[null,null,null,"Custo horário total de mão de obra",{"$nulls":5},{"$f":"SUM(J387:J388)","v":99.007000000000005}]
[null,null,null,"Custo horário total de execução",{"$nulls":5},{"$f":"J385+J389","v":99.42317906000001}]
[null,null,null,"Custo unitário de execução",{"$nulls":5},{"$f":"J390/I379","v":8.3664605178990001}]
[{"$nulls":7},"Custo do FIC",null,2.2700000000000001E-2]
[{"$nulls":7},"Custo do FIT",null,0]
[null,"C - MATERIAL",null,"Quantidade","Unidade",null,"Preço Unitário","Custo Unitário"]
[null,"M0028","Areia média",5.6800000000000003E-2,"m³",null,35,"IL EXTRAÇÃO DE AREIA - ALMENARA",null,{"$f":"D395*G395","v":1.9880000000000002}]
[null,"M1135","Pó de pedra",6.6E-3,"m³",null,119.89,"SINAPI (4741)",null,{"$f":"D396*G396","v":0.79127400000000003}]
[null,712,"BLOQUETE/PISO INTERTRAVADO DE CONCRETO - MODELO SEXTAVADO / HEXAGONAL, *25 X 25* CM, E = 8 CM, RESISTENCIA DE 35 MPA",1.0038,"m²",null,57.6,"FERREIRA MINERAÇÃO/ PRÉ MOLDADOS - ALMENARA",null,57.81888]
[null,null,null,"Custo unitário total de material",{"$nulls":5},{"$f":"SUM(J395:J397)","v":60.598154000000001}]
[null,"D - ATIVIDADES AUXILIARES",null,"Quantidade","Unidade",null,"Custo Unitário","Custo Unitário"]
[null,"-","-",0,"-",null,0,null,null,{"$f":"D400*G400","v":0}]
[null,"-","-",0,"-",null,0,null,null,0]
[null,null,null,"Custo total de atividades auxiliares",{"$nulls":5},{"$f":"SUM(J400:J401)","v":0}]
[{"$nulls":7},"Subtotal",null,{"$f":"J391+J398+J402+J392+J393","v":68.987314517899009}]
[null,"E - TEMPO FIXO",null,"Código","Quantidade","Unidade",null,"Custo Unitário","Custo Unitário"]
[null,"-","-","-",null,"-",null,0,null,{"$f":"ROUNDDOWN(E405*H405,4)","v":0}]
[null,"-","-","-",null,"-",null,0,null,{"$f":"ROUNDDOWN(E406*H406,4)","v":0}]
[null,null,null,"Custo unitário total de tempo fixo",{"$nulls":5},{"$f":"SUM(J405:J406)","v":0}]
[null,"F - MOMENTO DE TRANSPORTE",null,"Quantidade","Unidade","DMT",null,null,null,"Custo Unitário"]
[{"$nulls":5},"LN","RP","P"]
[null,"-","-",null,"tkm"]
[null,"-","-",null,"tkm"]
[null,null,null,"Custo unitário total de transporte"]
[{"$nulls":5},"Custo unitário direto total",null,null,null,{"$f":"TRUNC(J403+J407,2)","v":68.98}]
[null,"Obs."]
[]
[15,"1ª/GRD",{"$nulls":8},{"$f":"J452","v":0.68}]
[null,"OBRA:"," PAVIMENTAÇÃO EM BLOQUETE SEXTAVADOS - RUAS DIVERSAS DO MUNICÍPIO DE MATA VERDE / MG"]
[null,"Custo Unitário de Referência",null,null,"Minas Gerais"]
[{"$nulls":4}," Janeiro/2026",null,null,"Produção da equipe ",470.61,{"$f":"VLOOKUP(A416,ORÇAMENTO!$A$10:$L$56,7,1)","v":"TXKM"}]
[null,5915321,"TRANSPORTE COM CAMINHÃO BASCULANTE, EM VIA URBANA PAVIMENTADA",{"$nulls":5},"Valores em reais (R$)"]
[null,"A - EQUIPAMENTOS",null,"Quantidade","Utilização",null,"Custo Horário",null,null,"Custo"]
[{"$nulls":4},"Operativa","Improdutiva","Produtivo","Improdutivo",null,"Horário Total"]
[null,"E9667","Caminhão basculante com capacidade de 14 m³ - 210 kW",1,1,0,322.66559999999998,97.340599999999995,null,{"$f":"D423*(E423*G423+F423*H423)","v":322.66559999999998}]
[null,"-","-",null,null,null,0,0,null,0]
[{"$nulls":7},"Custo horário total de equipamentos",null,{"$f":"SUM(J423:J424)","v":322.66559999999998}]
[null,"B - MÃO DE OBRA",null,"Quantidade","Unidade",null,"Custo Horário","Custo Horário Total"]
[null,"-","-",null,"-",null,0,null,null,{"$f":"D427*G427","v":0}]
[null,"-","-",null,"-",null,0,null,null,0]
[null,null,null,"Custo horário total de mão de obra",{"$nulls":5},{"$f":"SUM(J427:J428)","v":0}]
[null,null,null,"Custo horário total de execução",{"$nulls":5},{"$f":"J425+J429","v":322.66559999999998}]
[null,null,null,"Custo unitário de execução",{"$nulls":5},{"$f":"J430/I419","v":0.68563268948811107}]
[{"$nulls":7},"Custo do FIC",null,0]
[{"$nulls":7},"Custo do FIT",null,0]
[null,"C - MATERIAL",null,"Quantidade","Unidade",null,"Preço Unitário","Custo Unitário"]
[null,"-","-",0,"-",null,0,null,null,{"$f":"D435*G435","v":0}]
[null,"-","-",0,"-",null,0,null,null,0]
[null,null,null,"Custo unitário total de material",{"$nulls":5},{"$f":"SUM(J435:J436)","v":0}]
[null,"D - ATIVIDADES AUXILIARES",null,"Quantidade","Unidade",null,"Custo Unitário","Custo Unitário"]
[null,"-","-",0,"-",null,0,null,null,{"$f":"D439*G439","v":0}]
[null,"-","-",0,"-",null,0,null,null,0]
[null,null,null,"Custo total de atividades auxiliares",{"$nulls":5},{"$f":"SUM(J439:J440)","v":0}]
[{"$nulls":7},"Subtotal",null,{"$f":"J431+J437+J441+J432+J433","v":0.68563268948811107}]
[null,"E - TEMPO FIXO",null,"Código","Quantidade","Unidade",null,"Custo Unitário","Custo Unitário"]
[null,"-","-","-",null,"-",null,0,null,{"$f":"ROUNDDOWN(E444*H444,4)","v":0}]
[null,"-","-","-",null,"-",null,0,null,{"$f":"ROUNDDOWN(E445*H445,4)","v":0}]
[null,null,null,"Custo unitário total de tempo fixo",{"$nulls":5},{"$f":"SUM(J444:J445)","v":0}]
[null,"F - MOMENTO DE TRANSPORTE",null,"Quantidade","Unidade","DMT",null,null,null,"Custo Unitário"]
[{"$nulls":5},"LN","RP","P"]
[null,"-","-",null,"tkm"]
[null,"-","-",null,"tkm"]
[null,null,null,"Custo unitário total de transporte"]
[{"$nulls":5},"Custo unitário direto total",null,null,null,{"$f":"TRUNC(J442+J446,2)","v":0.68}]
[null,"Obs."]
[]
[16,"1ª/GRD",{"$nulls":8},{"$f":"J491","v":0.74}]
[null,"OBRA:"," PAVIMENTAÇÃO EM BLOQUETE SEXTAVADOS - RUAS DIVERSAS DO MUNICÍPIO DE MATA VERDE / MG"]
[null,"Custo Unitário de Referência",null,null,"Minas Gerais"]
[{"$nulls":4}," Janeiro/2026",null,null,"Produção da equipe ",435.75,{"$f":"VLOOKUP(A455,ORÇAMENTO!$A$10:$L$56,7,1)","v":"TXKM"}]
[null,5915320,"TRANSPORTE COM CAMINHÃO BASCULANTE, EM VIA COM REVESTIMENTO PRIMÁRIO",{"$nulls":5},"Valores em reais (R$)"]
[null,"A - EQUIPAMENTOS",null,"Quantidade","Utilização",null,"Custo Horário",null,null,"Custo"]
[{"$nulls":4},"Operativa","Improdutiva","Produtivo","Improdutivo",null,"Horário Total"]
[null,"E9667","Caminhão basculante com capacidade de 14 m³ - 210 kW",1,1,0,322.66559999999998,97.340599999999995,null,{"$f":"D462*(E462*G462+F462*H462)","v":322.66559999999998}]
[null,"-","-",null,null,null,0,0,null,0]
[{"$nulls":7},"Custo horário total de equipamentos",null,{"$f":"SUM(J462:J463)","v":322.66559999999998}]
[null,"B - MÃO DE OBRA",null,"Quantidade","Unidade",null,"Custo Horário","Custo Horário Total"]
[null,"-","-",null,"-",null,0,null,null,{"$f":"D466*G466","v":0}]
[null,"-","-",null,"-",null,0,null,null,0]
[null,null,null,"Custo horário total de mão de obra",{"$nulls":5},{"$f":"SUM(J466:J467)","v":0}]
[null,null,null,"Custo horário total de execução",{"$nulls":5},{"$f":"J464+J468","v":322.66559999999998}]
[null,null,null,"Custo unitário de execução",{"$nulls":5},{"$f":"J469/I458","v":0.74048330464716006}]
[{"$nulls":7},"Custo do FIC",null,7.4000000000000003E-3]
[{"$nulls":7},"Custo do FIT",null,0]
[null,"C - MATERIAL",null,"Quantidade","Unidade",null,"Preço Unitário","Custo Unitário"]
[null,"-","-",0,"-",null,0,null,null,{"$f":"D474*G474","v":0}]
[null,"-","-",0,"-",null,0,null,null,0]
[null,null,null,"Custo unitário total de material",{"$nulls":5},{"$f":"SUM(J474:J475)","v":0}]
[null,"D - ATIVIDADES AUXILIARES",null,"Quantidade","Unidade",null,"Custo Unitário","Custo Unitário"]
[null,"-","-",0,"-",null,0,null,null,{"$f":"D478*G478","v":0}]
[null,"-","-",0,"-",null,0,null,null,0]
[null,null,null,"Custo total de atividades auxiliares",{"$nulls":5},{"$f":"SUM(J478:J479)","v":0}]
[{"$nulls":7},"Subtotal",null,{"$f":"J470+J476+J480+J471+J472","v":0.74788330464716002}]
[null,"E - TEMPO FIXO",null,"Código","Quantidade","Unidade",null,"Custo Unitário","Custo Unitário"]
[null,"-","-","-",null,"-",null,0,null,{"$f":"ROUNDDOWN(E483*H483,4)","v":0}]
[null,"-","-","-",null,"-",null,0,null,{"$f":"ROUNDDOWN(E484*H484,4)","v":0}]
[null,null,null,"Custo unitário total de tempo fixo",{"$nulls":5},{"$f":"SUM(J483:J484)","v":0}]
[null,"F - MOMENTO DE TRANSPORTE",null,"Quantidade","Unidade","DMT",null,null,null,"Custo Unitário"]
[{"$nulls":5},"LN","RP","P"]
[null,"-","-",null,"tkm"]
[null,"-","-",null,"tkm"]
[null,null,null,"Custo unitário total de transporte"]
[{"$nulls":5},"Custo unitário direto total",null,null,null,{"$f":"TRUNC(J481+J485,2)","v":0.74}]
[null,"Obs."]
[]
[17,"1ª/GRD",{"$nulls":8},{"$f":"J530","v":0.83}]
[null,"OBRA:"," PAVIMENTAÇÃO EM BLOQUETE SEXTAVADOS - RUAS DIVERSAS DO MUNICÍPIO DE MATA VERDE / MG"]
[null,"Custo Unitário de Referência",null,null,"Minas Gerais"]
[{"$nulls":4}," Janeiro/2026",null,null,"Produção da equipe ",231.3,{"$f":"VLOOKUP(A494,ORÇAMENTO!$A$10:$L$56,7,1)","v":"TXKM"}]
[null,5914434,"TRANSPORTE COM CAMINHÃO CARROCERIA, EM VIA URBANA PAVIMENTADA",{"$nulls":5},"Valores em reais (R$)"]
[null,"A - EQUIPAMENTOS",null,"Quantidade","Utilização",null,"Custo Horário",null,null,"Custo"]
[{"$nulls":4},"Operativa","Improdutiva","Produtivo","Improdutivo",null,"Horário Total"]
[null,"E9508","Caminhão carroceria com capacidade de 9 t - 136 kW",1,1,0,192.083,75.035300000000007,null,{"$f":"D501*(E501*G501+F501*H501)","v":192.083}]
[null,"-","-",null,null,null,0,0,null,0]
[{"$nulls":7},"Custo horário total de equipamentos",null,{"$f":"SUM(J501:J502)","v":192.083}]
[null,"B - MÃO DE OBRA",null,"Quantidade","Unidade",null,"Custo Horário","Custo Horário Total"]
[null,"-","-",0,"-",null,0,null,null,{"$f":"D505*G505","v":0}]
[null,"-","-",0,"-",null,0,null,null,0]
[null,null,null,"Custo horário total de mão de obra",{"$nulls":5},{"$f":"SUM(J505:J506)","v":0}]
[null,null,null,"Custo horário total de execução",{"$nulls":5},{"$f":"J503+J507","v":192.083}]
[null,null,null,"Custo unitário de execução",{"$nulls":5},{"$f":"J508/I497","v":0.8304496325118893}]
[{"$nulls":7},"Custo do FIC",null,0]
[{"$nulls":7},"Custo do FIT",null,0]
[null,"C - MATERIAL",null,"Quantidade","Unidade",null,"Preço Unitário","Custo Unitário"]
[null,"-","-",0,"-",null,0,null,null,{"$f":"D513*G513","v":0}]
[null,"-","-",0,"-",null,0,null,null,0]
[null,null,null,"Custo unitário total de material",{"$nulls":5},{"$f":"SUM(J513:J514)","v":0}]
[null,"D - ATIVIDADES AUXILIARES",null,"Quantidade","Unidade",null,"Custo Unitário","Custo Unitário"]
[null,"-","-",0,"-",null,0,null,null,{"$f":"D517*G517","v":0}]
[null,"-","-",0,"-",null,0,null,null,0]
[null,null,null,"Custo total de atividades auxiliares",{"$nulls":5},{"$f":"SUM(J517:J518)","v":0}]
[{"$nulls":7},"Subtotal",null,{"$f":"J509+J515+J519+J510+J511","v":0.8304496325118893}]
[null,"E - TEMPO FIXO",null,"Código","Quantidade","Unidade",null,"Custo Unitário","Custo Unitário"]
[null,"-","-","-",null,"-",null,0,null,{"$f":"ROUNDDOWN(E522*H522,4)","v":0}]
[null,"-","-","-",null,"-",null,0,null,{"$f":"ROUNDDOWN(E523*H523,4)","v":0}]
[null,null,null,"Custo unitário total de tempo fixo",{"$nulls":5},{"$f":"SUM(J522:J523)","v":0}]
[null,"F - MOMENTO DE TRANSPORTE",null,"Quantidade","Unidade","DMT",null,null,null,"Custo Unitário"]
[{"$nulls":5},"LN","RP","P"]
[null,"-","-",null,"tkm"]
[null,"-","-",null,"tkm"]
[null,null,null,"Custo unitário total de transporte"]
[{"$nulls":5},"Custo unitário direto total",null,null,null,{"$f":"TRUNC(J520+J524,2)","v":0.83}]
[null,"Obs."]
[]
[20,"1ª/GRD",{"$nulls":8},{"$f":"J569","v":50.18}]
[null,"OBRA:"," PAVIMENTAÇÃO EM BLOQUETE SEXTAVADOS - RUAS DIVERSAS DO MUNICÍPIO DE MATA VERDE / MG"]
[null,"Custo Unitário de Referência",null,null,"Minas Gerais"]
[{"$nulls":4}," Janeiro/2026",null,null,"Produção da equipe ",4.3554006968641117,{"$f":"VLOOKUP(A533,ORÇAMENTO!$A$10:$L$56,7,1)","v":"M"}]
[null,94273,"ASSENTAMENTO DE GUIA (MEIO-FIO) EM TRECHO RETO, CONFECCIONADA EM CONCRETO PRÉ-FABRICADO, DIMENSÕES 100X15X13X30 CM (COMPRIMENTO X BASE INFERIOR X BASE SUPERIOR X ALTURA). ",{"$nulls":5},"Valores em reais (R$)"]
[null,"A - EQUIPAMENTOS",null,"Quantidade","Utilização",null,"Custo Horário",null,null,"Custo"]
[{"$nulls":4},"Operativa","Improdutiva","Produtivo","Improdutivo",null,"Horário Total"]
[null,"-","-",0,0,0,0,0,null,{"$f":"D540*(E540*G540+F540*H540)","v":0}]
[null,"-","-",null,null,null,0,0,null,0]
[{"$nulls":7},"Custo horário total de equipamentos",null,{"$f":"SUM(J540:J541)","v":0}]
[null,"B - MÃO DE OBRA",null,"Quantidade","Unidade",null,"Custo Horário","Custo Horário Total"]
[null,"P9821","Pedreiro",1,"h",null,27.839500000000001,null,null,{"$f":"D544*G544","v":27.839500000000001}]
[null,"P9824","Servente",1,"h",null,21.684899999999999,null,null,21.684899999999999]
[null,null,null,"Custo horário total de mão de obra",{"$nulls":5},{"$f":"SUM(J544:J545)","v":49.5244}]
[null,null,null,"Custo horário total de execução",{"$nulls":5},{"$f":"J542+J546","v":49.5244}]
[null,null,null,"Custo unitário de execução",{"$nulls":5},{"$f":"J547/I536","v":11.37080224}]
[{"$nulls":7},"Custo do FIC",null,0]
[{"$nulls":7},"Custo do FIT",null,0]
[null,"C - MATERIAL",null,"Quantidade","Unidade",null,"Preço Unitário","Custo Unitário"]
[null,"M0028","Areia média",6.6E-3,"m³",null,35,"IL EXTRAÇÃO DE AREIA",null,{"$f":"D552*G552","v":0.23100000000000001}]
[null,4059,"Meio-fio ou guia de concreto, pre-moldado, comp. 1m*30x 12/15* cm (HxL1/L2)",1.0049999999999999,"m",null,37.5,"PRÉ MOLDADOS PAIS E FILHOS",null,37.687499999999993]
[null,null,null,"Custo unitário total de material",{"$nulls":5},{"$f":"SUM(J552:J553)","v":37.918499999999995}]
[null,"D - ATIVIDADES AUXILIARES",null,"Quantidade","Unidade",null,"Custo Unitário","Custo Unitário"]
[null,1109669,"Argamassa de cimento e areia 1:3 - confecção em betoneira e lançamento manual - areia comercial",1.8E-3,"m³",null,494.85,null,null,{"$f":"D556*G556","v":0.89073000000000002}]
[null,"-","-",null,"-",null,0,null,null,0]
[null,null,null,"Custo total de atividades auxiliares",{"$nulls":5},{"$f":"SUM(J556:J557)","v":0.89073000000000002}]
[{"$nulls":7},"Subtotal",null,{"$f":"J548+J554+J558+J549+J550","v":50.180032239999996}]
[null,"E - TEMPO FIXO",null,"Código","Quantidade","Unidade",null,"Custo Unitário","Custo Unitário"]
[null,"-","-","-",null,"-",null,0,null,{"$f":"ROUNDDOWN(E561*H561,4)","v":0}]
[null,"-","-","-",null,"-",null,0,null,{"$f":"ROUNDDOWN(E562*H562,4)","v":0}]
[null,null,null,"Custo unitário total de tempo fixo",{"$nulls":5},{"$f":"SUM(J561:J562)","v":0}]
[null,"F - MOMENTO DE TRANSPORTE",null,"Quantidade","Unidade","DMT",null,null,null,"Custo Unitário"]
[{"$nulls":5},"LN","RP","P"]
[null,"-","-",null,"tkm"]
[null,"-","-",null,"tkm"]
[null,null,null,"Custo unitário total de transporte"]
[{"$nulls":5},"Custo unitário direto total",null,null,null,{"$f":"TRUNC(J559+J563,2)","v":50.18}]
[null,"Obs."]
[]
[22,"1ª/GRD",{"$nulls":8},{"$f":"J610","v":32.630000000000003}]
[null,"OBRA:"," PAVIMENTAÇÃO EM BLOQUETE SEXTAVADOS - RUAS DIVERSAS DO MUNICÍPIO DE MATA VERDE / MG"]
[null,"Custo Unitário de Referência",null,null,"Minas Gerais"]
[{"$nulls":4}," Janeiro/2026",null,null,"Produção da equipe ",1,{"$f":"VLOOKUP(A572,ORÇAMENTO!$A$10:$L$56,7,1)","v":"M"}]
[null,"94287a","EXECUÇÃO DE SARJETA DE CONCRETO USINADO, MOLDADA IN LOCO EM TRECHO RETO, 30 CM BASE X 5 CM ALTURA. ",{"$nulls":5},"Valores em reais (R$)"]
[null,"A - EQUIPAMENTOS",null,"Quantidade","Utilização",null,"Custo Horário",null,null,"Custo"]
[{"$nulls":4},"Operativa","Improdutiva","Produtivo","Improdutivo",null,"Horário Total"]
[null,"-","-",0,0,0,0,0,null,{"$f":"D579*(E579*G579+F579*H579)","v":0}]
[null,"-","-",null,null,null,0,0,null,0]
[{"$nulls":7},"Custo horário total de equipamentos",null,{"$f":"SUM(J579:J580)","v":0}]
[null,"B - MÃO DE OBRA",null,"Quantidade","Unidade",null,"Custo Horário","Custo Horário Total"]
[null,"P9821","Pedreiro",0.2326,"h",null,27.839500000000001,null,null,{"$f":"D583*G583","v":6.4754677000000003}]
[null,"P9824","Servente",0.2326,"h",null,21.684899999999999,null,null,{"$f":"D584*G584","v":5.0439077399999999}]
[null,null,null,"Custo horário total de mão de obra",{"$nulls":5},{"$f":"SUM(J583:J584)","v":11.519375440000001}]
[null,null,null,"Custo horário total de execução",{"$nulls":5},{"$f":"J581+J585","v":11.519375440000001}]
[null,null,null,"Custo unitário de execução",{"$nulls":5},{"$f":"J586/I575","v":11.519375440000001}]
[{"$nulls":7},"Custo do FIC",null,"-"]
[{"$nulls":7},"Custo do FIT",null,"-"]
[null,"C - MATERIAL",null,"Quantidade","Unidade",null,"Preço Unitário","Custo Unitário"]
[null,"M0082","Areia média lavada",9.9000000000000008E-3,"m³",null,35,"IL EXTRAÇÃO ALMENARA",null,{"$f":"D591*G591","v":0.34650000000000003}]
[null,34492,"Concreto usinado bombeável, classe de resistência C20, com brita 0 e 1, slump = 100 +/- 20 mm, exclui serviço de bombeamento (NBR 8953)",3.7600000000000001E-2,"m³",null,509,"SINAPI",null,19.138400000000001]
[null,6212,"Tabua *2,5 x 7,5* cm em pinus, mista ou equivalente da região - bruta.",8.3299999999999999E-2,"m",null,13.02,null,null,1.0845659999999999]
[null,4517,"Sarrafo *2,5 x 7,5* cm em pinus, mista ou equivalente da região - bruta.",0.2,"m",null,2.74,null,null,0.54800000000000004]
[null,null,null,"Custo unitário total de material",{"$nulls":5},{"$f":"SUM(J591:J594)","v":21.117466}]
[null,"D - ATIVIDADES AUXILIARES",null,"Quantidade","Unidade",null,"Custo Unitário","Custo Unitário"]
[null,"-","-",0,"-",null,0,null,null,{"$f":"D597*G597","v":0}]
[null,"-","-",0,"-",null,0,null,null,0]
[null,null,null,"Custo total de atividades auxiliares",{"$nulls":5},{"$f":"SUM(J597:J598)","v":0}]
[{"$nulls":7},"Subtotal",null,{"$f":"J587+J595+J599","v":32.636841439999998}]
[null,"E - TEMPO FIXO",null,"Código","Quantidade","Unidade",null,"Custo Unitário","Custo Unitário"]
[null,"-","-","-",null,"-",null,0,null,{"$f":"ROUNDDOWN(E602*H602,4)","v":0}]
[null,"-","-","-",null,"-",null,0,null,{"$f":"ROUNDDOWN(E603*H603,4)","v":0}]
[null,null,null,"Custo unitário total de tempo fixo",{"$nulls":5},{"$f":"SUM(J602:J603)","v":0}]
[null,"F - MOMENTO DE TRANSPORTE",null,"Quantidade","Unidade","DMT",null,null,null,"Custo Unitário"]
[{"$nulls":5},"LN","RP","P"]
[null,"-","-",null,"tkm"]
[null,"-","-",null,"tkm"]
[null,null,null,"Custo unitário total de transporte"]
[{"$nulls":5},"Custo unitário direto total",null,null,null,{"$f":"TRUNC(J600+J604,2)","v":32.630000000000003}]
[null,"Obs."]

{"sheet":"AUX-VEIC.","index":2,"n_rows":31,"n_cols":5,"rows_kept":31,"cut":false,"hidden":false,"merged":[[26,2,26,3],[27,2,27,3],[28,2,28,3],[29,1,30,1],[29,2,29,3],[30,2,30,3],[25,2,25,3],[1,1,1,4],[2,1,2,2],[3,1,3,4],[17,1,17,4],[18,2,18,3],[19,2,19,3],[20,2,20,3],[21,2,21,3],[22,2,22,3],[23,2,23,3],[24,2,24,3]]}
[]
[null,"CÁLCULO DO CUSTO POR MÊS DE VEÍCULOS"]
[null,"Veículo: Polo TSI, Onix Turbo, Argo 1.3, HB-20 Turbo",null,"Data:","2026-01-20"]
[null,"DADOS ELEMENTARES DO VEÍCULO"]
[null,"Dados Básicos","Preço (R$)","Quantidade","Vida Útil"]
[null,"Quilometragem média mensal",null,3000]
[null,"Valor de Aquisição (VA)",108890]
[null,"Taxa de Juros (i)%",null,15]
[null,"IPVA e Seguro Obrigatório (4%)",4355.6000000000004]
[null,"Lavagem",50,2]
[null,"Pneus",499.9,4,50000]
[null,"Combustível",6.18,14]
[null,"Óleo Lubrificante + Filtros (revisão)",846.74400000000003,1,10000]
[null,"Seguro Total Anual",3378.94]
[null,"Jogo de Amortecedores",1246.5,null,50000]
[null,"Coeficiente de Manutenção",null,4.7999999999999998E-6]
[null,"Motorista",3038.2740182832176,1]
[null,"CÁLCULO DO CUSTO POR MÊS"]
[null,"DEPRECIAÇÃO","D = (VA-0,60xVA) / 12 x 5",null,725.93333333333328]
[null,"JUROS","J = (VA-0,60xVA) x i / 12",null,544.45000000000005]
[null,"LICENCIAMENTO","L = (IPVA=SEG.OBRIG.)/12",null,362.97]
[null,"SEGURO TOTAL","ST = SEGURO ANUAL/12",null,281.58]
[null,"COMBUSTÍVEL","OD = (Comb./Consu)x Km.mês",null,1324.29]
[null,"ÓLEO LUBRIFICANTE","OL = ((Ol. X Quant)/Vida Útil)xKm.mês)",null,254.02]
[null,"LAVAGEM","LL = Preço Lavagem x Quantidade",null,100]
[null,"PNEUS","P = ((P. PneusxQuant)/Vida Útil)xkm.mês)",null,119.98]
[null,"AMORTECEDORES","AM = (P. Amort/Vida Útil)xkm.mês",null,74.790000000000006]
[null,"MANUTENÇÃO","M = (VA-VPxK)xkm.mês",null,627.21]
[null,"MOTORISTA","MOT = SALÁRIO+LEIS SOCIAIS",null,5276.87]
[null,"CUSTO POR MÊS","SEM MOTORISTA",null,4415.2233333333334]
[null,null,"COM MOTORISTA",null,9692.0933333333342]

{"sheet":"BDI SERV","index":3,"n_rows":60,"n_cols":5,"rows_kept":60,"cut":false,"hidden":false,"merged":[[36,0,36,5],[38,1,38,4],[39,2,39,3],[35,0,35,5],[0,1,2,4],[25,1,25,3],[26,1,26,2],[26,3,26,4],[27,3,27,4]]}
[null,"DETALHAMENTO DO BDI - SERVIÇOS"]
[]
[]
[null,"Item","Descrição dos Serviços","% - PV","% - CD"]
[]
[null,1,"ADMINISTRAÇÃO CENTRAL"," ",{"$f":"SUM(E7:E9)","v":4.01}]
[null,"1.1","ESCRITÓRIO CENTRAL",null,4.01]
[null,"1.2","VIAGENS"]
[null,"1.3","OUTROS"]
[null," "," "," "," "]
[null,2,"IMPOSTOS E TAXAS",{"$f":"SUM(D12:D15)","v":8.65},{"$f":"SUM(E12:E15)","v":0}]
[null,"2.1","ISS - Proposta",{"$f":"D34*100","v":5}]
[null,"2.2","PIS",0.65]
[null,"2.3","Cofins",3]
[null,"2.4","Contribuição Previdenciaria (CPRB)"]
[]
[null,3,"TAXA DE RISCO",null,{"$f":"SUM(E18:E20)","v":0.96}]
[null,"3.1","SEGURO",null,0.2]
[null,"3.2","RISCO",null,0.56000000000000005]
[null,"3.3","GARANTIA",null,0.2]
[]
[null,4,"DESPESAS FINANCEIRAS",null,1.1100000000000001]
[]
[null,5,"LUCRO",null,8]
[]
[null,"BDI APRESENTADO:",null,null,{"$f":"IF($D$41=$C$43,$D$43,IF($D$41=$C$44,$D$44,IF($D$41=$C$44,$D$44,IF($D$41=$C$45,$D$45,0))))","v":25.48}]
[]
[null,null,"Legislação Municipal:","Lei nº 087/95"]
[null,null,"Município:","Mata Verde"]
[null,null,"Alíquota ISSQN:",0.05,"Município"]
[null,null,"Base de Cálculo:",1,"Mata Verde"]
[null,null,"Valor Serviço:",1195937.0900000001]
[null,null,"Dedução - Material (estimado):",null,{"$f":"D33/D32","v":0}]
[null,null,"ISSQN BDI:",{"$f":"IF(D32=\"\",0,ROUND(IF(D31=D49,((1-(D33/D32))*D30),D30*D31),4))","v":0.05},"(*)"]
[]
["Acórdão nº 2.622/2013 - TCU Plenário"]
["BDI = ARRED((((((1+(AC+TR)/100)*(1+DF/100)*(1+L/100))/(1-IMP/100))-1)*100);2)"]
[]
[null,"(*) É obrigação da licitante a verificação da Legislação Tributária vigente no município, bem como o cálculo dos valores totais de serviços e materiais estimados, para apresentação de sua proposta."]
[]
[null,null,"Forma de Cálculo do BDI:","BDI - Acórdão nº 2.622/2013 - TCU"]
[]
[null,null,"BDI - Digitado",{"$f":"ROUND(E6+E11+E17+E22+E24,2)","v":14.08}]
[null,null,"BDI - Calculado",{"$f":"ROUND((((1+(E6/100+E22/100+E17/100))/(1-(D11/100+E24/100)))-1)*100,2)","v":27.27}]
[null,null,"BDI - Acórdão nº 2.622/2013 - TCU",{"$f":"ROUND((((((1+(E6+E17)/100)*(1+E22/100)*(1+E24/100))/(1-D11/100))-1)*100),2)","v":25.48}]
[]
[]
[]
[null,null,null,"Dedução - Material","Município"]
[null,null,null,0.1,"Simples Nacional"]
[null,null,null,0.2,"Municípios Indefinidos"]
[null,null,null,0.3]
[null,null,null,0.4]
[null,null,null,0.5]
[null,null,null,0.6]
[null,null,null,0.7]
[null,null,null,0.8]
[null,null,null,0.9]
[null,null,null,1]
[null,null,null,{"$f":"E31","v":"Mata Verde"}]

{"sheet":"CRONOGRAMA","index":4,"n_rows":17,"n_cols":12,"rows_kept":17,"cut":false,"hidden":false,"merged":[[13,1,14,2],[16,1,20,11],[7,2,8,2],[9,2,10,2],[11,2,12,2],[7,1,8,1],[9,1,10,1],[11,1,12,1],[7,0,8,0],[9,0,10,0],[11,0,12,0],[0,1,0,11],[1,6,1,11],[2,6,2,11],[3,1,3,6],[5,0,6,0],[5,2,6,2],[1,1,2,1],[5,1,6,1],[1,2,2,4]]}
[null,"CRONOGRAMA FÍSICO-FINANCEIRO"]
[null,"OBRA: ",{"$f":"ORÇAMENTO!C5","v":" PAVIMENTAÇÃO EM BLOQUETE SEXTAVADOS - RUAS DIVERSAS DO MUNICÍPIO DE MATA VERDE / MG"},null,null,"VALOR:",{"$f":"ORÇAMENTO!L29","v":1500000.87}]
[{"$nulls":5},"PRAZO: ","180 DIAS "]
[]
[null,"ITEM","ETAPAS/DESCRIÇAO","FISICO/  FINANCEIRO","TOTAL    ETAPAS","MÊS 1","MÊS 2","MÊS 3","MÊS 4","MÊS 5","MÊS 6","TOTAL"]
["A",{"$f":"VLOOKUP(A6,ORÇAMENTO!$A$10:$L$29,2)","v":1},{"$f":"VLOOKUP(A6,ORÇAMENTO!$A$10:$L$29,5)","v":"SERVIÇOS PRELIMINARES "},"FISICO ",{"$f":"ROUND(E7/$G$2,4)","v":0.1222},0.2,0.2,0.15,0.15,0.15,0.15,{"$f":"SUM(F6:K6)","v":1}]
[null,null,null,"FINANCEIRO",{"$f":"ORÇAMENTO!L10","v":183251.37},{"$f":"ROUND($E$7*F6,2)","v":36650.269999999997},{"$f":"ROUND($E$7*G6,2)","v":36650.269999999997},{"$f":"ROUND($E$7*H6,2)","v":27487.71},{"$f":"ROUND($E$7*I6,2)","v":27487.71},{"$f":"ROUND($E$7*J6,2)","v":27487.71},27487.71,183251.37999999998]
["B",{"$f":"VLOOKUP(A8,ORÇAMENTO!$A$10:$L$29,2)","v":2},{"$f":"VLOOKUP(A8,ORÇAMENTO!$A$10:$L$29,5)","v":"TERRAPLANAGEM E PAVIMENTAÇÃO"},"FISICO ",{"$f":"ROUND(E9/$G$2,4)","v":0.52829999999999999},0.2,0.2,0.2,0.15,0.15,0.1,1.0000000000000002]
[null,null,null,"FINANCEIRO",{"$f":"ORÇAMENTO!L17","v":792393.5},{"$f":"ROUND($E$9*F8,2)","v":158478.70000000001},{"$f":"ROUND($E$9*G8,2)","v":158478.70000000001},{"$f":"ROUND($E$9*H8,2)","v":158478.70000000001},{"$f":"ROUND($E$9*I8,2)","v":118859.03},{"$f":"ROUND($E$9*J8,2)","v":118859.03},79239.350000000006,792393.51]
["C",{"$f":"VLOOKUP(A10,ORÇAMENTO!$A$10:$L$29,2)","v":3},{"$f":"VLOOKUP(A10,ORÇAMENTO!$A$10:$L$29,5)","v":"TRANSPORTE DE MATERIAIS"},"FISICO ",{"$f":"ROUND(E11/$G$2,4)","v":0.14799999999999999},0.15,0.15,0.2,0.2,0.15,0.15,1]
[null,null,null,"FINANCEIRO",{"$f":"ORÇAMENTO!L22","v":221945},{"$f":"ROUND($E$11*F10,2)","v":33291.75},{"$f":"ROUND($E$11*G10,2)","v":33291.75},{"$f":"ROUND($E$11*H10,2)","v":44389},{"$f":"ROUND($E$11*I10,2)","v":44389},{"$f":"ROUND($E$11*J10,2)","v":33291.75},33291.75,221945]
["D",{"$f":"VLOOKUP(A12,ORÇAMENTO!$A$10:$L$29,2)","v":4},{"$f":"VLOOKUP(A12,ORÇAMENTO!$A$10:$L$29,5)","v":"DRENAGEM E OBRAS COMPLEMENTARES"},"FISICO ",{"$f":"ROUND(E13/$G$2,4)","v":0.2016},0.1,0.1,0.2,0.2,0.2,0.2,1]
[null,null,null,"FINANCEIRO",{"$f":"ORÇAMENTO!L26","v":302411},{"$f":"ROUND($E$13*F12,2)","v":30241.1},{"$f":"ROUND($E$13*G12,2)","v":30241.1},{"$f":"ROUND($E$13*H12,2)","v":60482.2},{"$f":"ROUND($E$13*I12,2)","v":60482.2},{"$f":"ROUND($E$13*J12,2)","v":60482.2},60482.2,302411]
[null,"TOTAL",null,"FISICO ",{"$f":"SUM(F14:H14)","v":0.53877385417783119},{"$f":"F15/E15","v":0.1724411133174876},{"$f":"G15/$E$15","v":0.1724411133174876},{"$f":"H15/$E$15","v":0.19389162754285599},{"$f":"I15/$E$15","v":0.16747852952911954},{"$f":"J15/$E$15","v":0.16008036715338705},0.13366726247298777,1.0000000133333256]
[null,null,null,"FINANCEIRO",{"$f":"E11+E9+E7+E13","v":1500000.87},{"$f":"F11+F9+F7+F13","v":258661.82},{"$f":"G11+G9+G7+G13","v":258661.82},{"$f":"H11+H9+H7+H13","v":290837.61},{"$f":"I11+I9+I7+I13","v":251217.94},{"$f":"J11+J9+J7+J13","v":240120.69},200501.01,{"$f":"ROUNDUP(SUM(F15:K15),2)-0.02","v":1500000.8699999999}]
[]
[null,"OBSERVAÇÕES:"]