{"text_format":"2","workbook":"xlsx","n_sheets":15,"sheets":["Resumo","PFP1","CRFF","PFP2.1_FatorKa","PFP2.2_FatorKb","PFP3_FatorKc","COMPOSIÇÕES","CPU-VEICULO_PickUp","CPU-VEICULO_Leve","CPU HOSPEDAGEM","SICRO PESSOAL","SICRO EQUIPAMENTOS","DNIT Rel. Consolidação de M.O.","DNIT Rel. Consolidação de C.G.","LISTA ORCAFASCIO"],"not_rendered":{"charts":0,"images":26,"macros":0,"external_links":337,"defined_names":54199,"comments":1,"pivot_tables":0},"unopened":[],"bounds":{"document_bytes":16777216,"sheet_cells":100000,"run_cost":"one","rows_first":2000,"rows_last":500,"rows_between":2000,"halvings":0,"cell_chars":16384,"cell_head_chars":4096},"cells_cut":0,"cells_raw":0,"read":"whole","date_system":"1900"}

{"sheet":"Resumo","index":0,"n_rows":18,"n_cols":14,"rows_kept":18,"cut":false,"hidden":false,"merged":[[14,7,14,8],[16,7,16,8],[17,7,17,8],[14,0,14,6],[7,1,8,1],[7,2,8,2],[3,0,4,8],[5,0,5,5],[5,7,5,8],[6,7,6,8],[7,7,7,8],[7,0,8,0],[7,3,8,3],[7,5,8,5],[7,6,8,6],[6,0,6,6],[7,4,8,4]]}
[{"$nulls":7},"SICRO:","2025-07-01"]
[{"$nulls":7},"SINAPI:","2025-09-01"]
[{"$nulls":7},"DATA BASE:","2025-10-01",{"$nulls":4},"73km por área"]
["RESUMO DO ORÇAMENTO REFERENCIAL",{"$nulls":12},"3 áreas"]
[{"$nulls":13},{"$f":"3*73","v":219}]
["PROJETO:",{"$nulls":6},"CONTRATANTE:"]
["CONTRATAÇÃO DE SERVIÇOS DE ENGENHARIA PARA APOIO E SUPERVISÃO TÉCNICO ADMINISTRATIVO NA GESTÃO DE CONTRATOS E CONVÊNIOS DE QUALIFICAÇÃO VIÁRIA NA ÁREA DE ATUAÇÃO 14ª SUPERINTENDÊNCIA REGIONAL DA CODEVASF, NO ESTADO DO CEARÁ.",{"$nulls":6},"CODEVASF (14ª/SR)"]
["GRUPO 1 - ITEM","DESCRIÇÃO","UNIDADE","QDE","R$ UNITÁRIO POR EQUIPE","FREQUENCIA","QDE / PRAZO","VALORES - R$"]
[{"$nulls":7},"UNITÁRIO (SRP)","TOTAL"]
[1,{"$f":"'PFP1'!E9","v":"APOIO À FISCALIZAÇÃO 1"},"UNID.",1,{"$f":"TRUNC(H10/D10,2)","v":46198.78},"MENSAL",12,{"$f":"SUM('PFP1'!L10,'PFP1'!L15,'PFP1'!L17)","v":46198.78},{"$f":"G10*H10","v":554385.36}]
{"$rows_left_out":9}
{"sheet":"PFP1","index":1,"n_rows":61,"n_cols":28,"rows_kept":61,"cut":false,"hidden":false,"merged":[[3,10,3,11],[4,10,4,11],[5,0,5,5],[5,6,5,9],[5,10,5,11],[3,0,4,9],[6,0,6,5],[6,6,6,9],[6,10,6,11],[46,0,46,7],[46,8,46,11],[26,4,26,9],[9,4,9,9],[29,4,29,9],[14,4,14,9],[16,4,16,9],[19,4,19,9],[22,4,22,9],[30,9,45,9],[50,0,50,9],[50,10,50,11],[51,0,51,9],[60,0,60,11],[52,0,52,9],[52,10,52,11],[53,0,53,11],[54,0,54,11],[55,0,55,11],[56,0,56,11],[57,0,57,11],[58,0,58,11],[59,0,59,11],[47,0,47,7],[47,8,47,11],[48,0,48,7],[48,8,48,11],[49,0,49,9],[49,10,49,11]]}
[{"$nulls":10},"SICRO:","2025-07-01"]
[{"$nulls":10},"SINAPI:","2025-09-01"]
[{"$nulls":10},"DATA BASE:","2025-10-01"]
["PROPOSTA FINANCEIRA DO PROJETO",{"$nulls":9},"CODIGO:"]
[{"$nulls":10},"PFP-1"]
["PROJETO:",{"$nulls":5},"CONTRATANTE:",null,null,null,"EDITAL:"]
[{"$f":"Resumo!A7","v":"CONTRATAÇÃO DE SERVIÇOS DE ENGENHARIA PARA APOIO E SUPERVISÃO TÉCNICO ADMINISTRATIVO NA GESTÃO DE CONTRATOS E CONVÊNIOS DE QUALIFICAÇÃO VIÁRIA NA ÁREA DE ATUAÇÃO 14ª SUPERINTENDÊNCIA REGIONAL DA CODEVASF, NO ESTADO DO CEARÁ."},{"$nulls":5},"CODEVASF (14ª/SR)"]
["Base","Código","Cod.","Item","Categoria / Insumo","Uni","Qde","CUD","PU","FatorK","CT","PT"]
[null,null,"MO","1","APOIO À FISCALIZAÇÃO 1","unid","12",null,null,null,{"$f":"SUM(K10,K15,K17)","v":25498.530000000002},{"$f":"TRUNC(SUM(L10,L15,L17)*G9,2)","v":554385.36},null,"Encargos Comp e Adicionais"]
["CO","CO","DP","1.1","Pessoal",{"$nulls":5},{"$f":"SUM(K11:K14)","v":19026.480000000003},{"$f":"TRUNC(SUM(L11:L14),2)","v":38469.86},null,{"$f":"VLOOKUP(B11,'DNIT Rel. Consolidação de M.O.'!$A:$Z,26,0)","v":1123.0699999999997}]
{"$rows_left_out":52}
{"sheet":"CRFF","index":2,"n_rows":28,"n_cols":20,"rows_kept":28,"cut":false,"hidden":false,"merged":[[18,18,18,19],[0,0,0,15],[1,0,1,19],[2,0,2,19],[3,0,6,6],[3,7,6,14],[3,15,6,19],[9,0,10,0],[9,1,10,1],[11,0,12,0],[11,1,12,1],[15,0,16,0],[15,1,16,1],[13,0,14,0],[13,1,14,1],[8,3,8,4],[24,15,24,19],[19,0,19,1],[20,0,20,1],[21,0,21,1],[22,0,22,1],[23,0,23,19],[24,0,24,14]]}
["CRONOGRAMA FÍSICO FINANCEIRO"]
[{"$f":"Resumo!A6","v":"PROJETO:"}]
[]
[{"$f":"Resumo!A7","v":"CONTRATAÇÃO DE SERVIÇOS DE ENGENHARIA PARA APOIO E SUPERVISÃO TÉCNICO ADMINISTRATIVO NA GESTÃO DE CONTRATOS E CONVÊNIOS DE QUALIFICAÇÃO VIÁRIA NA ÁREA DE ATUAÇÃO 14ª SUPERINTENDÊNCIA REGIONAL DA CODEVASF, NO ESTADO DO CEARÁ."},{"$nulls":6},{"$f":"Resumo!H7","v":"CODEVASF (14ª/SR)"}]
[]
[]
[]
["Item","Descrição","Total Por Etapa","30 DIAS","60 DIAS","30 DIAS","60 DIAS","90 DIAS","120 DIAS","150 DIAS","180 DIAS","210 DIAS","240 DIAS","270 DIAS","300 DIAS","330 DIAS","360 DIAS","30 DIAS","60 DIAS","90 DIAS"]
[null,"EMISSÃO OS",null,"Limite máx"]
["1.0","APOIO À FISCALIZAÇÃO 1",{"$f":"SUM(F10:T10)","v":1},null,null,8.3299999999999999E-2,8.3299999999999999E-2,8.3299999999999999E-2,8.3299999999999999E-2,8.3299999999999999E-2,8.3299999999999999E-2,8.3299999999999999E-2,8.3299999999999999E-2,8.3400000000000002E-2,8.3400000000000002E-2,8.3400000000000002E-2,8.3400000000000002E-2]
{"$rows_left_out":19}
{"sheet":"PFP2.1_FatorKa","index":3,"n_rows":47,"n_cols":11,"rows_kept":47,"cut":false,"hidden":false,"merged":[[5,2,5,4],[6,0,6,1],[6,2,6,4],[7,4,7,5],[9,1,9,3],[10,1,10,3],[11,1,11,3],[12,1,12,3],[13,1,13,3],[14,1,14,3],[21,1,21,3],[22,1,22,3],[23,1,23,3],[24,1,24,3],[15,1,15,3],[16,1,16,3],[17,1,17,3],[18,1,18,3],[19,1,19,3],[45,0,45,5],[46,0,46,5],[35,1,35,3],[36,1,36,3],[37,1,37,3],[38,4,38,5],[39,4,39,5],[3,0,4,4],[7,0,8,3],[41,0,41,3],[43,0,43,5],[44,0,44,5],[30,1,30,3],[31,1,31,3],[32,1,32,3],[33,1,33,3],[34,1,34,3],[25,1,25,3],[26,1,26,3],[27,1,27,3],[28,1,28,3],[29,1,29,3],[20,1,20,3]]}
[]
[]
[]
["DETALHAMENTO DOS ENCARGOS SOCIAIS: Ka",{"$nulls":4},"CODIGO:"]
[{"$nulls":5},"PFP-2.1"]
["PROJETO:",null,"CONTRATANTE:",null,null,"EDITAL:"]
[{"$f":"'PFP1'!A7","v":"CONTRATAÇÃO DE SERVIÇOS DE ENGENHARIA PARA APOIO E SUPERVISÃO TÉCNICO ADMINISTRATIVO NA GESTÃO DE CONTRATOS E CONVÊNIOS DE QUALIFICAÇÃO VIÁRIA NA ÁREA DE ATUAÇÃO 14ª SUPERINTENDÊNCIA REGIONAL DA CODEVASF, NO ESTADO DO CEARÁ."},null,"CODEVASF (14ª/SR)"]
["DISCRIMINAÇÃO",null,null,null,"VALORES"]
[{"$nulls":4},"%","R$",null,null,null,{"$f":"SUM(J10:J13)","v":0},{"$f":"SUM(K10:K13)","v":0}]
["A","ENCARGOS SOCIAIS BÁSICOS",null,null,{"$f":"ROUND(SUM(E11:E19),4)","v":0.36799999999999999},{"$f":"E10*'PFP1'!$K$9","v":9383.4590400000016}]
{"$rows_left_out":38}
{"sheet":"PFP2.2_FatorKb","index":4,"n_rows":47,"n_cols":8,"rows_kept":47,"cut":false,"hidden":false,"merged":[[5,2,5,4],[6,0,6,1],[6,2,6,4],[7,4,7,5],[9,1,9,3],[10,1,10,3],[11,1,11,3],[12,1,12,3],[13,1,13,3],[14,1,14,3],[15,1,15,3],[16,1,16,3],[17,1,17,3],[19,1,19,3],[20,1,20,3],[21,1,21,3],[22,1,22,3],[23,1,23,3],[24,1,24,3],[25,1,25,3],[26,1,26,3],[27,1,27,3],[28,1,28,3],[29,1,29,3],[30,1,30,3],[43,0,43,5],[44,0,44,5],[45,0,45,5],[46,0,46,5],[3,0,4,4],[7,0,8,3],[36,1,36,3],[37,1,37,3],[38,4,38,5],[39,4,39,5],[41,0,41,3],[31,1,31,3],[32,1,32,3],[33,1,33,3],[34,1,34,3],[35,1,35,3]]}
[]
[]
[]
["DETALHAMENTO DOS ENCARGOS SOCIAIS: Kb",{"$nulls":4},"CODIGO:"]
[{"$nulls":5},"PFP-2.2"]
["PROJETO:",null,"CONTRATANTE:",null,null,"EDITAL:"]
[{"$f":"'PFP1'!A7","v":"CONTRATAÇÃO DE SERVIÇOS DE ENGENHARIA PARA APOIO E SUPERVISÃO TÉCNICO ADMINISTRATIVO NA GESTÃO DE CONTRATOS E CONVÊNIOS DE QUALIFICAÇÃO VIÁRIA NA ÁREA DE ATUAÇÃO 14ª SUPERINTENDÊNCIA REGIONAL DA CODEVASF, NO ESTADO DO CEARÁ."},null,"CODEVASF (14ª/SR)"]
["DISCRIMINAÇÃO",null,null,null,"VALORES"]
[{"$nulls":4},"%","R$"]
["A","ENCARGOS SOCIAIS BÁSICOS",null,null,{"$f":"ROUND(SUM(E11:E19),4)","v":0.2},{"$f":"ROUND(SUM(F11:F19),4)","v":0.2}]
{"$rows_left_out":38}
{"sheet":"PFP3_FatorKc","index":5,"n_rows":38,"n_cols":11,"rows_kept":38,"cut":false,"hidden":false,"merged":[[12,4,12,5],[13,4,13,5],[14,4,14,5],[16,4,16,5],[15,4,15,5],[5,2,5,4],[6,0,6,1],[6,2,6,4],[7,3,7,5],[11,1,11,2],[8,4,8,5],[9,4,9,5],[10,4,10,5],[11,4,11,5],[12,1,12,2],[13,1,13,2],[14,1,14,3],[15,1,15,3],[16,1,16,3],[17,1,17,3],[18,1,18,3],[19,1,19,3],[24,0,24,5],[25,0,25,5],[17,4,17,5],[18,4,18,5],[19,4,19,5],[36,0,36,5],[37,0,37,5],[9,0,10,0],[3,0,4,4],[7,0,8,2],[9,1,10,2],[31,0,31,5],[32,0,32,5],[33,0,33,5],[34,0,34,5],[35,0,35,5],[26,0,26,5],[27,0,27,5],[28,0,28,5],[29,0,29,5],[30,0,30,5]]}
[]
[]
[]
["DESPESAS FISCAIS E CUSTOS DIVERSOS: Kc",{"$nulls":4},"CODIGO:"]
[{"$nulls":5},"PFP-3"]
["PROJETO:",null,"CONTRATANTE:",null,null,"EDITAL:"]
[{"$f":"'PFP1'!A7","v":"CONTRATAÇÃO DE SERVIÇOS DE ENGENHARIA PARA APOIO E SUPERVISÃO TÉCNICO ADMINISTRATIVO NA GESTÃO DE CONTRATOS E CONVÊNIOS DE QUALIFICAÇÃO VIÁRIA NA ÁREA DE ATUAÇÃO 14ª SUPERINTENDÊNCIA REGIONAL DA CODEVASF, NO ESTADO DO CEARÁ."},null,"CODEVASF (14ª/SR)"]
["DISCRIMINAÇÃO 1",null,null,"VALORES"]
[null,null,null,"% preço","% custo",null,null,null,{"$f":"SUM(I10:I13)","v":0},{"$f":"SUM(J10:J13)","v":0}]
["K4","DESPESAS FISCAIS",null,"K' (%)2","K (%)3"]
{"$rows_left_out":29}
{"sheet":"COMPOSIÇÕES","index":6,"n_rows":32,"n_cols":15,"rows_kept":32,"cut":false,"hidden":false,"merged":[[1,0,1,9],[10,12,10,14],[29,12,30,14],[31,12,31,13]]}
[]
[{"$f":"PFP3_FatorKc!A7","v":"CONTRATAÇÃO DE SERVIÇOS DE ENGENHARIA PARA APOIO E SUPERVISÃO TÉCNICO ADMINISTRATIVO NA GESTÃO DE CONTRATOS E CONVÊNIOS DE QUALIFICAÇÃO VIÁRIA NA ÁREA DE ATUAÇÃO 14ª SUPERINTENDÊNCIA REGIONAL DA CODEVASF, NO ESTADO DO CEARÁ."}]
["COMPOSIÇÃO 4",null,null,"DESCRIÇÃO","UNIDADE","QUANTIDADE","CUSTO UNITÁRIO","PREÇO UNITÁRIO","CUSTO TOTAL","PREÇO TOTAL"]
["ORIGEM","CÓDIGO 1","CÓDIGO 2","Projeto Executivo","[un]",1,"CUSTO UNITÁRIO",null,"-","-"]
["DNIT",null,"P9949","Topógrafo","mês",0.5,{"$f":"TRUNC(VLOOKUP(C5,'SICRO PESSOAL'!$A$6:$G$106,4,0),2)","v":9354.42},{"$f":"TRUNC(G5*PFP3_FatorKc!$E$20,2)","v":11171.04},{"$f":"TRUNC(G5*F5,2)","v":4677.21},{"$f":"TRUNC(H5*F5,2)","v":5585.52}]
["DNIT",null,"P9950","Auxiliar de topógrafo","mês",0.5,{"$f":"TRUNC(VLOOKUP(C6,'SICRO PESSOAL'!$A$6:$G$106,4,0),2)","v":6069.37},{"$f":"TRUNC(G6*PFP3_FatorKc!$E$20,2)","v":7248.04},{"$f":"TRUNC(G6*F6,2)","v":3034.68},{"$f":"TRUNC(H6*F6,2)","v":3624.02}]
["DNIT",null,"P9903","Auxiliar Técnico/Assistente de Engenharia ","mês",1,{"$f":"TRUNC(VLOOKUP(C7,'SICRO PESSOAL'!$A$6:$G$106,4,0),2)","v":4888.9799999999996},{"$f":"TRUNC(G7*PFP3_FatorKc!$E$20,2)","v":5838.41},4888.9799999999996,5838.41]
["-",null,"-","C.1 - MATERIAIS DE CONSUMO","Estimativa % como referência de equipe técnica com encargos sociais ",0.03,{"$f":"TRUNC(SUM(G5:G7),2)","v":20312.77},{"$f":"TRUNC(G8*PFP3_FatorKc!$E$20,2)","v":24257.5},609.38,727.72]
["Codevasf",null,"-","VEÍCULOS (Veículo tipo pick-up, cabine dupla - 2.0 16V 4x4 diesel Aut.)","h",120,{"$f":"TRUNC('CPU-VEICULO_PickUp'!C12,2)","v":23.05},{"$f":"TRUNC(G9*PFP3_FatorKc!$E$20,2)","v":27.52},2766,3302.4]
["DNIT",null,"E9553","C.3 - Estação total eletrônica com alcance máximo de 3.000 m","h",120,{"$f":"TRUNC(VLOOKUP(C10,'SICRO EQUIPAMENTOS'!$A$4:$K$541,10,0),2)","v":8.09},{"$f":"TRUNC(G10*PFP3_FatorKc!$E$20,2)","v":9.66},970.8,1159.2]
{"$rows_left_out":23}
{"sheet":"CPU-VEICULO_PickUp","index":7,"n_rows":175,"n_cols":31,"rows_kept":175,"cut":false,"hidden":false,"merged":[[8,22,13,22],[4,0,4,2],[6,0,6,2],[7,0,7,1],[7,4,7,8],[8,0,8,2],[8,4,16,4]]}
[]
[]
[]
[]
["Composição de Preços de Locação de Veículo tipo pick-up"]
[null,"Data de atualização:","2025-09-18",null,"CV","Média","Mediana",{"$nulls":4},"CV","Média","Mediana",{"$nulls":8},"CV","Média","Mediana"]
["CODEVASF ",null,null,null,{"$f":"_xlfn.STDEV.S(I9:I17)/AVERAGE(I9:I17)","v":0.12022418872722392},{"$f":"AVERAGE(I9:I17)","v":188340},{"$f":"MEDIAN(I9:I17)","v":188325},{"$nulls":4},{"$f":"_xlfn.STDEV.S(M9:T9)/AVERAGE(M9:T9)","v":0.31004639163110881},{"$f":"AVERAGE(M9:T9)","v":42.158749999999998},{"$f":"MEDIAN(M9:T9)","v":37.42},{"$nulls":8},{"$f":"_xlfn.STDEV.S(X9:AE9)/AVERAGE(X9:AE9)","v":0.21426169226966532},{"$f":"AVERAGE(X9:AE9,X10:AE10,X11:AE11,X12:AE12,X13:AE13,X14:AE14)","v":556.93666666666661},{"$f":"MEDIAN(X9:AE9,X10:AE10,X11:AE11,X12:AE12,X13:AE13,X14:AE14)","v":513.57500000000005}]
["OBS:               Preço sem BDI e sem motorista                                                                   BDI=",null,null,null,"PREÇO FIPE - ref. Ago/2025 (Modelo 2024)",{"$nulls":5},"PRODUTO ","MENOR (MÉDIA, MEDIANA)","COT. 1","COT. 2","COT. 3","COT. 4","COT. 5","COT. 6","COT. 7","COT. 8",null,"PRODUTO","MENOR (MÉDIA, MEDIANA)","COT. 1","COT. 2","COT. 3","COT. 4","COT. 5","COT. 6","COT. 7","COT. 8"]
["Veículo tipo pick-up, cabine dupla - 2.0 16V 4x4 diesel Aut.",null,null,null,"Pick up cabine dupla","VW","AMAROK Comfor. 3.0 V6 TDI 4x4 Dies. Aut.",{"$f":"(8.6+9)/2","v":8.8000000000000007},204854,null,"Lubrificante 5W30 Diesel 1L",{"$f":"SMALL(M7:N7,1)","v":37.42},59.99,34.1,53.76,34.9,23.9,33.78,39.94,56.9,null,"Pneu 225/65 R17",{"$f":"SMALL(X7:Y7,1)","v":513.57500000000005},659.9,497.94,619.20000000000005,778.91,478.8,749,459.9,497.94]
[null,"Custo Mensal (R$):",{"$f":"ROUND(C51,2)","v":4056.05},null,null,"Toyota","Hilux CD SR 4x4 2.8 TDI Diesel Aut.",{"$f":"(10.5+11.3)/2","v":10.9},230948,{"$nulls":12},"Pneu 225/60R18",null,1088.7,622.25,965.2,493.41,799.9,514.75,688,498.67]
{"$rows_left_out":61}
{"sheet":"CPU-VEICULO_Leve","index":8,"n_rows":118,"n_cols":35,"rows_kept":118,"cut":false,"hidden":false,"merged":[[49,9,49,21],[49,22,49,29],[1,0,1,3],[3,0,3,3],[4,0,4,2],[4,5,4,8],[5,0,5,3],[7,5,7,8],[5,24,8,24]]}
[]
[{"$f":"'PFP1'!A7","v":"CONTRATAÇÃO DE SERVIÇOS DE ENGENHARIA PARA APOIO E SUPERVISÃO TÉCNICO ADMINISTRATIVO NA GESTÃO DE CONTRATOS E CONVÊNIOS DE QUALIFICAÇÃO VIÁRIA NA ÁREA DE ATUAÇÃO 14ª SUPERINTENDÊNCIA REGIONAL DA CODEVASF, NO ESTADO DO CEARÁ."}]
[null,"2023-08-23","Data de atualização:","2025-01-22",null,"CV","Média","Mediana",null,null,null,"CV","Média","Mediana",{"$nulls":10},"CV","Média","Mediana"]
["CODEVASF ",{"$nulls":4},{"$f":"_xlfn.STDEV.S(F7:I7)/AVERAGE(F7:I7)","v":0.13609777984059401},{"$f":"AVERAGE(F7:I7)","v":64114.5},{"$f":"MEDIAN(F7:I7)","v":65537.5},null,null,null,{"$f":"_xlfn.STDEV.S(M6:V6)/AVERAGE(M6:V6)","v":0.41367358225239476},{"$f":"AVERAGE(M6:V6)","v":29.011900000000004},{"$f":"MEDIAN(M6:V6)","v":27.924999999999997},{"$nulls":10},{"$f":"_xlfn.STDEV.S(Z6:AI6)/AVERAGE(Z6:AI6)","v":0.23308822238198088},{"$f":"AVERAGE(Z6:AI9)","v":311.64562499999994},{"$f":"MEDIAN(Z6:AI9)","v":316.95}]
["OBS:               Preço sem BDI e sem motorista                                                           BDI=",{"$nulls":4},"Preço FIPE - ref ago/2025 Modelo 2024",{"$nulls":4},"PRODUTO","MENOR","COT. 1","COT. 2","COT. 3","COT. 4","COT. 5","COT. 6","COT. 7","COT. 8","COT. 9","COT. 10",null,"PRODUTO ","MENOR","COT. 1","COT. 2","COT. 3","COT. 4","COT. 5","COT. 6","COT. 7","COT. 8","COT. 9","COT. 10"]
["Veículo Leve 1.0 T. Flex 12V 5p",{"$nulls":4},"Renault Kwid Zen 1.0","Hyndai HB20 Sense 1.0 ","ONIX HATCH LT 1.0 12V Flex 5p Mec.","MOBI TREKKING 1.0 Flex 5p.",null,"LUBRIFICANTE 15W40",{"$f":"SMALL(M4:N4,1)","v":27.924999999999997},59.9,23,{"$f":"364.8/20","v":18.240000000000002},20.9,{"$f":"385.38/20","v":19.268999999999998},29.06,28.95,33.9,30,26.9,null,"Pneu 165/70 R14",{"$f":"SMALL(Z4:AA4,1)","v":311.64562499999994},160.13,299.89999999999998,379,396.57,299.89999999999998,271.18,409,279,319,299]
[null,null,"Custo Mensal (R$):",{"$f":"D48","v":2122.6665709070771},null,52829,69128,72554,61947,null,null,"",{"$nulls":11},"Pneu 175/70 R14",null,398.91,269.89999999999998,373.69,339.9,368.5,454.9,217.74,229,329.9,362.81]
[null,null,"Custo Diário (R$):",{"$f":"D7/30","v":70.755552363569237},null,"estimativa consumo km/L estrada",{"$nulls":4},"https://www.google.com/search?sca_esv=a1feb94103ceaa7e&sxsrf=AE3TifNEdg8vmg60OrJvtXO4M5WmausTMA:1758222014837&udm=28&fbs=AIIjpHydJdUtNKrM02hj0s4nbm4yRBEFyiFuxYYrR6QBOf_jD75Zzpf7Nr8v4hr8rOZhrL53GZEw1YDwfPusr5Oqk12e6GOo0mHb68W2RmSTW2dLiF1jW58LxwSrkZzG9BLyLCsLN_o-LR28Y7wcqdrZPNYZh4uAD25oA_KlmWz-nDBQoQ3XEOAtDKdJEdsEs3LexLdtt3Ckwq_xR5gNyPGJaoIw4-bByg&q=%22lubrificante+15w40+gasolina%22&ved=1t:220175&ictx=111&biw=1920&bih=945&dpr=1",{"$nulls":12},"Pneu 185/65 R15",null,137.88999999999999,436.91,249,369.9,349,259.89999999999998,{"$f":"1164.9/4","v":291.22500000000002},188.19,509.9,319]
[null,null,"Custo Horário (R$):",{"$f":"D7/176","v":12.060605516517484},null,15.6,14.6,16.7,15,{"$nulls":14},"Pneu 175/65 R14",null,183.22,332.41,385.5,279.89999999999998,262.89999999999998,228.45,314.89999999999998,379.9,199.9,329.9]
["A",null,"Depreciação mensal do equipamento"]
{"$rows_left_out":53}
{"sheet":"CPU HOSPEDAGEM","index":9,"n_rows":40,"n_cols":3,"rows_kept":40,"cut":false,"hidden":false,"merged":[[2,1,2,2]]}
{"$rows_empty":39}
[null,"Diária Total (alimentação + hospedagem):",383.68]

{"sheet":"SICRO PESSOAL","index":10,"n_rows":105,"n_cols":4,"rows_kept":105,"cut":false,"hidden":true,"merged":[]}
["Código","Descrição","Unidade","Custo\n (R$)"]
["P9801","Ajudante","h",23.755700000000001]
["P9802","Ajudante especializado","h",27.492899999999999]
["P9803","Almoxarife","mês",6550.9483]
["P9804","Apontador","mês",5914.3532999999998]
["P9805","Armador","h",32.973199999999999]
["P9806","Auxiliar administrativo","mês",4613.0829000000003]
["P9807","Bombeiro hidráulico","h",33.525300000000001]
["P9808","Carpinteiro","h",32.0578]
["P9809","Encarregado administrativo","mês",7797.4522999999999]
{"$rows_left_out":96}
{"sheet":"SICRO EQUIPAMENTOS","index":11,"n_rows":542,"n_cols":11,"rows_kept":542,"cut":false,"hidden":true,"merged":[[504,2,504,8],[507,2,507,8],[510,2,510,8],[383,2,383,8],[386,2,386,8],[390,2,390,8],[393,2,393,8],[396,2,396,8],[400,2,400,8],[405,2,405,8],[408,2,408,8],[411,2,411,8],[414,2,414,8],[416,2,416,8],[418,2,418,8],[420,2,420,8],[423,2,423,8],[426,2,426,8],[430,2,430,8],[435,2,435,8],[440,2,440,8],[443,2,443,8],[446,2,446,8],[449,2,449,8],[452,2,452,8],[455,2,455,8],[458,2,458,8],[461,2,461,8],[464,2,464,8],[467,2,467,8],[470,2,470,8],[473,2,473,8],[476,2,476,8],[479,2,479,8],[482,2,482,8],[485,2,485,8],[492,2,492,8],[495,2,495,8],[498,2,498,8],[501,2,501,8],[488,2,488,8],[539,2,539,8],[515,2,515,8],[522,2,522,8],[525,2,525,8],[530,2,530,8],[533,2,533,8],[518,2,518,8],[536,2,536,8]]}
["Código","Descrição","Valor de Aquisição\n (R$)","Depreciação\n (R$/h)","Oportunidade de Capital\n (R$/h)","Seguros e Impostos\n (R$/h)","Manutenção\n (R$/h)","Operação\n (R$/h)","Mão de Obra de Operação\n (R$/h)","Custo Produtivo\n (R$/h)","Custo Improdutivo\n (R$/h)"]
["E9001","Conjunto vibratório para tubos de concreto com encaixe PB e 3 jogos de fôrmas - D = 0,60 m - 2,20 kW",72356.442299999995,9.6475000000000009,1.4881,0,7.2355999999999998,0,0,18.371200000000002,11.1356]
["E9002","Conjunto vibratório para tubos de concreto com encaixe PB e 3 jogos de fôrmas - D = 0,80 m - 2,20 kW",94837.032300000006,12.6449,1.9504999999999999,0,9.4837000000000007,0,0,24.0791,14.5954]
["E9003","Conjunto vibratório para tubos de concreto com encaixe PB e 3 jogos de fôrmas - D = 1,00 m - 2,20 kW",99174.368100000007,13.2232,2.0396999999999998,0,9.9174000000000007,0,0,25.180299999999999,15.2629]
["E9004","Conjunto vibratório para tubos de concreto com encaixe PB e 3 jogos de fôrmas - D = 1,20 m - 2,20 kW",124977.2038,16.663599999999999,2.5703999999999998,0,12.4977,0,0,31.7317,19.234000000000002]
["E9005","Conjunto vibratório para tubos de concreto com encaixe PB e 3 jogos de fôrmas - D = 1,50 m - 2,20 kW",147902.67689999999,19.720400000000001,3.0419,0,14.7903,0,0,37.552599999999998,22.7623]
["E9006","Equipamento para sondagem manual",5069.3332,0.86180000000000001,0.1095,0,0.50690000000000002,0,0,1.4782,0.97130000000000005]
["E9007","Bomba de pistão triplex com capacidade de 7,80 m³/h (130 l/min) - 8,20 kW",166912.8014,16.691299999999998,3.2183000000000002,0,14.604900000000001,8.4771000000000001,0,42.991599999999998,19.909600000000001]
["E9008","Transportador manual de tubos de concreto com capacidade de 1 t",1733.0522000000001,1.5597000000000001,8.0199999999999994E-2,0,0.86650000000000005,0,0,2.5064000000000002,1.6398999999999999]
["E9009","Embarcação rebocadora - 268 kW",671983.06059999997,7.6920999999999999,3.8626999999999998,0,17.093599999999999,277.0557,137.197,442.90109999999999,148.7518]
{"$rows_left_out":533}
{"sheet":"DNIT Rel. Consolidação de M.O.","index":12,"n_rows":101,"n_cols":26,"rows_kept":101,"cut":false,"hidden":true,"merged":[[0,24,1,24],[0,4,1,5],[0,22,1,23],[0,6,0,15],[0,16,0,21],[1,6,1,7],[1,8,1,9],[1,10,1,11],[1,12,1,13],[1,14,1,15],[1,16,1,17],[1,18,1,19],[1,20,1,21],[0,0,2,0],[0,1,2,1],[0,2,2,2],[0,3,1,3]]}
["Código","Categoria","Unid.","Salário","Encargos Sociais",null,"Encargos Complementares",{"$nulls":9},"Encargos Adicionais",{"$nulls":5},"Encargos Totais",null,"Valor Total"]
[{"$nulls":6},"Alimentação",null,"EPI",null,"Ferramenta",null,"Transporte",null,"Exame Ocupacional",null,"Cesta Básica",null,"Assistência Médica",null,"Seguro de Vida"]
[null,null,null,"R$","%","R$","%","R$","%","R$","%","R$","%","R$","%","R$","%","R$","%","R$","%","R$","%","R$","R$"]
["P8001","Advogado júnior","mês",5064.07,78.11,3955.55,15.33,776.57,0.52,26.49,0,0,0,0,0.06,3.1,0,0,6.06,306.83999999999997,0.2,9.98,100.2855,5078.53,10142.6,{"$f":"Y4-D4-F4","v":1122.9800000000005}]
["P8002","Advogado pleno","mês",6752.09,78.11,5274.06,11.5,776.57,0.39,26.49,0,0,0,0,0.05,3.1,0,0,4.54,306.83999999999997,0.15,9.98,94.741600000000005,6397.04,13149.14,{"$f":"Y5-D5-F5","v":1122.9899999999989}]
["P8003","Advogado sênior","mês",12224.44,78.11,9548.51,6.35,776.57,0.22,26.49,0,0,0,0,0.03,3.1,0,0,2.5099999999999998,306.83999999999997,0.08,9.98,87.296400000000006,10671.49,22895.93,1122.9799999999996]
["P8007","Analista de desenvolvimento de sistemas júnior","mês",4278.79,78.23,3347.3,18.149999999999999,776.57,0,0,0,0,0,0,7.0000000000000007E-2,3.03,0,0,7.17,306.83999999999997,0.23,9.98,103.8545,4443.72,8722.5,1096.4099999999999]
["P8008","Analista de desenvolvimento de sistemas pleno","mês",5705.05,78.23,4463.0600000000004,13.61,776.57,0,0,0,0,0,0,0.05,3.03,0,0,5.38,306.83999999999997,0.17,9.98,97.448400000000007,5559.48,11264.53,1096.42]
["P8009","Analista de desenvolvimento de sistemas sênior","mês",10184.530000000001,78.23,7967.36,7.62,776.57,0,0,0,0,0,0,0.03,3.03,0,0,3.01,306.83999999999997,0.1,9.98,88.995500000000007,9063.7800000000007,19248.310000000001,1096.420000000001]
["P8013","Arquiteto júnior","mês",12443.57,78.150000000000006,9724.65,6.24,776.57,0.21,26.49,0,0,0,0,0.02,2.74,0,0,2.4700000000000002,306.83999999999997,0.08,9.98,87.171700000000001,10847.27,23290.84,1122.6200000000008]
{"$rows_left_out":92}
{"sheet":"DNIT Rel. Consolidação de C.G.","index":13,"n_rows":22,"n_cols":6,"rows_kept":22,"cut":false,"hidden":true,"merged":[[1,0,2,0],[1,1,2,1],[1,2,2,3],[1,4,2,4],[1,5,2,5],[3,0,7,0],[7,2,7,3],[10,2,10,3],[11,0,12,0],[11,2,11,3],[12,2,12,3],[20,0,21,0],[20,2,20,3],[21,2,21,3],[13,0,14,0],[13,2,13,3],[14,2,14,3],[15,0,19,0],[15,2,15,3],[16,2,16,3],[17,2,17,3],[18,2,18,3],[19,2,19,3]]}
["Tabela 1 - Custos de veículos "]
["Item","Código","Tipo",null,"Custo Produtivo \n(R$/h)","Custo Improdutivo (R$/h)"]
[]
["Veículos","E8889","Veículo leve - 53 kW (sem motorista)",null,36.65,6.69]
[null,"E8890","Veículo leve - 53 kW (com motorista)",null,64.540000000000006,34.57]
[null,"E8891","Veículo leve picape 4 x 4 com capacidade de 1,10 t - 147 kW (sem motorista)",null,78.98,23.64]
[null,"E8888","Veículo tipo van furgão com capacidade de 1,38 t - 100 kW (sem motorista)",null,54.56,16.899999999999999]
[null,"E8887","Veículo tipo van furgão com capacidade de 1,38 t - 100 kW (com motorista)",null,82.44,44.79]
[]
["Tabela 2 - Custos de imóveis, mobiliário, cestas de instalações e custos diversos"]
{"$rows_left_out":13}
{"sheet":"LISTA ORCAFASCIO","index":14,"n_rows":18,"n_cols":8,"rows_kept":18,"cut":false,"hidden":true,"merged":[[1543,0,1543,5]]}
["BASE","CODIGO","DESCRIÇÃO","Unidade","DATA","INSUMO","COMPOSICAO","VALOR UN ONERADO"]
["COMPESA","01.07.05U","Ensaio de determinação do teor de betume - cimento asfáltico","un","2024-07-01","NÃO","SIM",127.22]
["COMPESA","01.07.15U","Ensaio Marshall - Mistura betuminosa a quente","un","2024-07-01","NÃO","SIM",254.45]
["SETOP","ED-49547","Ensaio de resistência à tração por compressão diametral concreto","un","2025-04-01","NÃO","SIM",100.69]
["SETOP","ED-49546","Ensaio de resistência à compressão simples concreto","un","2025-04-01","NÃO","SIM",100.21]
["EMOP","01.001.0300-0","Determinação da taxa de ligante (serviços de escritório, laboratório e campo)","un","2025-08-01","NÃO","SIM",417.32]
["EMBASA","34.01.25","Ensaio de compactação - proctor normal (NBR - 07182)","un","2025-06-01","NÃO","SIM",300]
["EMBASA","34.01.31","Ensaio de compactação - proctor modificado (NBR - 07182)","un","2025-06-01","NÃO","SIM",157.86000000000001]
["EMBASA","34.01.28","Ensaio de compactação - proctor intermediário (NBR - 07182)","un","2025-06-01","NÃO","SIM",131.55000000000001]
["EMOP","01.001.0060-0","Amostra de solo - preparação para ensaios de compactação e ensaios de caracterização (serviços de escritório, laboratório e campo)","un","2025-08-01","NÃO","SIM",632.24]
{"$rows_left_out":8}