{"text_format":"2","workbook":"xlsx","n_sheets":14,"sheets":["Peixe 50% PB Farelo","Peixe 45% 1,2 mm","Peixe 45% 1,8 mm","Peixe 35% 2 a 3 mm","Peixe 35% 3 a 4 mm","Peixe 32% 3 a 5 mm","Peixe 32% 4 a 6 mm","Peixe 32% 6 a 8 mm","Camarão 40% 700 a 1000","Camarão 40% 900 a 1300","Camarão 35% 1,8 mm","ORIENTAÇÕES E ADVERTÊNCIAS","Classes e CVs de referência","índice de atualização"],"not_rendered":{"charts":0,"images":2,"macros":0,"external_links":2,"defined_names":344,"comments":11,"pivot_tables":0},"unopened":[],"bounds":{"document_bytes":16777216,"sheet_cells":100000,"run_cost":"one","rows_first":2000,"rows_last":500,"rows_between":2000,"halvings":0,"cell_chars":16384,"cell_head_chars":4096},"cells_cut":0,"cells_raw":0,"read":"whole","date_system":"1900"}

{"sheet":"Peixe 50% PB Farelo","index":0,"n_rows":38,"n_cols":21,"rows_kept":38,"cut":false,"hidden":false,"merged":[[15,12,15,17],[6,2,6,5],[6,12,6,18],[7,1,7,9],[7,12,7,18],[8,12,8,17],[9,12,9,17],[10,12,10,17],[11,12,11,17],[12,12,12,17],[13,12,13,17],[14,12,14,17],[26,1,26,6],[16,1,16,9],[16,12,16,18],[17,1,17,6],[18,1,18,6],[20,1,20,6],[21,1,21,6],[22,1,22,6],[23,1,23,6],[24,1,24,6],[25,1,25,6],[19,1,19,6],[35,12,35,18],[36,12,36,18],[27,1,27,6],[28,1,28,6],[29,1,31,7],[32,1,34,8],[32,9,34,9],[35,1,37,8],[35,9,37,9]]}
[]
[null,"Processo","59511.000102/2026-55"]
[null,"Responsável","JHONES DE LIMA VIEIRA"]
[null,"Área de Origem","14ª GTR"]
[null,"Data da pesquisa","Janeiro/2026 - Fevereiro/2026"]
[]
[null,"ITEM:","Ração farelada para peixe onívoro 50% PB – Proteína Bruta Mín.: 50%, granulometria pó. Data de validade não inferior a 6 meses.",null,null,null,"UNIDADE DE MEDIDA:","kg","QUANTIDADE:",{"$f":"300*25","v":7500},null,null,"Tabela auxiliar de metodologias para exclusão de preços",{"$nulls":7},"Automática (menor CV)"]
[null,"LICITAÇÕES ANTERIORES",{"$nulls":10},"Licitações Anteriores - Outliers",{"$nulls":7},{"$f":"M18","v":"Outliers"}]
[null,"Órgão","Edital/Ano - Nº do Lote / Item","Quantidade","Valor Unitário","Data","índice de atualização (nome)","Variação acumulada do índice (%)","Preço unitário atualizado","Utilizar?  (Sim/Não)",null,null,"Utilizar?",{"$nulls":5},"Por critério do(a) analista",null,{"$f":"N18","v":"Grupos - Todos"}]
[null,"14ª SR - Fortaleza/CE","Edital 90007/2024 - Item 1",141,6.4,"2025-01-02","IPA-EP-DI Suprimentos agropecuários",{"$f":"(I10/E10)-1","v":1.6540957444201254E-2},{"$f":"IF(ISBLANK(E10),\"\",E10*(1+(INDEX('índice de atualização'!B:B,MATCH(G10,'índice de atualização'!B:B,0)+COUNTA('índice de atualização'!B:B)-1)-INDEX('índice de atualização'!B:B,MATCH(TEXT(F10,\"MM/AAAA\"),'índice de atualização'!A:A,0)))/INDEX('índice de atualização'!B:B,MATCH(TEXT(F10,\"MM/AAAA\"),'índice de atualização'!A:A,0))))","v":6.5058621276428887},{"$f":"IF(ISNUMBER(I10),IF($J$33<>$S$9,M10,S10),\"\")","v":"Sim"},null,null,{"$f":"IF(ISNUMBER(I10),IF(OR(I10<_xlfn.QUARTILE.INC($I$10:$I$29,1)-1.5*(_xlfn.QUARTILE.INC($I$10:I29,3)-_xlfn.QUARTILE.INC($I$10:$I$29,1)),I10>_xlfn.QUARTILE.INC($I$10:$I$29,3)+1.5*(_xlfn.QUARTILE.INC($I$10:$I$29,3)-_xlfn.QUARTILE.INC($I$10:$I$29,1))),\"Não\",\"Sim\"),\"\")","v":"Sim"},{"$nulls":7},{"$f":"O18","v":"Grupos - Sem o maior"}]
[null,"14ª SR - Fortaleza/CE","Edital 90007/2024 - Item 9",25,6.38,"2025-02-18","IPA-EP-DI Suprimentos agropecuários",{"$f":"(I11/E11)-1","v":4.5072426012993105E-4},{"$f":"IF(ISBLANK(E11),\"\",E11*(1+(INDEX('índice de atualização'!B:B,MATCH(G11,'índice de atualização'!B:B,0)+COUNTA('índice de atualização'!B:B)-1)-INDEX('índice de atualização'!B:B,MATCH(TEXT(F11,\"MM/AAAA\"),'índice de atualização'!A:A,0)))/INDEX('índice de atualização'!B:B,MATCH(TEXT(F11,\"MM/AAAA\"),'índice de atualização'!A:A,0))))","v":6.3828756207796289},{"$f":"IF(ISNUMBER(I11),IF($J$33<>$S$8,M11,S11),\"\")","v":"Sim"},null,null,{"$f":"IF(ISNUMBER(I11),IF(OR(I11<_xlfn.QUARTILE.INC($I$10:$I$29,1)-1.5*(_xlfn.QUARTILE.INC($I$10:I30,3)-_xlfn.QUARTILE.INC($I$10:$I$29,1)),I11>_xlfn.QUARTILE.INC($I$10:$I$29,3)+1.5*(_xlfn.QUARTILE.INC($I$10:$I$29,3)-_xlfn.QUARTILE.INC($I$10:$I$29,1))),\"Não\",\"Sim\"),\"\")","v":"Sim"},{"$nulls":7},{"$f":"P18","v":"Grupos - Sem o menor"}]
[null,"4ª SR - Aracaju/SE","Edital 90002/2025 - Item 1",8000,7.86,"2025-07-11","IPA-EP-DI Suprimentos agropecuários",-2.2368348389686266E-2,{"$f":"IF(ISBLANK(E12),\"\",E12*(1+(INDEX('índice de atualização'!B:B,MATCH(G12,'índice de atualização'!B:B,0)+COUNTA('índice de atualização'!B:B)-1)-INDEX('índice de atualização'!B:B,MATCH(TEXT(F12,\"MM/AAAA\"),'índice de atualização'!A:A,0)))/INDEX('índice de atualização'!B:B,MATCH(TEXT(F12,\"MM/AAAA\"),'índice de atualização'!A:A,0))))","v":7.6841847816570663},"Sim",null,null,{"$f":"IF(ISNUMBER(I12),IF(OR(I12<_xlfn.QUARTILE.INC($I$10:$I$29,1)-1.5*(_xlfn.QUARTILE.INC($I$10:I31,3)-_xlfn.QUARTILE.INC($I$10:$I$29,1)),I12>_xlfn.QUARTILE.INC($I$10:$I$29,3)+1.5*(_xlfn.QUARTILE.INC($I$10:$I$29,3)-_xlfn.QUARTILE.INC($I$10:$I$29,1))),\"Não\",\"Sim\"),\"\")","v":"Sim"},{"$f":"$M$12","v":"Sim"},{"$f":"$M$12","v":"Sim"},{"$f":"$M$12","v":"Sim"},{"$f":"$M$12","v":"Sim"},{"$f":"$M$12","v":"Sim"},null,null,{"$f":"Q18","v":"Grupos - Sem o maior e sem o menor"}]
[{"$nulls":8},{"$f":"IF(ISBLANK(E13),\"\",E13*(1+(INDEX('índice de atualização'!B:B,MATCH(G13,'índice de atualização'!B:B,0)+COUNTA('índice de atualização'!B:B)-1)-INDEX('índice de atualização'!B:B,MATCH(TEXT(F13,\"MM/AAAA\"),'índice de atualização'!A:A,0)))/INDEX('índice de atualização'!B:B,MATCH(TEXT(F13,\"MM/AAAA\"),'índice de atualização'!A:A,0))))","v":""},"",null,null,{"$f":"IF(ISNUMBER(I13),IF(OR(I13<_xlfn.QUARTILE.INC($I$10:$I$29,1)-1.5*(_xlfn.QUARTILE.INC($I$10:I32,3)-_xlfn.QUARTILE.INC($I$10:$I$29,1)),I13>_xlfn.QUARTILE.INC($I$10:$I$29,3)+1.5*(_xlfn.QUARTILE.INC($I$10:$I$29,3)-_xlfn.QUARTILE.INC($I$10:$I$29,1))),\"Não\",\"Sim\"),\"\")","v":""},{"$f":"$M$13","v":""},{"$f":"$M$13","v":""},{"$f":"$M$13","v":""},{"$f":"$M$13","v":""},{"$f":"$M$13","v":""},null,null,{"$f":"R18","v":"Grupos - Sem os dois maiores"}]
[{"$nulls":8},{"$f":"IF(ISBLANK(E14),\"\",E14*(1+(INDEX('índice de atualização'!B:B,MATCH(G14,'índice de atualização'!B:B,0)+COUNTA('índice de atualização'!B:B)-1)-INDEX('índice de atualização'!B:B,MATCH(TEXT(F14,\"MM/AAAA\"),'índice de atualização'!A:A,0)))/INDEX('índice de atualização'!B:B,MATCH(TEXT(F14,\"MM/AAAA\"),'índice de atualização'!A:A,0))))","v":""},"",null,null,{"$f":"IF(ISNUMBER(I14),IF(OR(I14<_xlfn.QUARTILE.INC($I$10:$I$29,1)-1.5*(_xlfn.QUARTILE.INC($I$10:I33,3)-_xlfn.QUARTILE.INC($I$10:$I$29,1)),I14>_xlfn.QUARTILE.INC($I$10:$I$29,3)+1.5*(_xlfn.QUARTILE.INC($I$10:$I$29,3)-_xlfn.QUARTILE.INC($I$10:$I$29,1))),\"Não\",\"Sim\"),\"\")","v":""},{"$f":"$M$14","v":""},{"$f":"$M$14","v":""},{"$f":"$M$14","v":""},{"$f":"$M$14","v":""},{"$f":"$M$14","v":""},null,null,{"$f":"S18","v":"Por critério do(a) analista"}]
[{"$nulls":9},"",null,null,{"$f":"IF(ISNUMBER(I15),IF(OR(I15<_xlfn.QUARTILE.INC($I$10:$I$29,1)-1.5*(_xlfn.QUARTILE.INC($I$10:I36,3)-_xlfn.QUARTILE.INC($I$10:$I$29,1)),I15>_xlfn.QUARTILE.INC($I$10:$I$29,3)+1.5*(_xlfn.QUARTILE.INC($I$10:$I$29,3)-_xlfn.QUARTILE.INC($I$10:$I$29,1))),\"Não\",\"Sim\"),\"\")","v":""},{"$f":"$M$15","v":""},{"$f":"$M$15","v":""},{"$f":"$M$15","v":""},{"$f":"$M$15","v":""},{"$f":"$M$15","v":""}]
[{"$nulls":9},"",null,null,{"$f":"IF(ISNUMBER(I16),IF(OR(I16<_xlfn.QUARTILE.INC($I$10:$I$29,1)-1.5*(_xlfn.QUARTILE.INC($I$10:I39,3)-_xlfn.QUARTILE.INC($I$10:$I$29,1)),I16>_xlfn.QUARTILE.INC($I$10:$I$29,3)+1.5*(_xlfn.QUARTILE.INC($I$10:$I$29,3)-_xlfn.QUARTILE.INC($I$10:$I$29,1))),\"Não\",\"Sim\"),\"\")","v":""},{"$f":"$M$16","v":""},{"$f":"$M$16","v":""},{"$f":"$M$16","v":""},{"$f":"$M$16","v":""},{"$f":"$M$16","v":""}]
[null,"COTAÇÕES DE MERCADO",{"$nulls":10},"Cotações"]
[null,"Empresa",{"$nulls":5},"Data","Preço Unitário","Utilizar? (Sim/Não)",null,null,"Outliers","Grupos - Todos","Grupos - Sem o maior","Grupos - Sem o menor","Grupos - Sem o maior e sem o menor","Grupos - Sem os dois maiores","Por critério do(a) analista"]
[null,"Samaria Rações LTDA",{"$nulls":5},"2026-02-09",{"$f":"160/25","v":6.4},{"$f":"IF(ISNUMBER(I19),IF($J$33=$M$18,M19,IF($J$33=$N$18,N19,IF($J$33=$O$18,O19,IF($J$33=$P$18,P19,IF($J$33=$Q$18,Q19,IF($J$33=$R$18,R19,IF($J$33=$S$18,S19,\"\"))))))),\"\")","v":"Sim"},null,null,{"$f":"IF(ISNUMBER(I19),IF(OR(I19<_xlfn.QUARTILE.INC($I$10:$I$29,1)-1.5*(_xlfn.QUARTILE.INC($I$10:I40,3)-_xlfn.QUARTILE.INC($I$10:$I$29,1)),I19>_xlfn.QUARTILE.INC($I$10:$I$29,3)+1.5*(_xlfn.QUARTILE.INC($I$10:$I$29,3)-_xlfn.QUARTILE.INC($I$10:$I$29,1))),\"Não\",\"Sim\"),\"\")","v":"Sim"},{"$f":"IF(ISNUMBER(I19),\"Sim\",\"\")","v":"Sim"},{"$f":"IF(ISNUMBER(I19),IF(_xlfn.RANK.EQ(I19,$I$19:$I$29)=1,\"Não\",\"Sim\"),\"\")","v":"Sim"},{"$f":"IF(ISNUMBER(I19),IF(_xlfn.RANK.EQ(I19,$I$19:$I$29)=COUNT($I$19:$I$29),\"Não\",\"Sim\"),\"\")","v":"Não"},{"$f":"IF(O19=\"\",\"\",IF(AND(O19=\"Sim\",P19=\"Sim\"),\"Sim\",\"Não\"))","v":"Não"},{"$f":"IF(ISNUMBER(I19),IF(_xlfn.RANK.EQ(I19,$I$19:$I$29)<=2,\"Não\",\"Sim\"),\"\")","v":"Sim"}]
[null,"Integral Mix Agroindustria",{"$nulls":5},"2026-02-07",{"$f":"174.52/25","v":6.9808000000000003},"Sim",null,null,{"$f":"IF(ISNUMBER(I20),IF(OR(I20<_xlfn.QUARTILE.INC($I$10:$I$29,1)-1.5*(_xlfn.QUARTILE.INC($I$10:I40,3)-_xlfn.QUARTILE.INC($I$10:$I$29,1)),I20>_xlfn.QUARTILE.INC($I$10:$I$29,3)+1.5*(_xlfn.QUARTILE.INC($I$10:$I$29,3)-_xlfn.QUARTILE.INC($I$10:$I$29,1))),\"Não\",\"Sim\"),\"\")","v":"Sim"},"Sim","Sim","Sim",{"$f":"IF(O20=\"\",\"\",IF(AND(O20=\"Sim\",P20=\"Sim\"),\"Sim\",\"Não\"))","v":"Sim"},"Não"]
[null,"Comercial do Carmo ME",{"$nulls":5},"2026-02-12",{"$f":"216/25","v":8.64},"Não",null,null,{"$f":"IF(ISNUMBER(I21),IF(OR(I21<_xlfn.QUARTILE.INC($I$10:$I$29,1)-1.5*(_xlfn.QUARTILE.INC($I$10:I40,3)-_xlfn.QUARTILE.INC($I$10:$I$29,1)),I21>_xlfn.QUARTILE.INC($I$10:$I$29,3)+1.5*(_xlfn.QUARTILE.INC($I$10:$I$29,3)-_xlfn.QUARTILE.INC($I$10:$I$29,1))),\"Não\",\"Sim\"),\"\")","v":"Sim"},"Sim","Não","Sim","Não","Não"]
[{"$nulls":9},"",null,null,{"$f":"IF(ISNUMBER(I22),IF(OR(I22<_xlfn.QUARTILE.INC($I$10:$I$29,1)-1.5*(_xlfn.QUARTILE.INC($I$10:I40,3)-_xlfn.QUARTILE.INC($I$10:$I$29,1)),I22>_xlfn.QUARTILE.INC($I$10:$I$29,3)+1.5*(_xlfn.QUARTILE.INC($I$10:$I$29,3)-_xlfn.QUARTILE.INC($I$10:$I$29,1))),\"Não\",\"Sim\"),\"\")","v":""},"","","","",""]
[{"$nulls":9},"",null,null,{"$f":"IF(ISNUMBER(I23),IF(OR(I23<_xlfn.QUARTILE.INC($I$10:$I$29,1)-1.5*(_xlfn.QUARTILE.INC($I$10:I41,3)-_xlfn.QUARTILE.INC($I$10:$I$29,1)),I23>_xlfn.QUARTILE.INC($I$10:$I$29,3)+1.5*(_xlfn.QUARTILE.INC($I$10:$I$29,3)-_xlfn.QUARTILE.INC($I$10:$I$29,1))),\"Não\",\"Sim\"),\"\")","v":""},"","","","",""]
[{"$nulls":9},"",null,null,{"$f":"IF(ISNUMBER(I24),IF(OR(I24<_xlfn.QUARTILE.INC($I$10:$I$29,1)-1.5*(_xlfn.QUARTILE.INC($I$10:I42,3)-_xlfn.QUARTILE.INC($I$10:$I$29,1)),I24>_xlfn.QUARTILE.INC($I$10:$I$29,3)+1.5*(_xlfn.QUARTILE.INC($I$10:$I$29,3)-_xlfn.QUARTILE.INC($I$10:$I$29,1))),\"Não\",\"Sim\"),\"\")","v":""},"","","","",""]
[{"$nulls":9},"",null,null,{"$f":"IF(ISNUMBER(I25),IF(OR(I25<_xlfn.QUARTILE.INC($I$10:$I$29,1)-1.5*(_xlfn.QUARTILE.INC($I$10:I40,3)-_xlfn.QUARTILE.INC($I$10:$I$29,1)),I25>_xlfn.QUARTILE.INC($I$10:$I$29,3)+1.5*(_xlfn.QUARTILE.INC($I$10:$I$29,3)-_xlfn.QUARTILE.INC($I$10:$I$29,1))),\"Não\",\"Sim\"),\"\")","v":""},"","","","",""]
[{"$nulls":9},"",null,null,{"$f":"IF(ISNUMBER(I26),IF(OR(I26<_xlfn.QUARTILE.INC($I$10:$I$29,1)-1.5*(_xlfn.QUARTILE.INC($I$10:I40,3)-_xlfn.QUARTILE.INC($I$10:$I$29,1)),I26>_xlfn.QUARTILE.INC($I$10:$I$29,3)+1.5*(_xlfn.QUARTILE.INC($I$10:$I$29,3)-_xlfn.QUARTILE.INC($I$10:$I$29,1))),\"Não\",\"Sim\"),\"\")","v":""},"","","","",""]
[{"$nulls":9},"",null,null,{"$f":"IF(ISNUMBER(I27),IF(OR(I27<_xlfn.QUARTILE.INC($I$10:$I$29,1)-1.5*(_xlfn.QUARTILE.INC($I$10:I40,3)-_xlfn.QUARTILE.INC($I$10:$I$29,1)),I27>_xlfn.QUARTILE.INC($I$10:$I$29,3)+1.5*(_xlfn.QUARTILE.INC($I$10:$I$29,3)-_xlfn.QUARTILE.INC($I$10:$I$29,1))),\"Não\",\"Sim\"),\"\")","v":""},"","","","",""]
[{"$nulls":9},"",null,null,{"$f":"IF(ISNUMBER(I28),IF(OR(I28<_xlfn.QUARTILE.INC($I$10:$I$29,1)-1.5*(_xlfn.QUARTILE.INC($I$10:I40,3)-_xlfn.QUARTILE.INC($I$10:$I$29,1)),I28>_xlfn.QUARTILE.INC($I$10:$I$29,3)+1.5*(_xlfn.QUARTILE.INC($I$10:$I$29,3)-_xlfn.QUARTILE.INC($I$10:$I$29,1))),\"Não\",\"Sim\"),\"\")","v":""},"","","","",""]
[{"$nulls":9},"",null,null,{"$f":"IF(ISNUMBER(I29),IF(OR(I29<_xlfn.QUARTILE.INC($I$10:$I$29,1)-1.5*(_xlfn.QUARTILE.INC($I$10:I40,3)-_xlfn.QUARTILE.INC($I$10:$I$29,1)),I29>_xlfn.QUARTILE.INC($I$10:$I$29,3)+1.5*(_xlfn.QUARTILE.INC($I$10:$I$29,3)-_xlfn.QUARTILE.INC($I$10:$I$29,1))),\"Não\",\"Sim\"),\"\")","v":""},"","","","",""]
[null,"Observações:",{"$nulls":6},"CV:",{"$f":"IF($J$33=\"\",\"Selecione metodologia para exclusão de preços\",IF(COUNTIF($J$10:$J$29,\"Sim\")<3,\"N/D (são necessários pelo menos 3 preços)\",_xlfn.STDEV.S(IF($J$10:$J$29=\"Sim\",$I$10:$I$29))/AVERAGE(IF($J$10:$J$29=\"Sim\",$I$10:$I$29))))","v":8.1810201509171065E-2},null,"Média (Cotações)",{"$f":"IF(COUNTIF(M19:M29,\"Sim\")<3,\"N/D (são necessários pelo menos 3 preços)\",AVERAGE(IF(M19:M29=\"Sim\",$I19:$I29)))","v":7.3402666666666674},{"$f":"IF(COUNTIF(N19:N29,\"Sim\")<3,\"N/D (são necessários pelo menos 3 preços)\",AVERAGE(IF(N19:N29=\"Sim\",$I19:$I29)))","v":7.3402666666666674},{"$f":"IF(COUNTIF(O19:O29,\"Sim\")<3,\"N/D (são necessários pelo menos 3 preços)\",AVERAGE(IF(O19:O29=\"Sim\",$I19:$I29)))","v":"N/D (são necessários pelo menos 3 preços)"},{"$f":"IF(COUNTIF(P19:P29,\"Sim\")<3,\"N/D (são necessários pelo menos 3 preços)\",AVERAGE(IF(P19:P29=\"Sim\",$I19:$I29)))","v":"N/D (são necessários pelo menos 3 preços)"},{"$f":"IF(COUNTIF(Q19:Q29,\"Sim\")<3,\"N/D (são necessários pelo menos 3 preços)\",AVERAGE(IF(Q19:Q29=\"Sim\",$I19:$I29)))","v":"N/D (são necessários pelo menos 3 preços)"},{"$f":"IF(COUNTIF(R19:R29,\"Sim\")<3,\"N/D (são necessários pelo menos 3 preços)\",AVERAGE(IF(R19:R29=\"Sim\",$I19:$I29)))","v":"N/D (são necessários pelo menos 3 preços)"},{"$f":"IF(COUNTIF(S19:S29,\"Sim\")<3,\"N/D (são necessários pelo menos 3 preços)\",AVERAGE(IF(S19:S29=\"Sim\",$I19:$I29)))","v":"N/D (são necessários pelo menos 3 preços)"}]
[{"$nulls":8},"Média:",{"$f":"IF($J$33=\"\",\"Selecione metodologia para exclusão de preços\",AVERAGE(IF($J$10:$J$29=\"Sim\",$I$10:$I$29)))","v":6.7907445060159173},null,"Mediana (Cotações)",{"$f":"IF(COUNTIF(M19:M29,\"Sim\")<3,\"N/D (são necessários pelo menos 3 preços)\",MEDIAN(IF(M19:M29=\"Sim\",$I19:$I29)))","v":6.9808000000000003},{"$f":"IF(COUNTIF(N19:N29,\"Sim\")<3,\"N/D (são necessários pelo menos 3 preços)\",MEDIAN(IF(N19:N29=\"Sim\",$I19:$I29)))","v":6.9808000000000003},{"$f":"IF(COUNTIF(O19:O29,\"Sim\")<3,\"N/D (são necessários pelo menos 3 preços)\",MEDIAN(IF(O19:O29=\"Sim\",$I19:$I29)))","v":"N/D (são necessários pelo menos 3 preços)"},{"$f":"IF(COUNTIF(P19:P29,\"Sim\")<3,\"N/D (são necessários pelo menos 3 preços)\",MEDIAN(IF(P19:P29=\"Sim\",$I19:$I29)))","v":"N/D (são necessários pelo menos 3 preços)"},{"$f":"IF(COUNTIF(Q19:Q29,\"Sim\")<3,\"N/D (são necessários pelo menos 3 preços)\",MEDIAN(IF(Q19:Q29=\"Sim\",$I19:$I29)))","v":"N/D (são necessários pelo menos 3 preços)"},{"$f":"IF(COUNTIF(R19:R29,\"Sim\")<3,\"N/D (são necessários pelo menos 3 preços)\",MEDIAN(IF(R19:R29=\"Sim\",$I19:$I29)))","v":"N/D (são necessários pelo menos 3 preços)"},{"$f":"IF(COUNTIF(S19:S29,\"Sim\")<3,\"N/D (são necessários pelo menos 3 preços)\",MEDIAN(IF(S19:S29=\"Sim\",$I19:$I29)))","v":"N/D (são necessários pelo menos 3 preços)"}]
[{"$nulls":8},"Mediana:",{"$f":"IF($J$33=\"\",\"Selecione metodologia para exclusão de preços\",MEDIAN(IF($J$10:$J$29=\"Sim\",$I$10:$I$29)))","v":6.5058621276428887},null,"CV (Cotações)",{"$f":"IF(COUNTIF(M19:M29,\"Sim\")<3,\"N/D (são necessários pelo menos 3 preços)\",_xlfn.STDEV.S(IF(M19:M29=\"Sim\",$I19:$I29))/AVERAGE(IF(M19:M29=\"Sim\",$I19:$I29)))","v":0.15836748257350924},{"$f":"IF(COUNTIF(N19:N29,\"Sim\")<3,\"N/D (são necessários pelo menos 3 preços)\",_xlfn.STDEV.S(IF(N19:N29=\"Sim\",$I19:$I29))/AVERAGE(IF(N19:N29=\"Sim\",$I19:$I29)))","v":0.15836748257350924},{"$f":"IF(COUNTIF(O19:O29,\"Sim\")<3,\"N/D (são necessários pelo menos 3 preços)\",_xlfn.STDEV.S(IF(O19:O29=\"Sim\",$I19:$I29))/AVERAGE(IF(O19:O29=\"Sim\",$I19:$I29)))","v":"N/D (são necessários pelo menos 3 preços)"},{"$f":"IF(COUNTIF(P19:P29,\"Sim\")<3,\"N/D (são necessários pelo menos 3 preços)\",_xlfn.STDEV.S(IF(P19:P29=\"Sim\",$I19:$I29))/AVERAGE(IF(P19:P29=\"Sim\",$I19:$I29)))","v":"N/D (são necessários pelo menos 3 preços)"},{"$f":"IF(COUNTIF(Q19:Q29,\"Sim\")<3,\"N/D (são necessários pelo menos 3 preços)\",_xlfn.STDEV.S(IF(Q19:Q29=\"Sim\",$I19:$I29))/AVERAGE(IF(Q19:Q29=\"Sim\",$I19:$I29)))","v":"N/D (são necessários pelo menos 3 preços)"},{"$f":"IF(COUNTIF(R19:R29,\"Sim\")<3,\"N/D (são necessários pelo menos 3 preços)\",_xlfn.STDEV.S(IF(R19:R29=\"Sim\",$I19:$I29))/AVERAGE(IF(R19:R29=\"Sim\",$I19:$I29)))","v":"N/D (são necessários pelo menos 3 preços)"},{"$f":"IF(COUNTIF(S19:S29,\"Sim\")<3,\"N/D (são necessários pelo menos 3 preços)\",_xlfn.STDEV.S(IF(S19:S29=\"Sim\",$I19:$I29))/AVERAGE(IF(S19:S29=\"Sim\",$I19:$I29)))","v":"N/D (são necessários pelo menos 3 preços)"}]
[null,"Metodologia de exclusão de preços adotada:",{"$nulls":7},{"$f":"IF(M38=\"\",INDEX(M18:S18,MATCH(MIN(M35:S35),M35:S35,0)),M38)","v":"Grupos - Sem o maior"},null,"Média",{"$f":"IF(SUM(COUNTIF($M$10:$M$16,\"Sim\")) + SUM(COUNTIF(M19:M29,\"Sim\")) < 3,\n   \"N/D (são necessários pelo menos 3 preços)\",\n   IFERROR(AVERAGE(_xlfn._xlws.FILTER($I$10:$I$16,$M$10:$M$16=\"Sim\"), _xlfn._xlws.FILTER($I$19:$I$29,M19:M29=\"Sim\")),M30))","v":7.0989537550132651},{"$f":"IF(SUM(COUNTIF($M$10:$M$16,\"Sim\")) + SUM(COUNTIF(N19:N29,\"Sim\")) < 3,\n   \"N/D (são necessários pelo menos 3 preços)\",\n   IFERROR(AVERAGE(_xlfn._xlws.FILTER($I$10:$I$16,$M$10:$M$16=\"Sim\"), _xlfn._xlws.FILTER($I$19:$I$29,N19:N29=\"Sim\")),N30))","v":7.0989537550132651},{"$f":"IF(SUM(COUNTIF($M$10:$M$16,\"Sim\")) + SUM(COUNTIF(O19:O29,\"Sim\")) < 3,\n   \"N/D (são necessários pelo menos 3 preços)\",\n   IFERROR(AVERAGE(_xlfn._xlws.FILTER($I$10:$I$16,$M$10:$M$16=\"Sim\"), _xlfn._xlws.FILTER($I$19:$I$29,O19:O29=\"Sim\")),O30))","v":6.7907445060159173},{"$f":"IF(SUM(COUNTIF($M$10:$M$16,\"Sim\")) + SUM(COUNTIF(P19:P29,\"Sim\")) < 3,\n   \"N/D (são necessários pelo menos 3 preços)\",\n   IFERROR(AVERAGE(_xlfn._xlws.FILTER($I$10:$I$16,$M$10:$M$16=\"Sim\"), _xlfn._xlws.FILTER($I$19:$I$29,P19:P29=\"Sim\")),P30))","v":7.2387445060159168},{"$f":"IF(SUM(COUNTIF($M$10:$M$16,\"Sim\")) + SUM(COUNTIF(Q19:Q29,\"Sim\")) < 3,\n   \"N/D (são necessários pelo menos 3 preços)\",\n   IFERROR(AVERAGE(_xlfn._xlws.FILTER($I$10:$I$16,$M$10:$M$16=\"Sim\"), _xlfn._xlws.FILTER($I$19:$I$29,Q19:Q29=\"Sim\")),Q30))","v":6.8884306325198956},{"$f":"IF(SUM(COUNTIF($M$10:$M$16,\"Sim\")) + SUM(COUNTIF(R19:R29,\"Sim\")) < 3,\n   \"N/D (são necessários pelo menos 3 preços)\",\n   IFERROR(AVERAGE(_xlfn._xlws.FILTER($I$10:$I$16,$M$10:$M$16=\"Sim\"), _xlfn._xlws.FILTER($I$19:$I$29,R19:R29=\"Sim\")),R30))","v":6.7432306325198965},{"$f":"IF(SUM(COUNTIF($S$10:$S$16,\"Sim\")) + SUM(COUNTIF(S19:S29,\"Sim\")) < 3,\n   \"N/D (são necessários pelo menos 3 preços)\",\n   IFERROR(AVERAGE(_xlfn._xlws.FILTER($I$10:$I$16,$S$10:$S$16=\"Sim\"), _xlfn._xlws.FILTER($I$19:$I$29,S19:S29=\"Sim\")),S30))","v":"N/D (são necessários pelo menos 3 preços)"}]
[{"$nulls":11},"Mediana",{"$f":"IF(SUM(COUNTIF($M$10:$M$16,\"Sim\")) + SUM(COUNTIF(M19:M29,\"Sim\")) < 3,\n   \"N/D (são necessários pelo menos 3 preços)\",\n   IFERROR(MEDIAN(_xlfn._xlws.FILTER($I$10:$I$16,$M$10:$M$16=\"Sim\"), _xlfn._xlws.FILTER($I$19:$I$29,M19:M29=\"Sim\")),M30))","v":6.7433310638214445},{"$f":"IF(SUM(COUNTIF($M$10:$M$16,\"Sim\")) + SUM(COUNTIF(N19:N29,\"Sim\")) < 3,\n   \"N/D (são necessários pelo menos 3 preços)\",\n   IFERROR(MEDIAN(_xlfn._xlws.FILTER($I$10:$I$16,$M$10:$M$16=\"Sim\"), _xlfn._xlws.FILTER($I$19:$I$29,N19:N29=\"Sim\")),N30))","v":6.7433310638214445},{"$f":"IF(SUM(COUNTIF($M$10:$M$16,\"Sim\")) + SUM(COUNTIF(O19:O29,\"Sim\")) < 3,\n   \"N/D (são necessários pelo menos 3 preços)\",\n   IFERROR(MEDIAN(_xlfn._xlws.FILTER($I$10:$I$16,$M$10:$M$16=\"Sim\"), _xlfn._xlws.FILTER($I$19:$I$29,O19:O29=\"Sim\")),O30))","v":6.5058621276428887},{"$f":"IF(SUM(COUNTIF($M$10:$M$16,\"Sim\")) + SUM(COUNTIF(P19:P29,\"Sim\")) < 3,\n   \"N/D (são necessários pelo menos 3 preços)\",\n   IFERROR(MEDIAN(_xlfn._xlws.FILTER($I$10:$I$16,$M$10:$M$16=\"Sim\"), _xlfn._xlws.FILTER($I$19:$I$29,P19:P29=\"Sim\")),P30))","v":6.9808000000000003},{"$f":"IF(SUM(COUNTIF($M$10:$M$16,\"Sim\")) + SUM(COUNTIF(Q19:Q29,\"Sim\")) < 3,\n   \"N/D (são necessários pelo menos 3 preços)\",\n   IFERROR(MEDIAN(_xlfn._xlws.FILTER($I$10:$I$16,$M$10:$M$16=\"Sim\"), _xlfn._xlws.FILTER($I$19:$I$29,Q19:Q29=\"Sim\")),Q30))","v":6.7433310638214445},{"$f":"IF(SUM(COUNTIF($M$10:$M$16,\"Sim\")) + SUM(COUNTIF(R19:R29,\"Sim\")) < 3,\n   \"N/D (são necessários pelo menos 3 preços)\",\n   IFERROR(MEDIAN(_xlfn._xlws.FILTER($I$10:$I$16,$M$10:$M$16=\"Sim\"), _xlfn._xlws.FILTER($I$19:$I$29,R19:R29=\"Sim\")),R30))","v":6.4529310638214445},{"$f":"IF(SUM(COUNTIF($S$10:$S$16,\"Sim\")) + SUM(COUNTIF(S19:S29,\"Sim\")) < 3,\n   \"N/D (são necessários pelo menos 3 preços)\",\n   IFERROR(MEDIAN(_xlfn._xlws.FILTER($I$10:$I$16,$S$10:$S$16=\"Sim\"), _xlfn._xlws.FILTER($I$19:$I$29,S19:S29=\"Sim\")),S30))","v":"N/D (são necessários pelo menos 3 preços)"}]
[{"$nulls":11},"CV",{"$f":"IF(SUM(COUNTIF($M$10:$M$16,\"Sim\")) + SUM(COUNTIF(M19:M29,\"Sim\")) < 3,\n   \"N/D (são necessários pelo menos 3 preços)\",\n   IFERROR(ROUND(_xlfn.STDEV.S(_xlfn._xlws.FILTER($I$10:$I$16,$M$10:$M$16=\"Sim\"), _xlfn._xlws.FILTER($I$19:$I$29,M19:M29=\"Sim\")) /\n   AVERAGE(_xlfn._xlws.FILTER($I$10:$I$16,$M$10:$M$16=\"Sim\"), _xlfn._xlws.FILTER($I$19:$I$29,M19:M29=\"Sim\")),4),M32)\n)","v":0.1273},{"$f":"IF(SUM(COUNTIF($M$10:$M$16,\"Sim\")) + SUM(COUNTIF(N19:N29,\"Sim\")) < 3,\n   \"N/D (são necessários pelo menos 3 preços)\",\n   IFERROR(ROUND(_xlfn.STDEV.S(_xlfn._xlws.FILTER($I$10:$I$16,$M$10:$M$16=\"Sim\"), _xlfn._xlws.FILTER($I$19:$I$29,N19:N29=\"Sim\")) /\n   AVERAGE(_xlfn._xlws.FILTER($I$10:$I$16,$M$10:$M$16=\"Sim\"), _xlfn._xlws.FILTER($I$19:$I$29,N19:N29=\"Sim\")),4),N32)\n)","v":0.1273},{"$f":"IF(SUM(COUNTIF($M$10:$M$16,\"Sim\")) + SUM(COUNTIF(O19:O29,\"Sim\")) < 3,\n   \"N/D (são necessários pelo menos 3 preços)\",\n   IFERROR(ROUND(_xlfn.STDEV.S(_xlfn._xlws.FILTER($I$10:$I$16,$M$10:$M$16=\"Sim\"), _xlfn._xlws.FILTER($I$19:$I$29,O19:O29=\"Sim\")) /\n   AVERAGE(_xlfn._xlws.FILTER($I$10:$I$16,$M$10:$M$16=\"Sim\"), _xlfn._xlws.FILTER($I$19:$I$29,O19:O29=\"Sim\")),4),O32)\n)","v":8.1799999999999998E-2},{"$f":"IF(SUM(COUNTIF($M$10:$M$16,\"Sim\")) + SUM(COUNTIF(P19:P29,\"Sim\")) < 3,\n   \"N/D (são necessários pelo menos 3 preços)\",\n   IFERROR(ROUND(_xlfn.STDEV.S(_xlfn._xlws.FILTER($I$10:$I$16,$M$10:$M$16=\"Sim\"), _xlfn._xlws.FILTER($I$19:$I$29,P19:P29=\"Sim\")) /\n   AVERAGE(_xlfn._xlws.FILTER($I$10:$I$16,$M$10:$M$16=\"Sim\"), _xlfn._xlws.FILTER($I$19:$I$29,P19:P29=\"Sim\")),4),P32)\n)","v":0.12920000000000001},{"$f":"IF(SUM(COUNTIF($M$10:$M$16,\"Sim\")) + SUM(COUNTIF(Q19:Q29,\"Sim\")) < 3,\n   \"N/D (são necessários pelo menos 3 preços)\",\n   IFERROR(ROUND(_xlfn.STDEV.S(_xlfn._xlws.FILTER($I$10:$I$16,$M$10:$M$16=\"Sim\"), _xlfn._xlws.FILTER($I$19:$I$29,Q19:Q29=\"Sim\")) /\n   AVERAGE(_xlfn._xlws.FILTER($I$10:$I$16,$M$10:$M$16=\"Sim\"), _xlfn._xlws.FILTER($I$19:$I$29,Q19:Q29=\"Sim\")),4),Q32)\n)","v":8.5599999999999996E-2},{"$f":"IF(SUM(COUNTIF($M$10:$M$16,\"Sim\")) + SUM(COUNTIF(R19:R29,\"Sim\")) < 3,\n   \"N/D (são necessários pelo menos 3 preços)\",\n   IFERROR(ROUND(_xlfn.STDEV.S(_xlfn._xlws.FILTER($I$10:$I$16,$M$10:$M$16=\"Sim\"), _xlfn._xlws.FILTER($I$19:$I$29,R19:R29=\"Sim\")) /\n   AVERAGE(_xlfn._xlws.FILTER($I$10:$I$16,$M$10:$M$16=\"Sim\"), _xlfn._xlws.FILTER($I$19:$I$29,R19:R29=\"Sim\")),4),R32)\n)","v":9.3399999999999997E-2},{"$f":"IF(SUM(COUNTIF($S$10:$S$16,\"Sim\")) + SUM(COUNTIF(S19:S29,\"Sim\")) < 3,\n   \"N/D (são necessários pelo menos 3 preços)\",\n   IFERROR(_xlfn.STDEV.S(_xlfn._xlws.FILTER($I$10:$I$16,$S$10:$S$16=\"Sim\"), _xlfn._xlws.FILTER($I$19:$I$29,S19:S29=\"Sim\")) /\n   AVERAGE(_xlfn._xlws.FILTER($I$10:$I$16,$S$10:$S$16=\"Sim\"), _xlfn._xlws.FILTER($I$19:$I$29,S19:S29=\"Sim\")),S32)\n)","v":"N/D (são necessários pelo menos 3 preços)"}]
[null,"PREÇO UNITÁRIO ESTIMADO ADOTADO:",{"$nulls":7},{"$f":"IF($J$33=\"\",\"Selecione metodologia para exclusão de preços\",MIN(J31:J32))","v":6.5058621276428887},null,"Metodologia sugerida:",{"$f":"IF($M$35=MIN($M$35,$N$35:$R$35),M8,\"Grupos - \"&INDEX({\"Todos\";\"Sem o maior\";\"Sem o menor\";\"Sem o maior e Sem o menor\";\"Sem os dois maiores\"},MATCH(MIN($N$35:$R$35),$N$35:$R$35,0)))","v":"Grupos - Sem o maior"}]
[{"$nulls":11},"Preço estimado sugerido:",{"$f":"IF($M$36=M8,SMALL($M$33:$M$34,1),MIN(INDEX($N$34:$R$34, MATCH(MIN($N$35:$R$35), $N$35:$R$35, 0)),INDEX($N$33:$R$33, MATCH(MIN($N$35:$R$35), $N$35:$R$35, 0))))","v":6.5058621276428887}]
[{"$nulls":11},"Metodologia a adotar:",{"$f":"IF(INDEX(L18:S18,N38)=0,\"\",INDEX(L18:S18,N38))","v":""},1]

{"sheet":"Peixe 45% 1,2 mm","index":1,"n_rows":38,"n_cols":21,"rows_kept":38,"cut":false,"hidden":false,"merged":[[35,12,35,18],[36,12,36,18],[27,1,27,6],[28,1,28,6],[29,1,31,7],[32,1,34,8],[32,9,34,9],[35,1,37,8],[35,9,37,9],[26,1,26,6],[16,1,16,9],[16,12,16,18],[17,1,17,6],[18,1,18,6],[19,1,19,6],[20,1,20,6],[21,1,21,6],[22,1,22,6],[23,1,23,6],[24,1,24,6],[25,1,25,6],[15,12,15,17],[6,2,6,5],[6,12,6,18],[7,1,7,9],[7,12,7,18],[8,12,8,17],[9,12,9,17],[10,12,10,17],[11,12,11,17],[12,12,12,17],[13,12,13,17],[14,12,14,17]]}
[]
[null,"Processo",{"$f":"'Peixe 50% PB Farelo'!C2","v":"59511.000102/2026-55"}]
[null,"Responsável",{"$f":"'Peixe 50% PB Farelo'!C3","v":"JHONES DE LIMA VIEIRA"}]
[null,"Área de Origem",{"$f":"'Peixe 50% PB Farelo'!C4","v":"14ª GTR"}]
[null,"Data da pesquisa",{"$f":"'Peixe 50% PB Farelo'!C5","v":"Janeiro/2026 - Fevereiro/2026"}]
[]
[null,"ITEM:","Ração extrusada para peixe onívoro 45% PB – Proteína Bruta Mín.:  45%, granulometria 1,2 mm. Data de validade não inferior a 6 meses.",null,null,null,"UNIDADE DE MEDIDA:",{"$f":"'Peixe 50% PB Farelo'!H7","v":"kg"},"QUANTIDADE:",{"$f":"600*25","v":15000},null,null,"Tabela auxiliar de metodologias para exclusão de preços",{"$nulls":7},"Automática (menor CV)"]
[null,"LICITAÇÕES ANTERIORES",{"$nulls":10},"Licitações Anteriores - Outliers",{"$nulls":7},{"$f":"M18","v":"Outliers"}]
[null,"Órgão","Edital/Ano - Nº do Lote / Item","Quantidade","Valor Unitário","Data","índice de atualização (nome)","Variação acumulada do índice (%)","Preço unitário atualizado","Utilizar?  (Sim/Não)",null,null,"Utilizar?",{"$nulls":5},"Por critério do(a) analista",null,{"$f":"N18","v":"Grupos - Todos"}]
[null,"14ª SR - Fortaleza/CE","Edital 90007/2024 - Item 2",824,8.4,"2025-01-02","IPA-EP-DI Suprimentos agropecuários",{"$f":"(I10/E10)-1","v":1.6540957444201254E-2},{"$f":"IF(ISBLANK(E10),\"\",E10*(1+(INDEX('índice de atualização'!B:B,MATCH(G10,'índice de atualização'!B:B,0)+COUNTA('índice de atualização'!B:B)-1)-INDEX('índice de atualização'!B:B,MATCH(TEXT(F10,\"MM/AAAA\"),'índice de atualização'!A:A,0)))/INDEX('índice de atualização'!B:B,MATCH(TEXT(F10,\"MM/AAAA\"),'índice de atualização'!A:A,0))))","v":8.5389440425312912},{"$f":"IF(ISNUMBER(I10),IF($J$33<>$S$9,M10,S10),\"\")","v":"Sim"},null,null,{"$f":"IF(ISNUMBER(I10),IF(OR(I10<_xlfn.QUARTILE.INC($I$10:$I$29,1)-1.5*(_xlfn.QUARTILE.INC($I$10:I29,3)-_xlfn.QUARTILE.INC($I$10:$I$29,1)),I10>_xlfn.QUARTILE.INC($I$10:$I$29,3)+1.5*(_xlfn.QUARTILE.INC($I$10:$I$29,3)-_xlfn.QUARTILE.INC($I$10:$I$29,1))),\"Não\",\"Sim\"),\"\")","v":"Sim"},{"$nulls":7},{"$f":"O18","v":"Grupos - Sem o maior"}]
[null,"14ª SR - Fortaleza/CE","Edital 90007/2024 - Item 10",25,6.38,"2025-02-18","IPA-EP-DI Suprimentos agropecuários",{"$f":"(I11/E11)-1","v":4.5072426012993105E-4},{"$f":"IF(ISBLANK(E11),\"\",E11*(1+(INDEX('índice de atualização'!B:B,MATCH(G11,'índice de atualização'!B:B,0)+COUNTA('índice de atualização'!B:B)-1)-INDEX('índice de atualização'!B:B,MATCH(TEXT(F11,\"MM/AAAA\"),'índice de atualização'!A:A,0)))/INDEX('índice de atualização'!B:B,MATCH(TEXT(F11,\"MM/AAAA\"),'índice de atualização'!A:A,0))))","v":6.3828756207796289},{"$f":"IF(ISNUMBER(I11),IF($J$33<>$S$8,M11,S11),\"\")","v":"Sim"},null,null,{"$f":"IF(ISNUMBER(I11),IF(OR(I11<_xlfn.QUARTILE.INC($I$10:$I$29,1)-1.5*(_xlfn.QUARTILE.INC($I$10:I30,3)-_xlfn.QUARTILE.INC($I$10:$I$29,1)),I11>_xlfn.QUARTILE.INC($I$10:$I$29,3)+1.5*(_xlfn.QUARTILE.INC($I$10:$I$29,3)-_xlfn.QUARTILE.INC($I$10:$I$29,1))),\"Não\",\"Sim\"),\"\")","v":"Sim"},{"$nulls":7},{"$f":"P18","v":"Grupos - Sem o menor"}]
[null,"4ª SR - Aracaju/SE","Edital 90002/2025 - Item 2",4000,7.9,"2025-07-11","IPA-EP-DI Suprimentos agropecuários",{"$f":"(I12/E12)-1","v":-2.2368348389686266E-2},{"$f":"IF(ISBLANK(E12),\"\",E12*(1+(INDEX('índice de atualização'!B:B,MATCH(G12,'índice de atualização'!B:B,0)+COUNTA('índice de atualização'!B:B)-1)-INDEX('índice de atualização'!B:B,MATCH(TEXT(F12,\"MM/AAAA\"),'índice de atualização'!A:A,0)))/INDEX('índice de atualização'!B:B,MATCH(TEXT(F12,\"MM/AAAA\"),'índice de atualização'!A:A,0))))","v":7.7232900477214788},"Sim",null,null,{"$f":"IF(ISNUMBER(I12),IF(OR(I12<_xlfn.QUARTILE.INC($I$10:$I$29,1)-1.5*(_xlfn.QUARTILE.INC($I$10:I31,3)-_xlfn.QUARTILE.INC($I$10:$I$29,1)),I12>_xlfn.QUARTILE.INC($I$10:$I$29,3)+1.5*(_xlfn.QUARTILE.INC($I$10:$I$29,3)-_xlfn.QUARTILE.INC($I$10:$I$29,1))),\"Não\",\"Sim\"),\"\")","v":"Sim"},{"$f":"$M$12","v":"Sim"},{"$f":"$M$12","v":"Sim"},{"$f":"$M$12","v":"Sim"},{"$f":"$M$12","v":"Sim"},{"$f":"$M$12","v":"Sim"},null,null,{"$f":"Q18","v":"Grupos - Sem o maior e sem o menor"}]
[{"$nulls":8},{"$f":"IF(ISBLANK(E13),\"\",E13*(1+(INDEX('índice de atualização'!B:B,MATCH(G13,'índice de atualização'!B:B,0)+COUNTA('índice de atualização'!B:B)-1)-INDEX('índice de atualização'!B:B,MATCH(TEXT(F13,\"MM/AAAA\"),'índice de atualização'!A:A,0)))/INDEX('índice de atualização'!B:B,MATCH(TEXT(F13,\"MM/AAAA\"),'índice de atualização'!A:A,0))))","v":""},"",null,null,{"$f":"IF(ISNUMBER(I13),IF(OR(I13<_xlfn.QUARTILE.INC($I$10:$I$29,1)-1.5*(_xlfn.QUARTILE.INC($I$10:I32,3)-_xlfn.QUARTILE.INC($I$10:$I$29,1)),I13>_xlfn.QUARTILE.INC($I$10:$I$29,3)+1.5*(_xlfn.QUARTILE.INC($I$10:$I$29,3)-_xlfn.QUARTILE.INC($I$10:$I$29,1))),\"Não\",\"Sim\"),\"\")","v":""},{"$f":"$M$13","v":""},{"$f":"$M$13","v":""},{"$f":"$M$13","v":""},{"$f":"$M$13","v":""},{"$f":"$M$13","v":""},null,null,{"$f":"R18","v":"Grupos - Sem os dois maiores"}]
[{"$nulls":8},{"$f":"IF(ISBLANK(E14),\"\",E14*(1+(INDEX('índice de atualização'!B:B,MATCH(G14,'índice de atualização'!B:B,0)+COUNTA('índice de atualização'!B:B)-1)-INDEX('índice de atualização'!B:B,MATCH(TEXT(F14,\"MM/AAAA\"),'índice de atualização'!A:A,0)))/INDEX('índice de atualização'!B:B,MATCH(TEXT(F14,\"MM/AAAA\"),'índice de atualização'!A:A,0))))","v":""},"",null,null,{"$f":"IF(ISNUMBER(I14),IF(OR(I14<_xlfn.QUARTILE.INC($I$10:$I$29,1)-1.5*(_xlfn.QUARTILE.INC($I$10:I33,3)-_xlfn.QUARTILE.INC($I$10:$I$29,1)),I14>_xlfn.QUARTILE.INC($I$10:$I$29,3)+1.5*(_xlfn.QUARTILE.INC($I$10:$I$29,3)-_xlfn.QUARTILE.INC($I$10:$I$29,1))),\"Não\",\"Sim\"),\"\")","v":""},{"$f":"$M$14","v":""},{"$f":"$M$14","v":""},{"$f":"$M$14","v":""},{"$f":"$M$14","v":""},{"$f":"$M$14","v":""},null,null,{"$f":"S18","v":"Por critério do(a) analista"}]
[{"$nulls":8},{"$f":"IF(ISBLANK(E15),\"\",E15*(1+(INDEX('índice de atualização'!B:B,MATCH(G15,'índice de atualização'!B:B,0)+COUNTA('índice de atualização'!B:B)-1)-INDEX('índice de atualização'!B:B,MATCH(TEXT(F15,\"MM/AAAA\"),'índice de atualização'!A:A,0)))/INDEX('índice de atualização'!B:B,MATCH(TEXT(F15,\"MM/AAAA\"),'índice de atualização'!A:A,0))))","v":""},"",null,null,{"$f":"IF(ISNUMBER(I15),IF(OR(I15<_xlfn.QUARTILE.INC($I$10:$I$29,1)-1.5*(_xlfn.QUARTILE.INC($I$10:I36,3)-_xlfn.QUARTILE.INC($I$10:$I$29,1)),I15>_xlfn.QUARTILE.INC($I$10:$I$29,3)+1.5*(_xlfn.QUARTILE.INC($I$10:$I$29,3)-_xlfn.QUARTILE.INC($I$10:$I$29,1))),\"Não\",\"Sim\"),\"\")","v":""},{"$f":"$M$15","v":""},{"$f":"$M$15","v":""},{"$f":"$M$15","v":""},{"$f":"$M$15","v":""},{"$f":"$M$15","v":""}]
[{"$nulls":9},"",null,null,{"$f":"IF(ISNUMBER(I16),IF(OR(I16<_xlfn.QUARTILE.INC($I$10:$I$29,1)-1.5*(_xlfn.QUARTILE.INC($I$10:I39,3)-_xlfn.QUARTILE.INC($I$10:$I$29,1)),I16>_xlfn.QUARTILE.INC($I$10:$I$29,3)+1.5*(_xlfn.QUARTILE.INC($I$10:$I$29,3)-_xlfn.QUARTILE.INC($I$10:$I$29,1))),\"Não\",\"Sim\"),\"\")","v":""},{"$f":"$M$16","v":""},{"$f":"$M$16","v":""},{"$f":"$M$16","v":""},{"$f":"$M$16","v":""},{"$f":"$M$16","v":""}]
[null,"COTAÇÕES DE MERCADO",{"$nulls":10},"Cotações"]
[null,"Empresa",{"$nulls":5},"Data","Preço Unitário","Utilizar? (Sim/Não)",null,null,"Outliers","Grupos - Todos","Grupos - Sem o maior","Grupos - Sem o menor","Grupos - Sem o maior e sem o menor","Grupos - Sem os dois maiores","Por critério do(a) analista"]
[null,"Samaria Rações LTDA",{"$nulls":5},"2026-02-09",{"$f":"210/25","v":8.4},{"$f":"IF(ISNUMBER(I19),IF($J$33=$M$18,M19,IF($J$33=$N$18,N19,IF($J$33=$O$18,O19,IF($J$33=$P$18,P19,IF($J$33=$Q$18,Q19,IF($J$33=$R$18,R19,IF($J$33=$S$18,S19,\"\"))))))),\"\")","v":"Sim"},null,null,{"$f":"IF(ISNUMBER(I19),IF(OR(I19<_xlfn.QUARTILE.INC($I$10:$I$29,1)-1.5*(_xlfn.QUARTILE.INC($I$10:I40,3)-_xlfn.QUARTILE.INC($I$10:$I$29,1)),I19>_xlfn.QUARTILE.INC($I$10:$I$29,3)+1.5*(_xlfn.QUARTILE.INC($I$10:$I$29,3)-_xlfn.QUARTILE.INC($I$10:$I$29,1))),\"Não\",\"Sim\"),\"\")","v":"Sim"},{"$f":"IF(ISNUMBER(I19),\"Sim\",\"\")","v":"Sim"},{"$f":"IF(ISNUMBER(I19),IF(_xlfn.RANK.EQ(I19,$I$19:$I$29)=1,\"Não\",\"Sim\"),\"\")","v":"Sim"},{"$f":"IF(ISNUMBER(I19),IF(_xlfn.RANK.EQ(I19,$I$19:$I$29)=COUNT($I$19:$I$29),\"Não\",\"Sim\"),\"\")","v":"Sim"},{"$f":"IF(O19=\"\",\"\",IF(AND(O19=\"Sim\",P19=\"Sim\"),\"Sim\",\"Não\"))","v":"Sim"},{"$f":"IF(ISNUMBER(I19),IF(_xlfn.RANK.EQ(I19,$I$19:$I$29)<=2,\"Não\",\"Sim\"),\"\")","v":"Não"}]
[null,"Integral Mix Agroindustria",{"$nulls":5},"2026-02-07",{"$f":"182.78/25","v":7.3112000000000004},"Sim",null,null,{"$f":"IF(ISNUMBER(I20),IF(OR(I20<_xlfn.QUARTILE.INC($I$10:$I$29,1)-1.5*(_xlfn.QUARTILE.INC($I$10:I40,3)-_xlfn.QUARTILE.INC($I$10:$I$29,1)),I20>_xlfn.QUARTILE.INC($I$10:$I$29,3)+1.5*(_xlfn.QUARTILE.INC($I$10:$I$29,3)-_xlfn.QUARTILE.INC($I$10:$I$29,1))),\"Não\",\"Sim\"),\"\")","v":"Sim"},"Sim","Sim","Não",{"$f":"IF(O20=\"\",\"\",IF(AND(O20=\"Sim\",P20=\"Sim\"),\"Sim\",\"Não\"))","v":"Não"},"Sim"]
[null,"Comercial do Carmo ME",{"$nulls":5},"2026-02-12",{"$f":"283/25","v":11.32},"Não",null,null,{"$f":"IF(ISNUMBER(I21),IF(OR(I21<_xlfn.QUARTILE.INC($I$10:$I$29,1)-1.5*(_xlfn.QUARTILE.INC($I$10:I40,3)-_xlfn.QUARTILE.INC($I$10:$I$29,1)),I21>_xlfn.QUARTILE.INC($I$10:$I$29,3)+1.5*(_xlfn.QUARTILE.INC($I$10:$I$29,3)-_xlfn.QUARTILE.INC($I$10:$I$29,1))),\"Não\",\"Sim\"),\"\")","v":"Não"},"Sim","Não","Sim","Não","Não"]
[{"$nulls":9},"",null,null,{"$f":"IF(ISNUMBER(I22),IF(OR(I22<_xlfn.QUARTILE.INC($I$10:$I$29,1)-1.5*(_xlfn.QUARTILE.INC($I$10:I40,3)-_xlfn.QUARTILE.INC($I$10:$I$29,1)),I22>_xlfn.QUARTILE.INC($I$10:$I$29,3)+1.5*(_xlfn.QUARTILE.INC($I$10:$I$29,3)-_xlfn.QUARTILE.INC($I$10:$I$29,1))),\"Não\",\"Sim\"),\"\")","v":""},"","","","",""]
[{"$nulls":9},"",null,null,{"$f":"IF(ISNUMBER(I23),IF(OR(I23<_xlfn.QUARTILE.INC($I$10:$I$29,1)-1.5*(_xlfn.QUARTILE.INC($I$10:I41,3)-_xlfn.QUARTILE.INC($I$10:$I$29,1)),I23>_xlfn.QUARTILE.INC($I$10:$I$29,3)+1.5*(_xlfn.QUARTILE.INC($I$10:$I$29,3)-_xlfn.QUARTILE.INC($I$10:$I$29,1))),\"Não\",\"Sim\"),\"\")","v":""},"","","","",""]
[{"$nulls":9},"",null,null,{"$f":"IF(ISNUMBER(I24),IF(OR(I24<_xlfn.QUARTILE.INC($I$10:$I$29,1)-1.5*(_xlfn.QUARTILE.INC($I$10:I42,3)-_xlfn.QUARTILE.INC($I$10:$I$29,1)),I24>_xlfn.QUARTILE.INC($I$10:$I$29,3)+1.5*(_xlfn.QUARTILE.INC($I$10:$I$29,3)-_xlfn.QUARTILE.INC($I$10:$I$29,1))),\"Não\",\"Sim\"),\"\")","v":""},"","","","",""]
[{"$nulls":9},"",null,null,{"$f":"IF(ISNUMBER(I25),IF(OR(I25<_xlfn.QUARTILE.INC($I$10:$I$29,1)-1.5*(_xlfn.QUARTILE.INC($I$10:I40,3)-_xlfn.QUARTILE.INC($I$10:$I$29,1)),I25>_xlfn.QUARTILE.INC($I$10:$I$29,3)+1.5*(_xlfn.QUARTILE.INC($I$10:$I$29,3)-_xlfn.QUARTILE.INC($I$10:$I$29,1))),\"Não\",\"Sim\"),\"\")","v":""},"","","","",""]
[{"$nulls":9},"",null,null,{"$f":"IF(ISNUMBER(I26),IF(OR(I26<_xlfn.QUARTILE.INC($I$10:$I$29,1)-1.5*(_xlfn.QUARTILE.INC($I$10:I40,3)-_xlfn.QUARTILE.INC($I$10:$I$29,1)),I26>_xlfn.QUARTILE.INC($I$10:$I$29,3)+1.5*(_xlfn.QUARTILE.INC($I$10:$I$29,3)-_xlfn.QUARTILE.INC($I$10:$I$29,1))),\"Não\",\"Sim\"),\"\")","v":""},"","","","",""]
[{"$nulls":9},"",null,null,{"$f":"IF(ISNUMBER(I27),IF(OR(I27<_xlfn.QUARTILE.INC($I$10:$I$29,1)-1.5*(_xlfn.QUARTILE.INC($I$10:I40,3)-_xlfn.QUARTILE.INC($I$10:$I$29,1)),I27>_xlfn.QUARTILE.INC($I$10:$I$29,3)+1.5*(_xlfn.QUARTILE.INC($I$10:$I$29,3)-_xlfn.QUARTILE.INC($I$10:$I$29,1))),\"Não\",\"Sim\"),\"\")","v":""},"","","","",""]
[{"$nulls":9},"",null,null,{"$f":"IF(ISNUMBER(I28),IF(OR(I28<_xlfn.QUARTILE.INC($I$10:$I$29,1)-1.5*(_xlfn.QUARTILE.INC($I$10:I40,3)-_xlfn.QUARTILE.INC($I$10:$I$29,1)),I28>_xlfn.QUARTILE.INC($I$10:$I$29,3)+1.5*(_xlfn.QUARTILE.INC($I$10:$I$29,3)-_xlfn.QUARTILE.INC($I$10:$I$29,1))),\"Não\",\"Sim\"),\"\")","v":""},"","","","",""]
[{"$nulls":9},"",null,null,{"$f":"IF(ISNUMBER(I29),IF(OR(I29<_xlfn.QUARTILE.INC($I$10:$I$29,1)-1.5*(_xlfn.QUARTILE.INC($I$10:I40,3)-_xlfn.QUARTILE.INC($I$10:$I$29,1)),I29>_xlfn.QUARTILE.INC($I$10:$I$29,3)+1.5*(_xlfn.QUARTILE.INC($I$10:$I$29,3)-_xlfn.QUARTILE.INC($I$10:$I$29,1))),\"Não\",\"Sim\"),\"\")","v":""},"","","","",""]
[null,"Observações:",{"$nulls":6},"CV:",{"$f":"IF($J$33=\"\",\"Selecione metodologia para exclusão de preços\",IF(COUNTIF($J$10:$J$29,\"Sim\")<3,\"N/D (são necessários pelo menos 3 preços)\",_xlfn.STDEV.S(IF($J$10:$J$29=\"Sim\",$I$10:$I$29))/AVERAGE(IF($J$10:$J$29=\"Sim\",$I$10:$I$29))))","v":0.11431732265430404},null,"Média (Cotações)",{"$f":"IF(COUNTIF(M19:M29,\"Sim\")<3,\"N/D (são necessários pelo menos 3 preços)\",AVERAGE(IF(M19:M29=\"Sim\",$I19:$I29)))","v":"N/D (são necessários pelo menos 3 preços)"},{"$f":"IF(COUNTIF(N19:N29,\"Sim\")<3,\"N/D (são necessários pelo menos 3 preços)\",AVERAGE(IF(N19:N29=\"Sim\",$I19:$I29)))","v":9.0104000000000006},{"$f":"IF(COUNTIF(O19:O29,\"Sim\")<3,\"N/D (são necessários pelo menos 3 preços)\",AVERAGE(IF(O19:O29=\"Sim\",$I19:$I29)))","v":"N/D (são necessários pelo menos 3 preços)"},{"$f":"IF(COUNTIF(P19:P29,\"Sim\")<3,\"N/D (são necessários pelo menos 3 preços)\",AVERAGE(IF(P19:P29=\"Sim\",$I19:$I29)))","v":"N/D (são necessários pelo menos 3 preços)"},{"$f":"IF(COUNTIF(Q19:Q29,\"Sim\")<3,\"N/D (são necessários pelo menos 3 preços)\",AVERAGE(IF(Q19:Q29=\"Sim\",$I19:$I29)))","v":"N/D (são necessários pelo menos 3 preços)"},{"$f":"IF(COUNTIF(R19:R29,\"Sim\")<3,\"N/D (são necessários pelo menos 3 preços)\",AVERAGE(IF(R19:R29=\"Sim\",$I19:$I29)))","v":"N/D (são necessários pelo menos 3 preços)"},{"$f":"IF(COUNTIF(S19:S29,\"Sim\")<3,\"N/D (são necessários pelo menos 3 preços)\",AVERAGE(IF(S19:S29=\"Sim\",$I19:$I29)))","v":"N/D (são necessários pelo menos 3 preços)"}]
[{"$nulls":8},"Média:",{"$f":"IF($J$33=\"\",\"Selecione metodologia para exclusão de preços\",AVERAGE(IF($J$10:$J$29=\"Sim\",$I$10:$I$29)))","v":7.6712619422064794},null,"Mediana (Cotações)",{"$f":"IF(COUNTIF(M19:M29,\"Sim\")<3,\"N/D (são necessários pelo menos 3 preços)\",MEDIAN(IF(M19:M29=\"Sim\",$I19:$I29)))","v":"N/D (são necessários pelo menos 3 preços)"},{"$f":"IF(COUNTIF(N19:N29,\"Sim\")<3,\"N/D (são necessários pelo menos 3 preços)\",MEDIAN(IF(N19:N29=\"Sim\",$I19:$I29)))","v":8.4},{"$f":"IF(COUNTIF(O19:O29,\"Sim\")<3,\"N/D (são necessários pelo menos 3 preços)\",MEDIAN(IF(O19:O29=\"Sim\",$I19:$I29)))","v":"N/D (são necessários pelo menos 3 preços)"},{"$f":"IF(COUNTIF(P19:P29,\"Sim\")<3,\"N/D (são necessários pelo menos 3 preços)\",MEDIAN(IF(P19:P29=\"Sim\",$I19:$I29)))","v":"N/D (são necessários pelo menos 3 preços)"},{"$f":"IF(COUNTIF(Q19:Q29,\"Sim\")<3,\"N/D (são necessários pelo menos 3 preços)\",MEDIAN(IF(Q19:Q29=\"Sim\",$I19:$I29)))","v":"N/D (são necessários pelo menos 3 preços)"},{"$f":"IF(COUNTIF(R19:R29,\"Sim\")<3,\"N/D (são necessários pelo menos 3 preços)\",MEDIAN(IF(R19:R29=\"Sim\",$I19:$I29)))","v":"N/D (são necessários pelo menos 3 preços)"},{"$f":"IF(COUNTIF(S19:S29,\"Sim\")<3,\"N/D (são necessários pelo menos 3 preços)\",MEDIAN(IF(S19:S29=\"Sim\",$I19:$I29)))","v":"N/D (são necessários pelo menos 3 preços)"}]
[{"$nulls":8},"Mediana:",{"$f":"IF($J$33=\"\",\"Selecione metodologia para exclusão de preços\",MEDIAN(IF($J$10:$J$29=\"Sim\",$I$10:$I$29)))","v":7.7232900477214788},null,"CV (Cotações)",{"$f":"IF(COUNTIF(M19:M29,\"Sim\")<3,\"N/D (são necessários pelo menos 3 preços)\",_xlfn.STDEV.S(IF(M19:M29=\"Sim\",$I19:$I29))/AVERAGE(IF(M19:M29=\"Sim\",$I19:$I29)))","v":"N/D (são necessários pelo menos 3 preços)"},{"$f":"IF(COUNTIF(N19:N29,\"Sim\")<3,\"N/D (são necessários pelo menos 3 preços)\",_xlfn.STDEV.S(IF(N19:N29=\"Sim\",$I19:$I29))/AVERAGE(IF(N19:N29=\"Sim\",$I19:$I29)))","v":0.23006028954859717},{"$f":"IF(COUNTIF(O19:O29,\"Sim\")<3,\"N/D (são necessários pelo menos 3 preços)\",_xlfn.STDEV.S(IF(O19:O29=\"Sim\",$I19:$I29))/AVERAGE(IF(O19:O29=\"Sim\",$I19:$I29)))","v":"N/D (são necessários pelo menos 3 preços)"},{"$f":"IF(COUNTIF(P19:P29,\"Sim\")<3,\"N/D (são necessários pelo menos 3 preços)\",_xlfn.STDEV.S(IF(P19:P29=\"Sim\",$I19:$I29))/AVERAGE(IF(P19:P29=\"Sim\",$I19:$I29)))","v":"N/D (são necessários pelo menos 3 preços)"},{"$f":"IF(COUNTIF(Q19:Q29,\"Sim\")<3,\"N/D (são necessários pelo menos 3 preços)\",_xlfn.STDEV.S(IF(Q19:Q29=\"Sim\",$I19:$I29))/AVERAGE(IF(Q19:Q29=\"Sim\",$I19:$I29)))","v":"N/D (são necessários pelo menos 3 preços)"},{"$f":"IF(COUNTIF(R19:R29,\"Sim\")<3,\"N/D (são necessários pelo menos 3 preços)\",_xlfn.STDEV.S(IF(R19:R29=\"Sim\",$I19:$I29))/AVERAGE(IF(R19:R29=\"Sim\",$I19:$I29)))","v":"N/D (são necessários pelo menos 3 preços)"},{"$f":"IF(COUNTIF(S19:S29,\"Sim\")<3,\"N/D (são necessários pelo menos 3 preços)\",_xlfn.STDEV.S(IF(S19:S29=\"Sim\",$I19:$I29))/AVERAGE(IF(S19:S29=\"Sim\",$I19:$I29)))","v":"N/D (são necessários pelo menos 3 preços)"}]
[null,"Metodologia de exclusão de preços adotada:",{"$nulls":7},{"$f":"IF(M38=\"\",INDEX(M18:S18,MATCH(MIN(M35:S35),M35:S35,0)),M38)","v":"Outliers"},null,"Média",{"$f":"IF(SUM(COUNTIF($M$10:$M$16,\"Sim\")) + SUM(COUNTIF(M19:M29,\"Sim\")) < 3,\n   \"N/D (são necessários pelo menos 3 preços)\",\n   IFERROR(AVERAGE(_xlfn._xlws.FILTER($I$10:$I$16,$M$10:$M$16=\"Sim\"), _xlfn._xlws.FILTER($I$19:$I$29,M19:M29=\"Sim\")),M30))","v":7.6712619422064794},{"$f":"IF(SUM(COUNTIF($M$10:$M$16,\"Sim\")) + SUM(COUNTIF(N19:N29,\"Sim\")) < 3,\n   \"N/D (são necessários pelo menos 3 preços)\",\n   IFERROR(AVERAGE(_xlfn._xlws.FILTER($I$10:$I$16,$M$10:$M$16=\"Sim\"), _xlfn._xlws.FILTER($I$19:$I$29,N19:N29=\"Sim\")),N30))","v":8.2793849518387326},{"$f":"IF(SUM(COUNTIF($M$10:$M$16,\"Sim\")) + SUM(COUNTIF(O19:O29,\"Sim\")) < 3,\n   \"N/D (são necessários pelo menos 3 preços)\",\n   IFERROR(AVERAGE(_xlfn._xlws.FILTER($I$10:$I$16,$M$10:$M$16=\"Sim\"), _xlfn._xlws.FILTER($I$19:$I$29,O19:O29=\"Sim\")),O30))","v":7.6712619422064794},{"$f":"IF(SUM(COUNTIF($M$10:$M$16,\"Sim\")) + SUM(COUNTIF(P19:P29,\"Sim\")) < 3,\n   \"N/D (são necessários pelo menos 3 preços)\",\n   IFERROR(AVERAGE(_xlfn._xlws.FILTER($I$10:$I$16,$M$10:$M$16=\"Sim\"), _xlfn._xlws.FILTER($I$19:$I$29,P19:P29=\"Sim\")),P30))","v":8.4730219422064792},{"$f":"IF(SUM(COUNTIF($M$10:$M$16,\"Sim\")) + SUM(COUNTIF(Q19:Q29,\"Sim\")) < 3,\n   \"N/D (são necessários pelo menos 3 preços)\",\n   IFERROR(AVERAGE(_xlfn._xlws.FILTER($I$10:$I$16,$M$10:$M$16=\"Sim\"), _xlfn._xlws.FILTER($I$19:$I$29,Q19:Q29=\"Sim\")),Q30))","v":7.7612774277580989},{"$f":"IF(SUM(COUNTIF($M$10:$M$16,\"Sim\")) + SUM(COUNTIF(R19:R29,\"Sim\")) < 3,\n   \"N/D (são necessários pelo menos 3 preços)\",\n   IFERROR(AVERAGE(_xlfn._xlws.FILTER($I$10:$I$16,$M$10:$M$16=\"Sim\"), _xlfn._xlws.FILTER($I$19:$I$29,R19:R29=\"Sim\")),R30))","v":7.4890774277580991},{"$f":"IF(SUM(COUNTIF($S$10:$S$16,\"Sim\")) + SUM(COUNTIF(S19:S29,\"Sim\")) < 3,\n   \"N/D (são necessários pelo menos 3 preços)\",\n   IFERROR(AVERAGE(_xlfn._xlws.FILTER($I$10:$I$16,$S$10:$S$16=\"Sim\"), _xlfn._xlws.FILTER($I$19:$I$29,S19:S29=\"Sim\")),S30))","v":"N/D (são necessários pelo menos 3 preços)"}]
[{"$nulls":11},"Mediana",{"$f":"IF(SUM(COUNTIF($M$10:$M$16,\"Sim\")) + SUM(COUNTIF(M19:M29,\"Sim\")) < 3,\n   \"N/D (são necessários pelo menos 3 preços)\",\n   IFERROR(MEDIAN(_xlfn._xlws.FILTER($I$10:$I$16,$M$10:$M$16=\"Sim\"), _xlfn._xlws.FILTER($I$19:$I$29,M19:M29=\"Sim\")),M30))","v":7.7232900477214788},{"$f":"IF(SUM(COUNTIF($M$10:$M$16,\"Sim\")) + SUM(COUNTIF(N19:N29,\"Sim\")) < 3,\n   \"N/D (são necessários pelo menos 3 preços)\",\n   IFERROR(MEDIAN(_xlfn._xlws.FILTER($I$10:$I$16,$M$10:$M$16=\"Sim\"), _xlfn._xlws.FILTER($I$19:$I$29,N19:N29=\"Sim\")),N30))","v":8.0616450238607396},{"$f":"IF(SUM(COUNTIF($M$10:$M$16,\"Sim\")) + SUM(COUNTIF(O19:O29,\"Sim\")) < 3,\n   \"N/D (são necessários pelo menos 3 preços)\",\n   IFERROR(MEDIAN(_xlfn._xlws.FILTER($I$10:$I$16,$M$10:$M$16=\"Sim\"), _xlfn._xlws.FILTER($I$19:$I$29,O19:O29=\"Sim\")),O30))","v":7.7232900477214788},{"$f":"IF(SUM(COUNTIF($M$10:$M$16,\"Sim\")) + SUM(COUNTIF(P19:P29,\"Sim\")) < 3,\n   \"N/D (são necessários pelo menos 3 preços)\",\n   IFERROR(MEDIAN(_xlfn._xlws.FILTER($I$10:$I$16,$M$10:$M$16=\"Sim\"), _xlfn._xlws.FILTER($I$19:$I$29,P19:P29=\"Sim\")),P30))","v":8.4},{"$f":"IF(SUM(COUNTIF($M$10:$M$16,\"Sim\")) + SUM(COUNTIF(Q19:Q29,\"Sim\")) < 3,\n   \"N/D (são necessários pelo menos 3 preços)\",\n   IFERROR(MEDIAN(_xlfn._xlws.FILTER($I$10:$I$16,$M$10:$M$16=\"Sim\"), _xlfn._xlws.FILTER($I$19:$I$29,Q19:Q29=\"Sim\")),Q30))","v":8.0616450238607396},{"$f":"IF(SUM(COUNTIF($M$10:$M$16,\"Sim\")) + SUM(COUNTIF(R19:R29,\"Sim\")) < 3,\n   \"N/D (são necessários pelo menos 3 preços)\",\n   IFERROR(MEDIAN(_xlfn._xlws.FILTER($I$10:$I$16,$M$10:$M$16=\"Sim\"), _xlfn._xlws.FILTER($I$19:$I$29,R19:R29=\"Sim\")),R30))","v":7.51724502386074},{"$f":"IF(SUM(COUNTIF($S$10:$S$16,\"Sim\")) + SUM(COUNTIF(S19:S29,\"Sim\")) < 3,\n   \"N/D (são necessários pelo menos 3 preços)\",\n   IFERROR(MEDIAN(_xlfn._xlws.FILTER($I$10:$I$16,$S$10:$S$16=\"Sim\"), _xlfn._xlws.FILTER($I$19:$I$29,S19:S29=\"Sim\")),S30))","v":"N/D (são necessários pelo menos 3 preços)"}]
[{"$nulls":11},"CV",{"$f":"IF(SUM(COUNTIF($M$10:$M$16,\"Sim\")) + SUM(COUNTIF(M19:M29,\"Sim\")) < 3,\n   \"N/D (são necessários pelo menos 3 preços)\",\n   IFERROR(ROUND(_xlfn.STDEV.S(_xlfn._xlws.FILTER($I$10:$I$16,$M$10:$M$16=\"Sim\"), _xlfn._xlws.FILTER($I$19:$I$29,M19:M29=\"Sim\")) /\n   AVERAGE(_xlfn._xlws.FILTER($I$10:$I$16,$M$10:$M$16=\"Sim\"), _xlfn._xlws.FILTER($I$19:$I$29,M19:M29=\"Sim\")),4),M32)\n)","v":0.1143},{"$f":"IF(SUM(COUNTIF($M$10:$M$16,\"Sim\")) + SUM(COUNTIF(N19:N29,\"Sim\")) < 3,\n   \"N/D (são necessários pelo menos 3 preços)\",\n   IFERROR(ROUND(_xlfn.STDEV.S(_xlfn._xlws.FILTER($I$10:$I$16,$M$10:$M$16=\"Sim\"), _xlfn._xlws.FILTER($I$19:$I$29,N19:N29=\"Sim\")) /\n   AVERAGE(_xlfn._xlws.FILTER($I$10:$I$16,$M$10:$M$16=\"Sim\"), _xlfn._xlws.FILTER($I$19:$I$29,N19:N29=\"Sim\")),4),N32)\n)","v":0.20330000000000001},{"$f":"IF(SUM(COUNTIF($M$10:$M$16,\"Sim\")) + SUM(COUNTIF(O19:O29,\"Sim\")) < 3,\n   \"N/D (são necessários pelo menos 3 preços)\",\n   IFERROR(ROUND(_xlfn.STDEV.S(_xlfn._xlws.FILTER($I$10:$I$16,$M$10:$M$16=\"Sim\"), _xlfn._xlws.FILTER($I$19:$I$29,O19:O29=\"Sim\")) /\n   AVERAGE(_xlfn._xlws.FILTER($I$10:$I$16,$M$10:$M$16=\"Sim\"), _xlfn._xlws.FILTER($I$19:$I$29,O19:O29=\"Sim\")),4),O32)\n)","v":0.1143},{"$f":"IF(SUM(COUNTIF($M$10:$M$16,\"Sim\")) + SUM(COUNTIF(P19:P29,\"Sim\")) < 3,\n   \"N/D (são necessários pelo menos 3 preços)\",\n   IFERROR(ROUND(_xlfn.STDEV.S(_xlfn._xlws.FILTER($I$10:$I$16,$M$10:$M$16=\"Sim\"), _xlfn._xlws.FILTER($I$19:$I$29,P19:P29=\"Sim\")) /\n   AVERAGE(_xlfn._xlws.FILTER($I$10:$I$16,$M$10:$M$16=\"Sim\"), _xlfn._xlws.FILTER($I$19:$I$29,P19:P29=\"Sim\")),4),P32)\n)","v":0.21310000000000001},{"$f":"IF(SUM(COUNTIF($M$10:$M$16,\"Sim\")) + SUM(COUNTIF(Q19:Q29,\"Sim\")) < 3,\n   \"N/D (são necessários pelo menos 3 preços)\",\n   IFERROR(ROUND(_xlfn.STDEV.S(_xlfn._xlws.FILTER($I$10:$I$16,$M$10:$M$16=\"Sim\"), _xlfn._xlws.FILTER($I$19:$I$29,Q19:Q29=\"Sim\")) /\n   AVERAGE(_xlfn._xlws.FILTER($I$10:$I$16,$M$10:$M$16=\"Sim\"), _xlfn._xlws.FILTER($I$19:$I$29,Q19:Q29=\"Sim\")),4),Q32)\n)","v":0.127},{"$f":"IF(SUM(COUNTIF($M$10:$M$16,\"Sim\")) + SUM(COUNTIF(R19:R29,\"Sim\")) < 3,\n   \"N/D (são necessários pelo menos 3 preços)\",\n   IFERROR(ROUND(_xlfn.STDEV.S(_xlfn._xlws.FILTER($I$10:$I$16,$M$10:$M$16=\"Sim\"), _xlfn._xlws.FILTER($I$19:$I$29,R19:R29=\"Sim\")) /\n   AVERAGE(_xlfn._xlws.FILTER($I$10:$I$16,$M$10:$M$16=\"Sim\"), _xlfn._xlws.FILTER($I$19:$I$29,R19:R29=\"Sim\")),4),R32)\n)","v":0.1197},{"$f":"IF(SUM(COUNTIF($S$10:$S$16,\"Sim\")) + SUM(COUNTIF(S19:S29,\"Sim\")) < 3,\n   \"N/D (são necessários pelo menos 3 preços)\",\n   IFERROR(_xlfn.STDEV.S(_xlfn._xlws.FILTER($I$10:$I$16,$S$10:$S$16=\"Sim\"), _xlfn._xlws.FILTER($I$19:$I$29,S19:S29=\"Sim\")) /\n   AVERAGE(_xlfn._xlws.FILTER($I$10:$I$16,$S$10:$S$16=\"Sim\"), _xlfn._xlws.FILTER($I$19:$I$29,S19:S29=\"Sim\")),S32)\n)","v":"N/D (são necessários pelo menos 3 preços)"}]
[null,"PREÇO UNITÁRIO ESTIMADO ADOTADO:",{"$nulls":7},{"$f":"IF($J$33=\"\",\"Selecione metodologia para exclusão de preços\",MIN(J31:J32))","v":7.6712619422064794},null,"Metodologia sugerida:",{"$f":"IF($M$35=MIN($M$35,$N$35:$R$35),M8,\"Grupos - \"&INDEX({\"Todos\";\"Sem o maior\";\"Sem o menor\";\"Sem o maior e Sem o menor\";\"Sem os dois maiores\"},MATCH(MIN($N$35:$R$35),$N$35:$R$35,0)))","v":"Licitações Anteriores - Outliers"}]
[{"$nulls":11},"Preço estimado sugerido:",{"$f":"IF($M$36=M8,SMALL($M$33:$M$34,1),MIN(INDEX($N$34:$R$34, MATCH(MIN($N$35:$R$35), $N$35:$R$35, 0)),INDEX($N$33:$R$33, MATCH(MIN($N$35:$R$35), $N$35:$R$35, 0))))","v":7.6712619422064794}]
[{"$nulls":11},"Metodologia a adotar:",{"$f":"IF(INDEX(L18:S18,N38)=0,\"\",INDEX(L18:S18,N38))","v":""},1]

{"sheet":"Peixe 45% 1,8 mm","index":2,"n_rows":38,"n_cols":21,"rows_kept":38,"cut":false,"hidden":false,"merged":[[15,12,15,17],[6,2,6,5],[6,12,6,18],[7,1,7,9],[7,12,7,18],[8,12,8,17],[9,12,9,17],[10,12,10,17],[11,12,11,17],[12,12,12,17],[13,12,13,17],[14,12,14,17],[26,1,26,6],[16,1,16,9],[16,12,16,18],[17,1,17,6],[18,1,18,6],[19,1,19,6],[20,1,20,6],[21,1,21,6],[22,1,22,6],[23,1,23,6],[24,1,24,6],[25,1,25,6],[35,12,35,18],[36,12,36,18],[27,1,27,6],[28,1,28,6],[29,1,31,7],[32,1,34,8],[32,9,34,9],[35,1,37,8],[35,9,37,9]]}
[]
[null,"Processo",{"$f":"'Peixe 50% PB Farelo'!C2","v":"59511.000102/2026-55"}]
[null,"Responsável",{"$f":"'Peixe 50% PB Farelo'!C3","v":"JHONES DE LIMA VIEIRA"}]
[null,"Área de Origem",{"$f":"'Peixe 50% PB Farelo'!C4","v":"14ª GTR"}]
[null,"Data da pesquisa",{"$f":"'Peixe 50% PB Farelo'!C5","v":"Janeiro/2026 - Fevereiro/2026"}]
[]
[null,"ITEM:","Ração extrusada para peixe onívoro 45% PB – Proteína Bruta Mín.: 45%, granulometria 1.8 mm. Data de validade não inferior a 6 meses.",null,null,null,"UNIDADE DE MEDIDA:",{"$f":"'Peixe 50% PB Farelo'!H7","v":"kg"},"QUANTIDADE:",{"$f":"1500*25","v":37500},null,null,"Tabela auxiliar de metodologias para exclusão de preços",{"$nulls":7},"Automática (menor CV)"]
[null,"LICITAÇÕES ANTERIORES",{"$nulls":10},"Licitações Anteriores - Outliers",{"$nulls":7},{"$f":"M18","v":"Outliers"}]
[null,"Órgão","Edital/Ano - Nº do Lote / Item","Quantidade","Valor Unitário","Data","índice de atualização (nome)","Variação acumulada do índice (%)","Preço unitário atualizado","Utilizar?  (Sim/Não)",null,null,"Utilizar?",{"$nulls":5},"Por critério do(a) analista",null,{"$f":"N18","v":"Grupos - Todos"}]
[null,"14ª SR - Fortaleza/CE","Edital 90007/2024 - Item 3",3736,6.27,"2025-01-02","IPA-EP-DI Suprimentos agropecuários",{"$f":"(I10/E10)-1","v":1.6540957444201254E-2},{"$f":"IF(ISBLANK(E10),\"\",E10*(1+(INDEX('índice de atualização'!B:B,MATCH(G10,'índice de atualização'!B:B,0)+COUNTA('índice de atualização'!B:B)-1)-INDEX('índice de atualização'!B:B,MATCH(TEXT(F10,\"MM/AAAA\"),'índice de atualização'!A:A,0)))/INDEX('índice de atualização'!B:B,MATCH(TEXT(F10,\"MM/AAAA\"),'índice de atualização'!A:A,0))))","v":6.3737118031751416},{"$f":"IF(ISNUMBER(I10),IF($J$33<>$S$9,M10,S10),\"\")","v":"Sim"},null,null,{"$f":"IF(ISNUMBER(I10),IF(OR(I10<_xlfn.QUARTILE.INC($I$10:$I$29,1)-1.5*(_xlfn.QUARTILE.INC($I$10:I29,3)-_xlfn.QUARTILE.INC($I$10:$I$29,1)),I10>_xlfn.QUARTILE.INC($I$10:$I$29,3)+1.5*(_xlfn.QUARTILE.INC($I$10:$I$29,3)-_xlfn.QUARTILE.INC($I$10:$I$29,1))),\"Não\",\"Sim\"),\"\")","v":"Sim"},{"$nulls":7},{"$f":"O18","v":"Grupos - Sem o maior"}]
[null,"14ª SR - Fortaleza/CE","Edital 90007/2024 - Item 11",650,6.28,"2025-02-18","IPA-EP-DI Suprimentos agropecuários",{"$f":"(I11/E11)-1","v":4.5072426012993105E-4},{"$f":"IF(ISBLANK(E11),\"\",E11*(1+(INDEX('índice de atualização'!B:B,MATCH(G11,'índice de atualização'!B:B,0)+COUNTA('índice de atualização'!B:B)-1)-INDEX('índice de atualização'!B:B,MATCH(TEXT(F11,\"MM/AAAA\"),'índice de atualização'!A:A,0)))/INDEX('índice de atualização'!B:B,MATCH(TEXT(F11,\"MM/AAAA\"),'índice de atualização'!A:A,0))))","v":6.2828305483536164},{"$f":"IF(ISNUMBER(I11),IF($J$33<>$S$8,M11,S11),\"\")","v":"Sim"},null,null,{"$f":"IF(ISNUMBER(I11),IF(OR(I11<_xlfn.QUARTILE.INC($I$10:$I$29,1)-1.5*(_xlfn.QUARTILE.INC($I$10:I30,3)-_xlfn.QUARTILE.INC($I$10:$I$29,1)),I11>_xlfn.QUARTILE.INC($I$10:$I$29,3)+1.5*(_xlfn.QUARTILE.INC($I$10:$I$29,3)-_xlfn.QUARTILE.INC($I$10:$I$29,1))),\"Não\",\"Sim\"),\"\")","v":"Sim"},{"$nulls":7},{"$f":"P18","v":"Grupos - Sem o menor"}]
[null,"4ª SR - Aracaju/SE","Edital 90002/2025 - Item 2",4000,7.9,"2025-07-11","IPA-EP-DI Suprimentos agropecuários",{"$f":"(I12/E12)-1","v":-2.2368348389686266E-2},{"$f":"IF(ISBLANK(E12),\"\",E12*(1+(INDEX('índice de atualização'!B:B,MATCH(G12,'índice de atualização'!B:B,0)+COUNTA('índice de atualização'!B:B)-1)-INDEX('índice de atualização'!B:B,MATCH(TEXT(F12,\"MM/AAAA\"),'índice de atualização'!A:A,0)))/INDEX('índice de atualização'!B:B,MATCH(TEXT(F12,\"MM/AAAA\"),'índice de atualização'!A:A,0))))","v":7.7232900477214788},"Sim",null,null,{"$f":"IF(ISNUMBER(I12),IF(OR(I12<_xlfn.QUARTILE.INC($I$10:$I$29,1)-1.5*(_xlfn.QUARTILE.INC($I$10:I31,3)-_xlfn.QUARTILE.INC($I$10:$I$29,1)),I12>_xlfn.QUARTILE.INC($I$10:$I$29,3)+1.5*(_xlfn.QUARTILE.INC($I$10:$I$29,3)-_xlfn.QUARTILE.INC($I$10:$I$29,1))),\"Não\",\"Sim\"),\"\")","v":"Sim"},{"$f":"$M$12","v":"Sim"},{"$f":"$M$12","v":"Sim"},{"$f":"$M$12","v":"Sim"},{"$f":"$M$12","v":"Sim"},{"$f":"$M$12","v":"Sim"},null,null,{"$f":"Q18","v":"Grupos - Sem o maior e sem o menor"}]
[{"$nulls":8},{"$f":"IF(ISBLANK(E13),\"\",E13*(1+(INDEX('índice de atualização'!B:B,MATCH(G13,'índice de atualização'!B:B,0)+COUNTA('índice de atualização'!B:B)-1)-INDEX('índice de atualização'!B:B,MATCH(TEXT(F13,\"MM/AAAA\"),'índice de atualização'!A:A,0)))/INDEX('índice de atualização'!B:B,MATCH(TEXT(F13,\"MM/AAAA\"),'índice de atualização'!A:A,0))))","v":""},"",null,null,{"$f":"IF(ISNUMBER(I13),IF(OR(I13<_xlfn.QUARTILE.INC($I$10:$I$29,1)-1.5*(_xlfn.QUARTILE.INC($I$10:I32,3)-_xlfn.QUARTILE.INC($I$10:$I$29,1)),I13>_xlfn.QUARTILE.INC($I$10:$I$29,3)+1.5*(_xlfn.QUARTILE.INC($I$10:$I$29,3)-_xlfn.QUARTILE.INC($I$10:$I$29,1))),\"Não\",\"Sim\"),\"\")","v":""},{"$f":"$M$13","v":""},{"$f":"$M$13","v":""},{"$f":"$M$13","v":""},{"$f":"$M$13","v":""},{"$f":"$M$13","v":""},null,null,{"$f":"R18","v":"Grupos - Sem os dois maiores"}]
[{"$nulls":8},{"$f":"IF(ISBLANK(E14),\"\",E14*(1+(INDEX('índice de atualização'!B:B,MATCH(G14,'índice de atualização'!B:B,0)+COUNTA('índice de atualização'!B:B)-1)-INDEX('índice de atualização'!B:B,MATCH(TEXT(F14,\"MM/AAAA\"),'índice de atualização'!A:A,0)))/INDEX('índice de atualização'!B:B,MATCH(TEXT(F14,\"MM/AAAA\"),'índice de atualização'!A:A,0))))","v":""},"",null,null,{"$f":"IF(ISNUMBER(I14),IF(OR(I14<_xlfn.QUARTILE.INC($I$10:$I$29,1)-1.5*(_xlfn.QUARTILE.INC($I$10:I33,3)-_xlfn.QUARTILE.INC($I$10:$I$29,1)),I14>_xlfn.QUARTILE.INC($I$10:$I$29,3)+1.5*(_xlfn.QUARTILE.INC($I$10:$I$29,3)-_xlfn.QUARTILE.INC($I$10:$I$29,1))),\"Não\",\"Sim\"),\"\")","v":""},{"$f":"$M$14","v":""},{"$f":"$M$14","v":""},{"$f":"$M$14","v":""},{"$f":"$M$14","v":""},{"$f":"$M$14","v":""},null,null,{"$f":"S18","v":"Por critério do(a) analista"}]
[{"$nulls":8},{"$f":"IF(ISBLANK(E15),\"\",E15*(1+(INDEX('índice de atualização'!B:B,MATCH(G15,'índice de atualização'!B:B,0)+COUNTA('índice de atualização'!B:B)-1)-INDEX('índice de atualização'!B:B,MATCH(TEXT(F15,\"MM/AAAA\"),'índice de atualização'!A:A,0)))/INDEX('índice de atualização'!B:B,MATCH(TEXT(F15,\"MM/AAAA\"),'índice de atualização'!A:A,0))))","v":""},"",null,null,{"$f":"IF(ISNUMBER(I15),IF(OR(I15<_xlfn.QUARTILE.INC($I$10:$I$29,1)-1.5*(_xlfn.QUARTILE.INC($I$10:I36,3)-_xlfn.QUARTILE.INC($I$10:$I$29,1)),I15>_xlfn.QUARTILE.INC($I$10:$I$29,3)+1.5*(_xlfn.QUARTILE.INC($I$10:$I$29,3)-_xlfn.QUARTILE.INC($I$10:$I$29,1))),\"Não\",\"Sim\"),\"\")","v":""},{"$f":"$M$15","v":""},{"$f":"$M$15","v":""},{"$f":"$M$15","v":""},{"$f":"$M$15","v":""},{"$f":"$M$15","v":""}]
[{"$nulls":9},"",null,null,{"$f":"IF(ISNUMBER(I16),IF(OR(I16<_xlfn.QUARTILE.INC($I$10:$I$29,1)-1.5*(_xlfn.QUARTILE.INC($I$10:I39,3)-_xlfn.QUARTILE.INC($I$10:$I$29,1)),I16>_xlfn.QUARTILE.INC($I$10:$I$29,3)+1.5*(_xlfn.QUARTILE.INC($I$10:$I$29,3)-_xlfn.QUARTILE.INC($I$10:$I$29,1))),\"Não\",\"Sim\"),\"\")","v":""},{"$f":"$M$16","v":""},{"$f":"$M$16","v":""},{"$f":"$M$16","v":""},{"$f":"$M$16","v":""},{"$f":"$M$16","v":""}]
[null,"COTAÇÕES DE MERCADO",{"$nulls":10},"Cotações"]
[null,"Empresa",{"$nulls":5},"Data","Preço Unitário","Utilizar? (Sim/Não)",null,null,"Outliers","Grupos - Todos","Grupos - Sem o maior","Grupos - Sem o menor","Grupos - Sem o maior e sem o menor","Grupos - Sem os dois maiores","Por critério do(a) analista"]
[null,"Samaria Rações LTDA",{"$nulls":5},"2026-02-09",{"$f":"156.75/25","v":6.27},{"$f":"IF(ISNUMBER(I19),IF($J$33=$M$18,M19,IF($J$33=$N$18,N19,IF($J$33=$O$18,O19,IF($J$33=$P$18,P19,IF($J$33=$Q$18,Q19,IF($J$33=$R$18,R19,IF($J$33=$S$18,S19,\"\"))))))),\"\")","v":"Sim"},null,null,{"$f":"IF(ISNUMBER(I19),IF(OR(I19<_xlfn.QUARTILE.INC($I$10:$I$29,1)-1.5*(_xlfn.QUARTILE.INC($I$10:I40,3)-_xlfn.QUARTILE.INC($I$10:$I$29,1)),I19>_xlfn.QUARTILE.INC($I$10:$I$29,3)+1.5*(_xlfn.QUARTILE.INC($I$10:$I$29,3)-_xlfn.QUARTILE.INC($I$10:$I$29,1))),\"Não\",\"Sim\"),\"\")","v":"Sim"},{"$f":"IF(ISNUMBER(I19),\"Sim\",\"\")","v":"Sim"},{"$f":"IF(ISNUMBER(I19),IF(_xlfn.RANK.EQ(I19,$I$19:$I$29)=1,\"Não\",\"Sim\"),\"\")","v":"Sim"},{"$f":"IF(ISNUMBER(I19),IF(_xlfn.RANK.EQ(I19,$I$19:$I$29)=COUNT($I$19:$I$29),\"Não\",\"Sim\"),\"\")","v":"Não"},{"$f":"IF(O19=\"\",\"\",IF(AND(O19=\"Sim\",P19=\"Sim\"),\"Sim\",\"Não\"))","v":"Não"},{"$f":"IF(ISNUMBER(I19),IF(_xlfn.RANK.EQ(I19,$I$19:$I$29)<=2,\"Não\",\"Sim\"),\"\")","v":"Sim"}]
[null,"Integral Mix Agroindustria",{"$nulls":5},"2026-02-07",{"$f":"170.01/25","v":6.8003999999999998},"Sim",null,null,{"$f":"IF(ISNUMBER(I20),IF(OR(I20<_xlfn.QUARTILE.INC($I$10:$I$29,1)-1.5*(_xlfn.QUARTILE.INC($I$10:I40,3)-_xlfn.QUARTILE.INC($I$10:$I$29,1)),I20>_xlfn.QUARTILE.INC($I$10:$I$29,3)+1.5*(_xlfn.QUARTILE.INC($I$10:$I$29,3)-_xlfn.QUARTILE.INC($I$10:$I$29,1))),\"Não\",\"Sim\"),\"\")","v":"Sim"},"Sim","Sim","Sim",{"$f":"IF(O20=\"\",\"\",IF(AND(O20=\"Sim\",P20=\"Sim\"),\"Sim\",\"Não\"))","v":"Sim"},"Não"]
[null,"Comercial do Carmo ME",{"$nulls":5},"2026-02-12",{"$f":"203/25","v":8.1199999999999992},"Não",null,null,{"$f":"IF(ISNUMBER(I21),IF(OR(I21<_xlfn.QUARTILE.INC($I$10:$I$29,1)-1.5*(_xlfn.QUARTILE.INC($I$10:I40,3)-_xlfn.QUARTILE.INC($I$10:$I$29,1)),I21>_xlfn.QUARTILE.INC($I$10:$I$29,3)+1.5*(_xlfn.QUARTILE.INC($I$10:$I$29,3)-_xlfn.QUARTILE.INC($I$10:$I$29,1))),\"Não\",\"Sim\"),\"\")","v":"Sim"},"Sim","Não","Sim","Não","Não"]
[{"$nulls":9},"",null,null,{"$f":"IF(ISNUMBER(I22),IF(OR(I22<_xlfn.QUARTILE.INC($I$10:$I$29,1)-1.5*(_xlfn.QUARTILE.INC($I$10:I40,3)-_xlfn.QUARTILE.INC($I$10:$I$29,1)),I22>_xlfn.QUARTILE.INC($I$10:$I$29,3)+1.5*(_xlfn.QUARTILE.INC($I$10:$I$29,3)-_xlfn.QUARTILE.INC($I$10:$I$29,1))),\"Não\",\"Sim\"),\"\")","v":""},"","","","",""]
[{"$nulls":9},"",null,null,{"$f":"IF(ISNUMBER(I23),IF(OR(I23<_xlfn.QUARTILE.INC($I$10:$I$29,1)-1.5*(_xlfn.QUARTILE.INC($I$10:I41,3)-_xlfn.QUARTILE.INC($I$10:$I$29,1)),I23>_xlfn.QUARTILE.INC($I$10:$I$29,3)+1.5*(_xlfn.QUARTILE.INC($I$10:$I$29,3)-_xlfn.QUARTILE.INC($I$10:$I$29,1))),\"Não\",\"Sim\"),\"\")","v":""},"","","","",""]
[{"$nulls":9},"",null,null,{"$f":"IF(ISNUMBER(I24),IF(OR(I24<_xlfn.QUARTILE.INC($I$10:$I$29,1)-1.5*(_xlfn.QUARTILE.INC($I$10:I42,3)-_xlfn.QUARTILE.INC($I$10:$I$29,1)),I24>_xlfn.QUARTILE.INC($I$10:$I$29,3)+1.5*(_xlfn.QUARTILE.INC($I$10:$I$29,3)-_xlfn.QUARTILE.INC($I$10:$I$29,1))),\"Não\",\"Sim\"),\"\")","v":""},"","","","",""]
[{"$nulls":9},"",null,null,{"$f":"IF(ISNUMBER(I25),IF(OR(I25<_xlfn.QUARTILE.INC($I$10:$I$29,1)-1.5*(_xlfn.QUARTILE.INC($I$10:I40,3)-_xlfn.QUARTILE.INC($I$10:$I$29,1)),I25>_xlfn.QUARTILE.INC($I$10:$I$29,3)+1.5*(_xlfn.QUARTILE.INC($I$10:$I$29,3)-_xlfn.QUARTILE.INC($I$10:$I$29,1))),\"Não\",\"Sim\"),\"\")","v":""},"","","","",""]
[{"$nulls":9},"",null,null,{"$f":"IF(ISNUMBER(I26),IF(OR(I26<_xlfn.QUARTILE.INC($I$10:$I$29,1)-1.5*(_xlfn.QUARTILE.INC($I$10:I40,3)-_xlfn.QUARTILE.INC($I$10:$I$29,1)),I26>_xlfn.QUARTILE.INC($I$10:$I$29,3)+1.5*(_xlfn.QUARTILE.INC($I$10:$I$29,3)-_xlfn.QUARTILE.INC($I$10:$I$29,1))),\"Não\",\"Sim\"),\"\")","v":""},"","","","",""]
[{"$nulls":9},"",null,null,{"$f":"IF(ISNUMBER(I27),IF(OR(I27<_xlfn.QUARTILE.INC($I$10:$I$29,1)-1.5*(_xlfn.QUARTILE.INC($I$10:I40,3)-_xlfn.QUARTILE.INC($I$10:$I$29,1)),I27>_xlfn.QUARTILE.INC($I$10:$I$29,3)+1.5*(_xlfn.QUARTILE.INC($I$10:$I$29,3)-_xlfn.QUARTILE.INC($I$10:$I$29,1))),\"Não\",\"Sim\"),\"\")","v":""},"","","","",""]
[{"$nulls":9},"",null,null,{"$f":"IF(ISNUMBER(I28),IF(OR(I28<_xlfn.QUARTILE.INC($I$10:$I$29,1)-1.5*(_xlfn.QUARTILE.INC($I$10:I40,3)-_xlfn.QUARTILE.INC($I$10:$I$29,1)),I28>_xlfn.QUARTILE.INC($I$10:$I$29,3)+1.5*(_xlfn.QUARTILE.INC($I$10:$I$29,3)-_xlfn.QUARTILE.INC($I$10:$I$29,1))),\"Não\",\"Sim\"),\"\")","v":""},"","","","",""]
[{"$nulls":9},"",null,null,{"$f":"IF(ISNUMBER(I29),IF(OR(I29<_xlfn.QUARTILE.INC($I$10:$I$29,1)-1.5*(_xlfn.QUARTILE.INC($I$10:I40,3)-_xlfn.QUARTILE.INC($I$10:$I$29,1)),I29>_xlfn.QUARTILE.INC($I$10:$I$29,3)+1.5*(_xlfn.QUARTILE.INC($I$10:$I$29,3)-_xlfn.QUARTILE.INC($I$10:$I$29,1))),\"Não\",\"Sim\"),\"\")","v":""},"","","","",""]
[null,"Observações:",{"$nulls":6},"CV:",{"$f":"IF($J$33=\"\",\"Selecione metodologia para exclusão de preços\",IF(COUNTIF($J$10:$J$29,\"Sim\")<3,\"N/D (são necessários pelo menos 3 preços)\",_xlfn.STDEV.S(IF($J$10:$J$29=\"Sim\",$I$10:$I$29))/AVERAGE(IF($J$10:$J$29=\"Sim\",$I$10:$I$29))))","v":9.2206746593265873E-2},null,"Média (Cotações)",{"$f":"IF(COUNTIF(M19:M29,\"Sim\")<3,\"N/D (são necessários pelo menos 3 preços)\",AVERAGE(IF(M19:M29=\"Sim\",$I19:$I29)))","v":7.0634666666666659},{"$f":"IF(COUNTIF(N19:N29,\"Sim\")<3,\"N/D (são necessários pelo menos 3 preços)\",AVERAGE(IF(N19:N29=\"Sim\",$I19:$I29)))","v":7.0634666666666659},{"$f":"IF(COUNTIF(O19:O29,\"Sim\")<3,\"N/D (são necessários pelo menos 3 preços)\",AVERAGE(IF(O19:O29=\"Sim\",$I19:$I29)))","v":"N/D (são necessários pelo menos 3 preços)"},{"$f":"IF(COUNTIF(P19:P29,\"Sim\")<3,\"N/D (são necessários pelo menos 3 preços)\",AVERAGE(IF(P19:P29=\"Sim\",$I19:$I29)))","v":"N/D (são necessários pelo menos 3 preços)"},{"$f":"IF(COUNTIF(Q19:Q29,\"Sim\")<3,\"N/D (são necessários pelo menos 3 preços)\",AVERAGE(IF(Q19:Q29=\"Sim\",$I19:$I29)))","v":"N/D (são necessários pelo menos 3 preços)"},{"$f":"IF(COUNTIF(R19:R29,\"Sim\")<3,\"N/D (são necessários pelo menos 3 preços)\",AVERAGE(IF(R19:R29=\"Sim\",$I19:$I29)))","v":"N/D (são necessários pelo menos 3 preços)"},{"$f":"IF(COUNTIF(S19:S29,\"Sim\")<3,\"N/D (são necessários pelo menos 3 preços)\",AVERAGE(IF(S19:S29=\"Sim\",$I19:$I29)))","v":"N/D (são necessários pelo menos 3 preços)"}]
[{"$nulls":8},"Média:",{"$f":"IF($J$33=\"\",\"Selecione metodologia para exclusão de preços\",AVERAGE(IF($J$10:$J$29=\"Sim\",$I$10:$I$29)))","v":6.6900464798500483},null,"Mediana (Cotações)",{"$f":"IF(COUNTIF(M19:M29,\"Sim\")<3,\"N/D (são necessários pelo menos 3 preços)\",MEDIAN(IF(M19:M29=\"Sim\",$I19:$I29)))","v":6.8003999999999998},{"$f":"IF(COUNTIF(N19:N29,\"Sim\")<3,\"N/D (são necessários pelo menos 3 preços)\",MEDIAN(IF(N19:N29=\"Sim\",$I19:$I29)))","v":6.8003999999999998},{"$f":"IF(COUNTIF(O19:O29,\"Sim\")<3,\"N/D (são necessários pelo menos 3 preços)\",MEDIAN(IF(O19:O29=\"Sim\",$I19:$I29)))","v":"N/D (são necessários pelo menos 3 preços)"},{"$f":"IF(COUNTIF(P19:P29,\"Sim\")<3,\"N/D (são necessários pelo menos 3 preços)\",MEDIAN(IF(P19:P29=\"Sim\",$I19:$I29)))","v":"N/D (são necessários pelo menos 3 preços)"},{"$f":"IF(COUNTIF(Q19:Q29,\"Sim\")<3,\"N/D (são necessários pelo menos 3 preços)\",MEDIAN(IF(Q19:Q29=\"Sim\",$I19:$I29)))","v":"N/D (são necessários pelo menos 3 preços)"},{"$f":"IF(COUNTIF(R19:R29,\"Sim\")<3,\"N/D (são necessários pelo menos 3 preços)\",MEDIAN(IF(R19:R29=\"Sim\",$I19:$I29)))","v":"N/D (são necessários pelo menos 3 preços)"},{"$f":"IF(COUNTIF(S19:S29,\"Sim\")<3,\"N/D (são necessários pelo menos 3 preços)\",MEDIAN(IF(S19:S29=\"Sim\",$I19:$I29)))","v":"N/D (são necessários pelo menos 3 preços)"}]
[{"$nulls":8},"Mediana:",{"$f":"IF($J$33=\"\",\"Selecione metodologia para exclusão de preços\",MEDIAN(IF($J$10:$J$29=\"Sim\",$I$10:$I$29)))","v":6.3737118031751416},null,"CV (Cotações)",{"$f":"IF(COUNTIF(M19:M29,\"Sim\")<3,\"N/D (são necessários pelo menos 3 preços)\",_xlfn.STDEV.S(IF(M19:M29=\"Sim\",$I19:$I29))/AVERAGE(IF(M19:M29=\"Sim\",$I19:$I29)))","v":0.13486899750318726},{"$f":"IF(COUNTIF(N19:N29,\"Sim\")<3,\"N/D (são necessários pelo menos 3 preços)\",_xlfn.STDEV.S(IF(N19:N29=\"Sim\",$I19:$I29))/AVERAGE(IF(N19:N29=\"Sim\",$I19:$I29)))","v":0.13486899750318726},{"$f":"IF(COUNTIF(O19:O29,\"Sim\")<3,\"N/D (são necessários pelo menos 3 preços)\",_xlfn.STDEV.S(IF(O19:O29=\"Sim\",$I19:$I29))/AVERAGE(IF(O19:O29=\"Sim\",$I19:$I29)))","v":"N/D (são necessários pelo menos 3 preços)"},{"$f":"IF(COUNTIF(P19:P29,\"Sim\")<3,\"N/D (são necessários pelo menos 3 preços)\",_xlfn.STDEV.S(IF(P19:P29=\"Sim\",$I19:$I29))/AVERAGE(IF(P19:P29=\"Sim\",$I19:$I29)))","v":"N/D (são necessários pelo menos 3 preços)"},{"$f":"IF(COUNTIF(Q19:Q29,\"Sim\")<3,\"N/D (são necessários pelo menos 3 preços)\",_xlfn.STDEV.S(IF(Q19:Q29=\"Sim\",$I19:$I29))/AVERAGE(IF(Q19:Q29=\"Sim\",$I19:$I29)))","v":"N/D (são necessários pelo menos 3 preços)"},{"$f":"IF(COUNTIF(R19:R29,\"Sim\")<3,\"N/D (são necessários pelo menos 3 preços)\",_xlfn.STDEV.S(IF(R19:R29=\"Sim\",$I19:$I29))/AVERAGE(IF(R19:R29=\"Sim\",$I19:$I29)))","v":"N/D (são necessários pelo menos 3 preços)"},{"$f":"IF(COUNTIF(S19:S29,\"Sim\")<3,\"N/D (são necessários pelo menos 3 preços)\",_xlfn.STDEV.S(IF(S19:S29=\"Sim\",$I19:$I29))/AVERAGE(IF(S19:S29=\"Sim\",$I19:$I29)))","v":"N/D (são necessários pelo menos 3 preços)"}]
[null,"Metodologia de exclusão de preços adotada:",{"$nulls":7},{"$f":"IF(M38=\"\",INDEX(M18:S18,MATCH(MIN(M35:S35),M35:S35,0)),M38)","v":"Grupos - Sem o maior"},null,"Média",{"$f":"IF(SUM(COUNTIF($M$10:$M$16,\"Sim\")) + SUM(COUNTIF(M19:M29,\"Sim\")) < 3,\n   \"N/D (são necessários pelo menos 3 preços)\",\n   IFERROR(AVERAGE(_xlfn._xlws.FILTER($I$10:$I$16,$M$10:$M$16=\"Sim\"), _xlfn._xlws.FILTER($I$19:$I$29,M19:M29=\"Sim\")),M30))","v":6.9283720665417059},{"$f":"IF(SUM(COUNTIF($M$10:$M$16,\"Sim\")) + SUM(COUNTIF(N19:N29,\"Sim\")) < 3,\n   \"N/D (são necessários pelo menos 3 preços)\",\n   IFERROR(AVERAGE(_xlfn._xlws.FILTER($I$10:$I$16,$M$10:$M$16=\"Sim\"), _xlfn._xlws.FILTER($I$19:$I$29,N19:N29=\"Sim\")),N30))","v":6.9283720665417059},{"$f":"IF(SUM(COUNTIF($M$10:$M$16,\"Sim\")) + SUM(COUNTIF(O19:O29,\"Sim\")) < 3,\n   \"N/D (são necessários pelo menos 3 preços)\",\n   IFERROR(AVERAGE(_xlfn._xlws.FILTER($I$10:$I$16,$M$10:$M$16=\"Sim\"), _xlfn._xlws.FILTER($I$19:$I$29,O19:O29=\"Sim\")),O30))","v":6.6900464798500483},{"$f":"IF(SUM(COUNTIF($M$10:$M$16,\"Sim\")) + SUM(COUNTIF(P19:P29,\"Sim\")) < 3,\n   \"N/D (são necessários pelo menos 3 preços)\",\n   IFERROR(AVERAGE(_xlfn._xlws.FILTER($I$10:$I$16,$M$10:$M$16=\"Sim\"), _xlfn._xlws.FILTER($I$19:$I$29,P19:P29=\"Sim\")),P30))","v":7.0600464798500466},{"$f":"IF(SUM(COUNTIF($M$10:$M$16,\"Sim\")) + SUM(COUNTIF(Q19:Q29,\"Sim\")) < 3,\n   \"N/D (são necessários pelo menos 3 preços)\",\n   IFERROR(AVERAGE(_xlfn._xlws.FILTER($I$10:$I$16,$M$10:$M$16=\"Sim\"), _xlfn._xlws.FILTER($I$19:$I$29,Q19:Q29=\"Sim\")),Q30))","v":6.7950580998125591},{"$f":"IF(SUM(COUNTIF($M$10:$M$16,\"Sim\")) + SUM(COUNTIF(R19:R29,\"Sim\")) < 3,\n   \"N/D (são necessários pelo menos 3 preços)\",\n   IFERROR(AVERAGE(_xlfn._xlws.FILTER($I$10:$I$16,$M$10:$M$16=\"Sim\"), _xlfn._xlws.FILTER($I$19:$I$29,R19:R29=\"Sim\")),R30))","v":6.6624580998125591},{"$f":"IF(SUM(COUNTIF($S$10:$S$16,\"Sim\")) + SUM(COUNTIF(S19:S29,\"Sim\")) < 3,\n   \"N/D (são necessários pelo menos 3 preços)\",\n   IFERROR(AVERAGE(_xlfn._xlws.FILTER($I$10:$I$16,$S$10:$S$16=\"Sim\"), _xlfn._xlws.FILTER($I$19:$I$29,S19:S29=\"Sim\")),S30))","v":"N/D (são necessários pelo menos 3 preços)"}]
[{"$nulls":11},"Mediana",{"$f":"IF(SUM(COUNTIF($M$10:$M$16,\"Sim\")) + SUM(COUNTIF(M19:M29,\"Sim\")) < 3,\n   \"N/D (são necessários pelo menos 3 preços)\",\n   IFERROR(MEDIAN(_xlfn._xlws.FILTER($I$10:$I$16,$M$10:$M$16=\"Sim\"), _xlfn._xlws.FILTER($I$19:$I$29,M19:M29=\"Sim\")),M30))","v":6.5870559015875703},{"$f":"IF(SUM(COUNTIF($M$10:$M$16,\"Sim\")) + SUM(COUNTIF(N19:N29,\"Sim\")) < 3,\n   \"N/D (são necessários pelo menos 3 preços)\",\n   IFERROR(MEDIAN(_xlfn._xlws.FILTER($I$10:$I$16,$M$10:$M$16=\"Sim\"), _xlfn._xlws.FILTER($I$19:$I$29,N19:N29=\"Sim\")),N30))","v":6.5870559015875703},{"$f":"IF(SUM(COUNTIF($M$10:$M$16,\"Sim\")) + SUM(COUNTIF(O19:O29,\"Sim\")) < 3,\n   \"N/D (são necessários pelo menos 3 preços)\",\n   IFERROR(MEDIAN(_xlfn._xlws.FILTER($I$10:$I$16,$M$10:$M$16=\"Sim\"), _xlfn._xlws.FILTER($I$19:$I$29,O19:O29=\"Sim\")),O30))","v":6.3737118031751416},{"$f":"IF(SUM(COUNTIF($M$10:$M$16,\"Sim\")) + SUM(COUNTIF(P19:P29,\"Sim\")) < 3,\n   \"N/D (são necessários pelo menos 3 preços)\",\n   IFERROR(MEDIAN(_xlfn._xlws.FILTER($I$10:$I$16,$M$10:$M$16=\"Sim\"), _xlfn._xlws.FILTER($I$19:$I$29,P19:P29=\"Sim\")),P30))","v":6.8003999999999998},{"$f":"IF(SUM(COUNTIF($M$10:$M$16,\"Sim\")) + SUM(COUNTIF(Q19:Q29,\"Sim\")) < 3,\n   \"N/D (são necessários pelo menos 3 preços)\",\n   IFERROR(MEDIAN(_xlfn._xlws.FILTER($I$10:$I$16,$M$10:$M$16=\"Sim\"), _xlfn._xlws.FILTER($I$19:$I$29,Q19:Q29=\"Sim\")),Q30))","v":6.5870559015875703},{"$f":"IF(SUM(COUNTIF($M$10:$M$16,\"Sim\")) + SUM(COUNTIF(R19:R29,\"Sim\")) < 3,\n   \"N/D (são necessários pelo menos 3 preços)\",\n   IFERROR(MEDIAN(_xlfn._xlws.FILTER($I$10:$I$16,$M$10:$M$16=\"Sim\"), _xlfn._xlws.FILTER($I$19:$I$29,R19:R29=\"Sim\")),R30))","v":6.328271175764379},{"$f":"IF(SUM(COUNTIF($S$10:$S$16,\"Sim\")) + SUM(COUNTIF(S19:S29,\"Sim\")) < 3,\n   \"N/D (são necessários pelo menos 3 preços)\",\n   IFERROR(MEDIAN(_xlfn._xlws.FILTER($I$10:$I$16,$S$10:$S$16=\"Sim\"), _xlfn._xlws.FILTER($I$19:$I$29,S19:S29=\"Sim\")),S30))","v":"N/D (são necessários pelo menos 3 preços)"}]
[{"$nulls":11},"CV",{"$f":"IF(SUM(COUNTIF($M$10:$M$16,\"Sim\")) + SUM(COUNTIF(M19:M29,\"Sim\")) < 3,\n   \"N/D (são necessários pelo menos 3 preços)\",\n   IFERROR(ROUND(_xlfn.STDEV.S(_xlfn._xlws.FILTER($I$10:$I$16,$M$10:$M$16=\"Sim\"), _xlfn._xlws.FILTER($I$19:$I$29,M19:M29=\"Sim\")) /\n   AVERAGE(_xlfn._xlws.FILTER($I$10:$I$16,$M$10:$M$16=\"Sim\"), _xlfn._xlws.FILTER($I$19:$I$29,M19:M29=\"Sim\")),4),M32)\n)","v":0.1159},{"$f":"IF(SUM(COUNTIF($M$10:$M$16,\"Sim\")) + SUM(COUNTIF(N19:N29,\"Sim\")) < 3,\n   \"N/D (são necessários pelo menos 3 preços)\",\n   IFERROR(ROUND(_xlfn.STDEV.S(_xlfn._xlws.FILTER($I$10:$I$16,$M$10:$M$16=\"Sim\"), _xlfn._xlws.FILTER($I$19:$I$29,N19:N29=\"Sim\")) /\n   AVERAGE(_xlfn._xlws.FILTER($I$10:$I$16,$M$10:$M$16=\"Sim\"), _xlfn._xlws.FILTER($I$19:$I$29,N19:N29=\"Sim\")),4),N32)\n)","v":0.1159},{"$f":"IF(SUM(COUNTIF($M$10:$M$16,\"Sim\")) + SUM(COUNTIF(O19:O29,\"Sim\")) < 3,\n   \"N/D (são necessários pelo menos 3 preços)\",\n   IFERROR(ROUND(_xlfn.STDEV.S(_xlfn._xlws.FILTER($I$10:$I$16,$M$10:$M$16=\"Sim\"), _xlfn._xlws.FILTER($I$19:$I$29,O19:O29=\"Sim\")) /\n   AVERAGE(_xlfn._xlws.FILTER($I$10:$I$16,$M$10:$M$16=\"Sim\"), _xlfn._xlws.FILTER($I$19:$I$29,O19:O29=\"Sim\")),4),O32)\n)","v":9.2200000000000004E-2},{"$f":"IF(SUM(COUNTIF($M$10:$M$16,\"Sim\")) + SUM(COUNTIF(P19:P29,\"Sim\")) < 3,\n   \"N/D (são necessários pelo menos 3 preços)\",\n   IFERROR(ROUND(_xlfn.STDEV.S(_xlfn._xlws.FILTER($I$10:$I$16,$M$10:$M$16=\"Sim\"), _xlfn._xlws.FILTER($I$19:$I$29,P19:P29=\"Sim\")) /\n   AVERAGE(_xlfn._xlws.FILTER($I$10:$I$16,$M$10:$M$16=\"Sim\"), _xlfn._xlws.FILTER($I$19:$I$29,P19:P29=\"Sim\")),4),P32)\n)","v":0.11650000000000001},{"$f":"IF(SUM(COUNTIF($M$10:$M$16,\"Sim\")) + SUM(COUNTIF(Q19:Q29,\"Sim\")) < 3,\n   \"N/D (são necessários pelo menos 3 preços)\",\n   IFERROR(ROUND(_xlfn.STDEV.S(_xlfn._xlws.FILTER($I$10:$I$16,$M$10:$M$16=\"Sim\"), _xlfn._xlws.FILTER($I$19:$I$29,Q19:Q29=\"Sim\")) /\n   AVERAGE(_xlfn._xlws.FILTER($I$10:$I$16,$M$10:$M$16=\"Sim\"), _xlfn._xlws.FILTER($I$19:$I$29,Q19:Q29=\"Sim\")),4),Q32)\n)","v":9.69E-2},{"$f":"IF(SUM(COUNTIF($M$10:$M$16,\"Sim\")) + SUM(COUNTIF(R19:R29,\"Sim\")) < 3,\n   \"N/D (são necessários pelo menos 3 preços)\",\n   IFERROR(ROUND(_xlfn.STDEV.S(_xlfn._xlws.FILTER($I$10:$I$16,$M$10:$M$16=\"Sim\"), _xlfn._xlws.FILTER($I$19:$I$29,R19:R29=\"Sim\")) /\n   AVERAGE(_xlfn._xlws.FILTER($I$10:$I$16,$M$10:$M$16=\"Sim\"), _xlfn._xlws.FILTER($I$19:$I$29,R19:R29=\"Sim\")),4),R32)\n)","v":0.10639999999999999},{"$f":"IF(SUM(COUNTIF($S$10:$S$16,\"Sim\")) + SUM(COUNTIF(S19:S29,\"Sim\")) < 3,\n   \"N/D (são necessários pelo menos 3 preços)\",\n   IFERROR(_xlfn.STDEV.S(_xlfn._xlws.FILTER($I$10:$I$16,$S$10:$S$16=\"Sim\"), _xlfn._xlws.FILTER($I$19:$I$29,S19:S29=\"Sim\")) /\n   AVERAGE(_xlfn._xlws.FILTER($I$10:$I$16,$S$10:$S$16=\"Sim\"), _xlfn._xlws.FILTER($I$19:$I$29,S19:S29=\"Sim\")),S32)\n)","v":"N/D (são necessários pelo menos 3 preços)"}]
[null,"PREÇO UNITÁRIO ESTIMADO ADOTADO:",{"$nulls":7},{"$f":"IF($J$33=\"\",\"Selecione metodologia para exclusão de preços\",MIN(J31:J32))","v":6.3737118031751416},null,"Metodologia sugerida:",{"$f":"IF($M$35=MIN($M$35,$N$35:$R$35),M8,\"Grupos - \"&INDEX({\"Todos\";\"Sem o maior\";\"Sem o menor\";\"Sem o maior e Sem o menor\";\"Sem os dois maiores\"},MATCH(MIN($N$35:$R$35),$N$35:$R$35,0)))","v":"Grupos - Sem o maior"}]
[{"$nulls":11},"Preço estimado sugerido:",{"$f":"IF($M$36=M8,SMALL($M$33:$M$34,1),MIN(INDEX($N$34:$R$34, MATCH(MIN($N$35:$R$35), $N$35:$R$35, 0)),INDEX($N$33:$R$33, MATCH(MIN($N$35:$R$35), $N$35:$R$35, 0))))","v":6.3737118031751416}]
[{"$nulls":11},"Metodologia a adotar:",{"$f":"IF(INDEX(L18:S18,N38)=0,\"\",INDEX(L18:S18,N38))","v":""},1]

{"sheet":"Peixe 35% 2 a 3 mm","index":3,"n_rows":38,"n_cols":21,"rows_kept":38,"cut":false,"hidden":false,"merged":[[15,12,15,17],[6,2,6,5],[6,12,6,18],[7,1,7,9],[7,12,7,18],[8,12,8,17],[9,12,9,17],[10,12,10,17],[11,12,11,17],[12,12,12,17],[13,12,13,17],[14,12,14,17],[26,1,26,6],[16,1,16,9],[16,12,16,18],[17,1,17,6],[18,1,18,6],[19,1,19,6],[20,1,20,6],[21,1,21,6],[22,1,22,6],[23,1,23,6],[24,1,24,6],[25,1,25,6],[35,12,35,18],[36,12,36,18],[27,1,27,6],[28,1,28,6],[29,1,31,7],[32,1,34,8],[32,9,34,9],[35,1,37,8],[35,9,37,9]]}
[]
[null,"Processo",{"$f":"'Peixe 50% PB Farelo'!C2","v":"59511.000102/2026-55"}]
[null,"Responsável",{"$f":"'Peixe 50% PB Farelo'!C3","v":"JHONES DE LIMA VIEIRA"}]
[null,"Área de Origem",{"$f":"'Peixe 50% PB Farelo'!C4","v":"14ª GTR"}]
[null,"Data da pesquisa",{"$f":"'Peixe 50% PB Farelo'!C5","v":"Janeiro/2026 - Fevereiro/2026"}]
[]
[null,"ITEM:","Ração extrusada para peixe onívoro 35% PB – Proteína Bruta Mín.: 35%, granulometria 2 a 3 mm. Data de validade não inferior a 6 meses.",null,null,null,"UNIDADE DE MEDIDA:",{"$f":"'Peixe 50% PB Farelo'!H7","v":"kg"},"QUANTIDADE:",37500,null,null,"Tabela auxiliar de metodologias para exclusão de preços",{"$nulls":7},"Automática (menor CV)"]
[null,"LICITAÇÕES ANTERIORES",{"$nulls":10},"Licitações Anteriores - Outliers",{"$nulls":7},{"$f":"M18","v":"Outliers"}]
[null,"Órgão","Edital/Ano - Nº do Lote / Item","Quantidade","Valor Unitário","Data","índice de atualização (nome)","Variação acumulada do índice (%)","Preço unitário atualizado","Utilizar?  (Sim/Não)",null,null,"Utilizar?",{"$nulls":5},"Por critério do(a) analista",null,{"$f":"N18","v":"Grupos - Todos"}]
[null,"14ª SR - Fortaleza/CE","Edital 90007/2024 - Item 4",4337,4.3,"2025-01-02","IPA-EP-DI Suprimentos agropecuários",{"$f":"(I10/E10)-1","v":1.6540957444201254E-2},{"$f":"IF(ISBLANK(E10),\"\",E10*(1+(INDEX('índice de atualização'!B:B,MATCH(G10,'índice de atualização'!B:B,0)+COUNTA('índice de atualização'!B:B)-1)-INDEX('índice de atualização'!B:B,MATCH(TEXT(F10,\"MM/AAAA\"),'índice de atualização'!A:A,0)))/INDEX('índice de atualização'!B:B,MATCH(TEXT(F10,\"MM/AAAA\"),'índice de atualização'!A:A,0))))","v":4.371126117010065},{"$f":"IF(ISNUMBER(I10),IF($J$33<>$S$9,M10,S10),\"\")","v":"Sim"},null,null,{"$f":"IF(ISNUMBER(I10),IF(OR(I10<_xlfn.QUARTILE.INC($I$10:$I$29,1)-1.5*(_xlfn.QUARTILE.INC($I$10:I29,3)-_xlfn.QUARTILE.INC($I$10:$I$29,1)),I10>_xlfn.QUARTILE.INC($I$10:$I$29,3)+1.5*(_xlfn.QUARTILE.INC($I$10:$I$29,3)-_xlfn.QUARTILE.INC($I$10:$I$29,1))),\"Não\",\"Sim\"),\"\")","v":"Sim"},{"$nulls":7},{"$f":"O18","v":"Grupos - Sem o maior"}]
[null,"14ª SR - Fortaleza/CE","Edital 90007/2024 - Item 12",750,4.28,"2025-02-18","IPA-EP-DI Suprimentos agropecuários",{"$f":"(I11/E11)-1","v":4.5072426012993105E-4},{"$f":"IF(ISBLANK(E11),\"\",E11*(1+(INDEX('índice de atualização'!B:B,MATCH(G11,'índice de atualização'!B:B,0)+COUNTA('índice de atualização'!B:B)-1)-INDEX('índice de atualização'!B:B,MATCH(TEXT(F11,\"MM/AAAA\"),'índice de atualização'!A:A,0)))/INDEX('índice de atualização'!B:B,MATCH(TEXT(F11,\"MM/AAAA\"),'índice de atualização'!A:A,0))))","v":4.2819290998333566},{"$f":"IF(ISNUMBER(I11),IF($J$33<>$S$8,M11,S11),\"\")","v":"Sim"},null,null,{"$f":"IF(ISNUMBER(I11),IF(OR(I11<_xlfn.QUARTILE.INC($I$10:$I$29,1)-1.5*(_xlfn.QUARTILE.INC($I$10:I30,3)-_xlfn.QUARTILE.INC($I$10:$I$29,1)),I11>_xlfn.QUARTILE.INC($I$10:$I$29,3)+1.5*(_xlfn.QUARTILE.INC($I$10:$I$29,3)-_xlfn.QUARTILE.INC($I$10:$I$29,1))),\"Não\",\"Sim\"),\"\")","v":"Sim"},{"$nulls":7},{"$f":"P18","v":"Grupos - Sem o menor"}]
[null,"4ª SR - Aracaju/SE","Edital 90002/2025 - Item 3",6000,4.08,"2025-07-11","IPA-EP-DI Suprimentos agropecuários",{"$f":"(I12/E12)-1","v":-2.2368348389686266E-2},{"$f":"IF(ISBLANK(E12),\"\",E12*(1+(INDEX('índice de atualização'!B:B,MATCH(G12,'índice de atualização'!B:B,0)+COUNTA('índice de atualização'!B:B)-1)-INDEX('índice de atualização'!B:B,MATCH(TEXT(F12,\"MM/AAAA\"),'índice de atualização'!A:A,0)))/INDEX('índice de atualização'!B:B,MATCH(TEXT(F12,\"MM/AAAA\"),'índice de atualização'!A:A,0))))","v":3.9887371385700803},"Sim",null,null,{"$f":"IF(ISNUMBER(I12),IF(OR(I12<_xlfn.QUARTILE.INC($I$10:$I$29,1)-1.5*(_xlfn.QUARTILE.INC($I$10:I31,3)-_xlfn.QUARTILE.INC($I$10:$I$29,1)),I12>_xlfn.QUARTILE.INC($I$10:$I$29,3)+1.5*(_xlfn.QUARTILE.INC($I$10:$I$29,3)-_xlfn.QUARTILE.INC($I$10:$I$29,1))),\"Não\",\"Sim\"),\"\")","v":"Sim"},{"$f":"$M$12","v":"Sim"},{"$f":"$M$12","v":"Sim"},{"$f":"$M$12","v":"Sim"},{"$f":"$M$12","v":"Sim"},{"$f":"$M$12","v":"Sim"},null,null,{"$f":"Q18","v":"Grupos - Sem o maior e sem o menor"}]
[null,"11ª SR - Amapá/AP","Edital 90126/2024 - Item 1 e 5",15000,4.8,"2025-05-13","IPA-EP-DI Suprimentos agropecuários",{"$f":"(I13/E13)-1","v":-3.9878408355853767E-2},{"$f":"IF(ISBLANK(E13),\"\",E13*(1+(INDEX('índice de atualização'!B:B,MATCH(G13,'índice de atualização'!B:B,0)+COUNTA('índice de atualização'!B:B)-1)-INDEX('índice de atualização'!B:B,MATCH(TEXT(F13,\"MM/AAAA\"),'índice de atualização'!A:A,0)))/INDEX('índice de atualização'!B:B,MATCH(TEXT(F13,\"MM/AAAA\"),'índice de atualização'!A:A,0))))","v":4.6085836398919016},"Sim",null,null,{"$f":"IF(ISNUMBER(I13),IF(OR(I13<_xlfn.QUARTILE.INC($I$10:$I$29,1)-1.5*(_xlfn.QUARTILE.INC($I$10:I32,3)-_xlfn.QUARTILE.INC($I$10:$I$29,1)),I13>_xlfn.QUARTILE.INC($I$10:$I$29,3)+1.5*(_xlfn.QUARTILE.INC($I$10:$I$29,3)-_xlfn.QUARTILE.INC($I$10:$I$29,1))),\"Não\",\"Sim\"),\"\")","v":"Sim"},{"$f":"$M$13","v":"Sim"},{"$f":"$M$13","v":"Sim"},{"$f":"$M$13","v":"Sim"},{"$f":"$M$13","v":"Sim"},{"$f":"$M$13","v":"Sim"},null,null,{"$f":"R18","v":"Grupos - Sem os dois maiores"}]
[null,"Codevasf Sede","Edital 90057/2025 - Item 1",{"$f":"1176*25","v":29400},{"$f":"124/25","v":4.96},"2025-12-08","IPA-EP-DI Suprimentos agropecuários",{"$f":"(I14/E14)-1","v":0},{"$f":"IF(ISBLANK(E14),\"\",E14*(1+(INDEX('índice de atualização'!B:B,MATCH(G14,'índice de atualização'!B:B,0)+COUNTA('índice de atualização'!B:B)-1)-INDEX('índice de atualização'!B:B,MATCH(TEXT(F14,\"MM/AAAA\"),'índice de atualização'!A:A,0)))/INDEX('índice de atualização'!B:B,MATCH(TEXT(F14,\"MM/AAAA\"),'índice de atualização'!A:A,0))))","v":4.96},"Sim",null,null,{"$f":"IF(ISNUMBER(I14),IF(OR(I14<_xlfn.QUARTILE.INC($I$10:$I$29,1)-1.5*(_xlfn.QUARTILE.INC($I$10:I33,3)-_xlfn.QUARTILE.INC($I$10:$I$29,1)),I14>_xlfn.QUARTILE.INC($I$10:$I$29,3)+1.5*(_xlfn.QUARTILE.INC($I$10:$I$29,3)-_xlfn.QUARTILE.INC($I$10:$I$29,1))),\"Não\",\"Sim\"),\"\")","v":"Sim"},{"$f":"$M$14","v":"Sim"},{"$f":"$M$14","v":"Sim"},{"$f":"$M$14","v":"Sim"},{"$f":"$M$14","v":"Sim"},{"$f":"$M$14","v":"Sim"},null,null,{"$f":"S18","v":"Por critério do(a) analista"}]
[{"$nulls":8},{"$f":"IF(ISBLANK(E15),\"\",E15*(1+(INDEX('índice de atualização'!B:B,MATCH(G15,'índice de atualização'!B:B,0)+COUNTA('índice de atualização'!B:B)-1)-INDEX('índice de atualização'!B:B,MATCH(TEXT(F15,\"MM/AAAA\"),'índice de atualização'!A:A,0)))/INDEX('índice de atualização'!B:B,MATCH(TEXT(F15,\"MM/AAAA\"),'índice de atualização'!A:A,0))))","v":""},"",null,null,{"$f":"IF(ISNUMBER(I15),IF(OR(I15<_xlfn.QUARTILE.INC($I$10:$I$29,1)-1.5*(_xlfn.QUARTILE.INC($I$10:I36,3)-_xlfn.QUARTILE.INC($I$10:$I$29,1)),I15>_xlfn.QUARTILE.INC($I$10:$I$29,3)+1.5*(_xlfn.QUARTILE.INC($I$10:$I$29,3)-_xlfn.QUARTILE.INC($I$10:$I$29,1))),\"Não\",\"Sim\"),\"\")","v":""},{"$f":"$M$15","v":""},{"$f":"$M$15","v":""},{"$f":"$M$15","v":""},{"$f":"$M$15","v":""},{"$f":"$M$15","v":""}]
[{"$nulls":9},"",null,null,{"$f":"IF(ISNUMBER(I16),IF(OR(I16<_xlfn.QUARTILE.INC($I$10:$I$29,1)-1.5*(_xlfn.QUARTILE.INC($I$10:I39,3)-_xlfn.QUARTILE.INC($I$10:$I$29,1)),I16>_xlfn.QUARTILE.INC($I$10:$I$29,3)+1.5*(_xlfn.QUARTILE.INC($I$10:$I$29,3)-_xlfn.QUARTILE.INC($I$10:$I$29,1))),\"Não\",\"Sim\"),\"\")","v":""},{"$f":"$M$16","v":""},{"$f":"$M$16","v":""},{"$f":"$M$16","v":""},{"$f":"$M$16","v":""},{"$f":"$M$16","v":""}]
[null,"COTAÇÕES DE MERCADO",{"$nulls":10},"Cotações"]
[null,"Empresa",{"$nulls":5},"Data","Preço Unitário","Utilizar? (Sim/Não)",null,null,"Outliers","Grupos - Todos","Grupos - Sem o maior","Grupos - Sem o menor","Grupos - Sem o maior e sem o menor","Grupos - Sem os dois maiores","Por critério do(a) analista"]
[null,"Agrosolo - Guabi",{"$nulls":5},"2026-02-10",{"$f":"120.54/25","v":4.8216000000000001},{"$f":"IF(ISNUMBER(I19),IF($J$33=$M$18,M19,IF($J$33=$N$18,N19,IF($J$33=$O$18,O19,IF($J$33=$P$18,P19,IF($J$33=$Q$18,Q19,IF($J$33=$R$18,R19,IF($J$33=$S$18,S19,\"\"))))))),\"\")","v":"Não"},null,null,{"$f":"IF(ISNUMBER(I19),IF(OR(I19<_xlfn.QUARTILE.INC($I$10:$I$29,1)-1.5*(_xlfn.QUARTILE.INC($I$10:I40,3)-_xlfn.QUARTILE.INC($I$10:$I$29,1)),I19>_xlfn.QUARTILE.INC($I$10:$I$29,3)+1.5*(_xlfn.QUARTILE.INC($I$10:$I$29,3)-_xlfn.QUARTILE.INC($I$10:$I$29,1))),\"Não\",\"Sim\"),\"\")","v":"Sim"},{"$f":"IF(ISNUMBER(I19),\"Sim\",\"\")","v":"Sim"},{"$f":"IF(ISNUMBER(I19),IF(_xlfn.RANK.EQ(I19,$I$19:$I$29)=1,\"Não\",\"Sim\"),\"\")","v":"Sim"},{"$f":"IF(ISNUMBER(I19),IF(_xlfn.RANK.EQ(I19,$I$19:$I$29)=COUNT($I$19:$I$29),\"Não\",\"Sim\"),\"\")","v":"Sim"},{"$f":"IF(O19=\"\",\"\",IF(AND(O19=\"Sim\",P19=\"Sim\"),\"Sim\",\"Não\"))","v":"Sim"},{"$f":"IF(ISNUMBER(I19),IF(_xlfn.RANK.EQ(I19,$I$19:$I$29)<=2,\"Não\",\"Sim\"),\"\")","v":"Não"}]
[null,"Samaria Rações LTDA",{"$nulls":5},"2026-02-09",{"$f":"107.5/25","v":4.3},"Sim",null,null,{"$f":"IF(ISNUMBER(I20),IF(OR(I20<_xlfn.QUARTILE.INC($I$10:$I$29,1)-1.5*(_xlfn.QUARTILE.INC($I$10:I40,3)-_xlfn.QUARTILE.INC($I$10:$I$29,1)),I20>_xlfn.QUARTILE.INC($I$10:$I$29,3)+1.5*(_xlfn.QUARTILE.INC($I$10:$I$29,3)-_xlfn.QUARTILE.INC($I$10:$I$29,1))),\"Não\",\"Sim\"),\"\")","v":"Sim"},"Sim","Sim","Sim",{"$f":"IF(O20=\"\",\"\",IF(AND(O20=\"Sim\",P20=\"Sim\"),\"Sim\",\"Não\"))","v":"Sim"},"Sim"]
[null,"Integral Mix Agroindustria",{"$nulls":5},"2026-02-07",{"$f":"105.87/25","v":4.2347999999999999},"Sim",null,null,{"$f":"IF(ISNUMBER(I21),IF(OR(I21<_xlfn.QUARTILE.INC($I$10:$I$29,1)-1.5*(_xlfn.QUARTILE.INC($I$10:I40,3)-_xlfn.QUARTILE.INC($I$10:$I$29,1)),I21>_xlfn.QUARTILE.INC($I$10:$I$29,3)+1.5*(_xlfn.QUARTILE.INC($I$10:$I$29,3)-_xlfn.QUARTILE.INC($I$10:$I$29,1))),\"Não\",\"Sim\"),\"\")","v":"Sim"},"Sim","Sim","Não","Não","Sim"]
[null,"Comercial do Carmo ME",{"$nulls":5},"2026-02-12",{"$f":"145/25","v":5.8},"Não",null,null,{"$f":"IF(ISNUMBER(I22),IF(OR(I22<_xlfn.QUARTILE.INC($I$10:$I$29,1)-1.5*(_xlfn.QUARTILE.INC($I$10:I40,3)-_xlfn.QUARTILE.INC($I$10:$I$29,1)),I22>_xlfn.QUARTILE.INC($I$10:$I$29,3)+1.5*(_xlfn.QUARTILE.INC($I$10:$I$29,3)-_xlfn.QUARTILE.INC($I$10:$I$29,1))),\"Não\",\"Sim\"),\"\")","v":"Não"},"Sim","Não","Sim","Não","Não"]
[{"$nulls":9},"",null,null,{"$f":"IF(ISNUMBER(I23),IF(OR(I23<_xlfn.QUARTILE.INC($I$10:$I$29,1)-1.5*(_xlfn.QUARTILE.INC($I$10:I41,3)-_xlfn.QUARTILE.INC($I$10:$I$29,1)),I23>_xlfn.QUARTILE.INC($I$10:$I$29,3)+1.5*(_xlfn.QUARTILE.INC($I$10:$I$29,3)-_xlfn.QUARTILE.INC($I$10:$I$29,1))),\"Não\",\"Sim\"),\"\")","v":""},"","","","",""]
[{"$nulls":9},"",null,null,{"$f":"IF(ISNUMBER(I24),IF(OR(I24<_xlfn.QUARTILE.INC($I$10:$I$29,1)-1.5*(_xlfn.QUARTILE.INC($I$10:I42,3)-_xlfn.QUARTILE.INC($I$10:$I$29,1)),I24>_xlfn.QUARTILE.INC($I$10:$I$29,3)+1.5*(_xlfn.QUARTILE.INC($I$10:$I$29,3)-_xlfn.QUARTILE.INC($I$10:$I$29,1))),\"Não\",\"Sim\"),\"\")","v":""},"","","","",""]
[{"$nulls":9},"",null,null,{"$f":"IF(ISNUMBER(I25),IF(OR(I25<_xlfn.QUARTILE.INC($I$10:$I$29,1)-1.5*(_xlfn.QUARTILE.INC($I$10:I40,3)-_xlfn.QUARTILE.INC($I$10:$I$29,1)),I25>_xlfn.QUARTILE.INC($I$10:$I$29,3)+1.5*(_xlfn.QUARTILE.INC($I$10:$I$29,3)-_xlfn.QUARTILE.INC($I$10:$I$29,1))),\"Não\",\"Sim\"),\"\")","v":""},"","","","",""]
[{"$nulls":9},"",null,null,{"$f":"IF(ISNUMBER(I26),IF(OR(I26<_xlfn.QUARTILE.INC($I$10:$I$29,1)-1.5*(_xlfn.QUARTILE.INC($I$10:I40,3)-_xlfn.QUARTILE.INC($I$10:$I$29,1)),I26>_xlfn.QUARTILE.INC($I$10:$I$29,3)+1.5*(_xlfn.QUARTILE.INC($I$10:$I$29,3)-_xlfn.QUARTILE.INC($I$10:$I$29,1))),\"Não\",\"Sim\"),\"\")","v":""},"","","","",""]
[{"$nulls":9},"",null,null,{"$f":"IF(ISNUMBER(I27),IF(OR(I27<_xlfn.QUARTILE.INC($I$10:$I$29,1)-1.5*(_xlfn.QUARTILE.INC($I$10:I40,3)-_xlfn.QUARTILE.INC($I$10:$I$29,1)),I27>_xlfn.QUARTILE.INC($I$10:$I$29,3)+1.5*(_xlfn.QUARTILE.INC($I$10:$I$29,3)-_xlfn.QUARTILE.INC($I$10:$I$29,1))),\"Não\",\"Sim\"),\"\")","v":""},"","","","",""]
[{"$nulls":9},"",null,null,{"$f":"IF(ISNUMBER(I28),IF(OR(I28<_xlfn.QUARTILE.INC($I$10:$I$29,1)-1.5*(_xlfn.QUARTILE.INC($I$10:I40,3)-_xlfn.QUARTILE.INC($I$10:$I$29,1)),I28>_xlfn.QUARTILE.INC($I$10:$I$29,3)+1.5*(_xlfn.QUARTILE.INC($I$10:$I$29,3)-_xlfn.QUARTILE.INC($I$10:$I$29,1))),\"Não\",\"Sim\"),\"\")","v":""},"","","","",""]
[{"$nulls":9},"",null,null,{"$f":"IF(ISNUMBER(I29),IF(OR(I29<_xlfn.QUARTILE.INC($I$10:$I$29,1)-1.5*(_xlfn.QUARTILE.INC($I$10:I40,3)-_xlfn.QUARTILE.INC($I$10:$I$29,1)),I29>_xlfn.QUARTILE.INC($I$10:$I$29,3)+1.5*(_xlfn.QUARTILE.INC($I$10:$I$29,3)-_xlfn.QUARTILE.INC($I$10:$I$29,1))),\"Não\",\"Sim\"),\"\")","v":""},"","","","",""]
[null,"Observações:",{"$nulls":6},"CV:",{"$f":"IF($J$33=\"\",\"Selecione metodologia para exclusão de preços\",IF(COUNTIF($J$10:$J$29,\"Sim\")<3,\"N/D (são necessários pelo menos 3 preços)\",_xlfn.STDEV.S(IF($J$10:$J$29=\"Sim\",$I$10:$I$29))/AVERAGE(IF($J$10:$J$29=\"Sim\",$I$10:$I$29))))","v":7.065849837006076E-2},null,"Média (Cotações)",{"$f":"IF(COUNTIF(M19:M29,\"Sim\")<3,\"N/D (são necessários pelo menos 3 preços)\",AVERAGE(IF(M19:M29=\"Sim\",$I19:$I29)))","v":4.4521333333333333},{"$f":"IF(COUNTIF(N19:N29,\"Sim\")<3,\"N/D (são necessários pelo menos 3 preços)\",AVERAGE(IF(N19:N29=\"Sim\",$I19:$I29)))","v":4.7891000000000004},{"$f":"IF(COUNTIF(O19:O29,\"Sim\")<3,\"N/D (são necessários pelo menos 3 preços)\",AVERAGE(IF(O19:O29=\"Sim\",$I19:$I29)))","v":4.4521333333333333},{"$f":"IF(COUNTIF(P19:P29,\"Sim\")<3,\"N/D (são necessários pelo menos 3 preços)\",AVERAGE(IF(P19:P29=\"Sim\",$I19:$I29)))","v":4.9738666666666669},{"$f":"IF(COUNTIF(Q19:Q29,\"Sim\")<3,\"N/D (são necessários pelo menos 3 preços)\",AVERAGE(IF(Q19:Q29=\"Sim\",$I19:$I29)))","v":"N/D (são necessários pelo menos 3 preços)"},{"$f":"IF(COUNTIF(R19:R29,\"Sim\")<3,\"N/D (são necessários pelo menos 3 preços)\",AVERAGE(IF(R19:R29=\"Sim\",$I19:$I29)))","v":"N/D (são necessários pelo menos 3 preços)"},{"$f":"IF(COUNTIF(S19:S29,\"Sim\")<3,\"N/D (são necessários pelo menos 3 preços)\",AVERAGE(IF(S19:S29=\"Sim\",$I19:$I29)))","v":"N/D (são necessários pelo menos 3 preços)"}]
[{"$nulls":8},"Média:",{"$f":"IF($J$33=\"\",\"Selecione metodologia para exclusão de preços\",AVERAGE(IF($J$10:$J$29=\"Sim\",$I$10:$I$29)))","v":4.3921679993293434},null,"Mediana (Cotações)",{"$f":"IF(COUNTIF(M19:M29,\"Sim\")<3,\"N/D (são necessários pelo menos 3 preços)\",MEDIAN(IF(M19:M29=\"Sim\",$I19:$I29)))","v":4.3},{"$f":"IF(COUNTIF(N19:N29,\"Sim\")<3,\"N/D (são necessários pelo menos 3 preços)\",MEDIAN(IF(N19:N29=\"Sim\",$I19:$I29)))","v":4.5608000000000004},{"$f":"IF(COUNTIF(O19:O29,\"Sim\")<3,\"N/D (são necessários pelo menos 3 preços)\",MEDIAN(IF(O19:O29=\"Sim\",$I19:$I29)))","v":4.3},{"$f":"IF(COUNTIF(P19:P29,\"Sim\")<3,\"N/D (são necessários pelo menos 3 preços)\",MEDIAN(IF(P19:P29=\"Sim\",$I19:$I29)))","v":4.8216000000000001},{"$f":"IF(COUNTIF(Q19:Q29,\"Sim\")<3,\"N/D (são necessários pelo menos 3 preços)\",MEDIAN(IF(Q19:Q29=\"Sim\",$I19:$I29)))","v":"N/D (são necessários pelo menos 3 preços)"},{"$f":"IF(COUNTIF(R19:R29,\"Sim\")<3,\"N/D (são necessários pelo menos 3 preços)\",MEDIAN(IF(R19:R29=\"Sim\",$I19:$I29)))","v":"N/D (são necessários pelo menos 3 preços)"},{"$f":"IF(COUNTIF(S19:S29,\"Sim\")<3,\"N/D (são necessários pelo menos 3 preços)\",MEDIAN(IF(S19:S29=\"Sim\",$I19:$I29)))","v":"N/D (são necessários pelo menos 3 preços)"}]
[{"$nulls":8},"Mediana:",{"$f":"IF($J$33=\"\",\"Selecione metodologia para exclusão de preços\",MEDIAN(IF($J$10:$J$29=\"Sim\",$I$10:$I$29)))","v":4.3},null,"CV (Cotações)",{"$f":"IF(COUNTIF(M19:M29,\"Sim\")<3,\"N/D (são necessários pelo menos 3 preços)\",_xlfn.STDEV.S(IF(M19:M29=\"Sim\",$I19:$I29))/AVERAGE(IF(M19:M29=\"Sim\",$I19:$I29)))","v":7.2240415671068425E-2},{"$f":"IF(COUNTIF(N19:N29,\"Sim\")<3,\"N/D (são necessários pelo menos 3 preços)\",_xlfn.STDEV.S(IF(N19:N29=\"Sim\",$I19:$I29))/AVERAGE(IF(N19:N29=\"Sim\",$I19:$I29)))","v":0.15102823681330912},{"$f":"IF(COUNTIF(O19:O29,\"Sim\")<3,\"N/D (são necessários pelo menos 3 preços)\",_xlfn.STDEV.S(IF(O19:O29=\"Sim\",$I19:$I29))/AVERAGE(IF(O19:O29=\"Sim\",$I19:$I29)))","v":7.2240415671068425E-2},{"$f":"IF(COUNTIF(P19:P29,\"Sim\")<3,\"N/D (são necessários pelo menos 3 preços)\",_xlfn.STDEV.S(IF(P19:P29=\"Sim\",$I19:$I29))/AVERAGE(IF(P19:P29=\"Sim\",$I19:$I29)))","v":0.15310107543330143},{"$f":"IF(COUNTIF(Q19:Q29,\"Sim\")<3,\"N/D (são necessários pelo menos 3 preços)\",_xlfn.STDEV.S(IF(Q19:Q29=\"Sim\",$I19:$I29))/AVERAGE(IF(Q19:Q29=\"Sim\",$I19:$I29)))","v":"N/D (são necessários pelo menos 3 preços)"},{"$f":"IF(COUNTIF(R19:R29,\"Sim\")<3,\"N/D (são necessários pelo menos 3 preços)\",_xlfn.STDEV.S(IF(R19:R29=\"Sim\",$I19:$I29))/AVERAGE(IF(R19:R29=\"Sim\",$I19:$I29)))","v":"N/D (são necessários pelo menos 3 preços)"},{"$f":"IF(COUNTIF(S19:S29,\"Sim\")<3,\"N/D (são necessários pelo menos 3 preços)\",_xlfn.STDEV.S(IF(S19:S29=\"Sim\",$I19:$I29))/AVERAGE(IF(S19:S29=\"Sim\",$I19:$I29)))","v":"N/D (são necessários pelo menos 3 preços)"}]
[null,"Metodologia de exclusão de preços adotada:",{"$nulls":7},{"$f":"IF(M38=\"\",INDEX(M18:S18,MATCH(MIN(M35:S35),M35:S35,0)),M38)","v":"Grupos - Sem os dois maiores"},null,"Média",{"$f":"IF(SUM(COUNTIF($M$10:$M$16,\"Sim\")) + SUM(COUNTIF(M19:M29,\"Sim\")) < 3,\n   \"N/D (são necessários pelo menos 3 preços)\",\n   IFERROR(AVERAGE(_xlfn._xlws.FILTER($I$10:$I$16,$M$10:$M$16=\"Sim\"), _xlfn._xlws.FILTER($I$19:$I$29,M19:M29=\"Sim\")),M30))","v":4.4458469994131757},{"$f":"IF(SUM(COUNTIF($M$10:$M$16,\"Sim\")) + SUM(COUNTIF(N19:N29,\"Sim\")) < 3,\n   \"N/D (são necessários pelo menos 3 preços)\",\n   IFERROR(AVERAGE(_xlfn._xlws.FILTER($I$10:$I$16,$M$10:$M$16=\"Sim\"), _xlfn._xlws.FILTER($I$19:$I$29,N19:N29=\"Sim\")),N30))","v":4.5963084439228226},{"$f":"IF(SUM(COUNTIF($M$10:$M$16,\"Sim\")) + SUM(COUNTIF(O19:O29,\"Sim\")) < 3,\n   \"N/D (são necessários pelo menos 3 preços)\",\n   IFERROR(AVERAGE(_xlfn._xlws.FILTER($I$10:$I$16,$M$10:$M$16=\"Sim\"), _xlfn._xlws.FILTER($I$19:$I$29,O19:O29=\"Sim\")),O30))","v":4.4458469994131757},{"$f":"IF(SUM(COUNTIF($M$10:$M$16,\"Sim\")) + SUM(COUNTIF(P19:P29,\"Sim\")) < 3,\n   \"N/D (são necessários pelo menos 3 preços)\",\n   IFERROR(AVERAGE(_xlfn._xlws.FILTER($I$10:$I$16,$M$10:$M$16=\"Sim\"), _xlfn._xlws.FILTER($I$19:$I$29,P19:P29=\"Sim\")),P30))","v":4.6414969994131754},{"$f":"IF(SUM(COUNTIF($M$10:$M$16,\"Sim\")) + SUM(COUNTIF(Q19:Q29,\"Sim\")) < 3,\n   \"N/D (são necessários pelo menos 3 preços)\",\n   IFERROR(AVERAGE(_xlfn._xlws.FILTER($I$10:$I$16,$M$10:$M$16=\"Sim\"), _xlfn._xlws.FILTER($I$19:$I$29,Q19:Q29=\"Sim\")),Q30))","v":4.475996570757915},{"$f":"IF(SUM(COUNTIF($M$10:$M$16,\"Sim\")) + SUM(COUNTIF(R19:R29,\"Sim\")) < 3,\n   \"N/D (são necessários pelo menos 3 preços)\",\n   IFERROR(AVERAGE(_xlfn._xlws.FILTER($I$10:$I$16,$M$10:$M$16=\"Sim\"), _xlfn._xlws.FILTER($I$19:$I$29,R19:R29=\"Sim\")),R30))","v":4.3921679993293434},{"$f":"IF(SUM(COUNTIF($S$10:$S$16,\"Sim\")) + SUM(COUNTIF(S19:S29,\"Sim\")) < 3,\n   \"N/D (são necessários pelo menos 3 preços)\",\n   IFERROR(AVERAGE(_xlfn._xlws.FILTER($I$10:$I$16,$S$10:$S$16=\"Sim\"), _xlfn._xlws.FILTER($I$19:$I$29,S19:S29=\"Sim\")),S30))","v":"N/D (são necessários pelo menos 3 preços)"}]
[{"$nulls":11},"Mediana",{"$f":"IF(SUM(COUNTIF($M$10:$M$16,\"Sim\")) + SUM(COUNTIF(M19:M29,\"Sim\")) < 3,\n   \"N/D (são necessários pelo menos 3 preços)\",\n   IFERROR(MEDIAN(_xlfn._xlws.FILTER($I$10:$I$16,$M$10:$M$16=\"Sim\"), _xlfn._xlws.FILTER($I$19:$I$29,M19:M29=\"Sim\")),M30))","v":4.3355630585050324},{"$f":"IF(SUM(COUNTIF($M$10:$M$16,\"Sim\")) + SUM(COUNTIF(N19:N29,\"Sim\")) < 3,\n   \"N/D (são necessários pelo menos 3 preços)\",\n   IFERROR(MEDIAN(_xlfn._xlws.FILTER($I$10:$I$16,$M$10:$M$16=\"Sim\"), _xlfn._xlws.FILTER($I$19:$I$29,N19:N29=\"Sim\")),N30))","v":4.371126117010065},{"$f":"IF(SUM(COUNTIF($M$10:$M$16,\"Sim\")) + SUM(COUNTIF(O19:O29,\"Sim\")) < 3,\n   \"N/D (são necessários pelo menos 3 preços)\",\n   IFERROR(MEDIAN(_xlfn._xlws.FILTER($I$10:$I$16,$M$10:$M$16=\"Sim\"), _xlfn._xlws.FILTER($I$19:$I$29,O19:O29=\"Sim\")),O30))","v":4.3355630585050324},{"$f":"IF(SUM(COUNTIF($M$10:$M$16,\"Sim\")) + SUM(COUNTIF(P19:P29,\"Sim\")) < 3,\n   \"N/D (são necessários pelo menos 3 preços)\",\n   IFERROR(MEDIAN(_xlfn._xlws.FILTER($I$10:$I$16,$M$10:$M$16=\"Sim\"), _xlfn._xlws.FILTER($I$19:$I$29,P19:P29=\"Sim\")),P30))","v":4.4898548784509833},{"$f":"IF(SUM(COUNTIF($M$10:$M$16,\"Sim\")) + SUM(COUNTIF(Q19:Q29,\"Sim\")) < 3,\n   \"N/D (são necessários pelo menos 3 preços)\",\n   IFERROR(MEDIAN(_xlfn._xlws.FILTER($I$10:$I$16,$M$10:$M$16=\"Sim\"), _xlfn._xlws.FILTER($I$19:$I$29,Q19:Q29=\"Sim\")),Q30))","v":4.371126117010065},{"$f":"IF(SUM(COUNTIF($M$10:$M$16,\"Sim\")) + SUM(COUNTIF(R19:R29,\"Sim\")) < 3,\n   \"N/D (são necessários pelo menos 3 preços)\",\n   IFERROR(MEDIAN(_xlfn._xlws.FILTER($I$10:$I$16,$M$10:$M$16=\"Sim\"), _xlfn._xlws.FILTER($I$19:$I$29,R19:R29=\"Sim\")),R30))","v":4.3},{"$f":"IF(SUM(COUNTIF($S$10:$S$16,\"Sim\")) + SUM(COUNTIF(S19:S29,\"Sim\")) < 3,\n   \"N/D (são necessários pelo menos 3 preços)\",\n   IFERROR(MEDIAN(_xlfn._xlws.FILTER($I$10:$I$16,$S$10:$S$16=\"Sim\"), _xlfn._xlws.FILTER($I$19:$I$29,S19:S29=\"Sim\")),S30))","v":"N/D (são necessários pelo menos 3 preços)"}]
[{"$nulls":11},"CV",{"$f":"IF(SUM(COUNTIF($M$10:$M$16,\"Sim\")) + SUM(COUNTIF(M19:M29,\"Sim\")) < 3,\n   \"N/D (são necessários pelo menos 3 preços)\",\n   IFERROR(ROUND(_xlfn.STDEV.S(_xlfn._xlws.FILTER($I$10:$I$16,$M$10:$M$16=\"Sim\"), _xlfn._xlws.FILTER($I$19:$I$29,M19:M29=\"Sim\")) /\n   AVERAGE(_xlfn._xlws.FILTER($I$10:$I$16,$M$10:$M$16=\"Sim\"), _xlfn._xlws.FILTER($I$19:$I$29,M19:M29=\"Sim\")),4),M32)\n)","v":7.3099999999999998E-2},{"$f":"IF(SUM(COUNTIF($M$10:$M$16,\"Sim\")) + SUM(COUNTIF(N19:N29,\"Sim\")) < 3,\n   \"N/D (são necessários pelo menos 3 preços)\",\n   IFERROR(ROUND(_xlfn.STDEV.S(_xlfn._xlws.FILTER($I$10:$I$16,$M$10:$M$16=\"Sim\"), _xlfn._xlws.FILTER($I$19:$I$29,N19:N29=\"Sim\")) /\n   AVERAGE(_xlfn._xlws.FILTER($I$10:$I$16,$M$10:$M$16=\"Sim\"), _xlfn._xlws.FILTER($I$19:$I$29,N19:N29=\"Sim\")),4),N32)\n)","v":0.11840000000000001},{"$f":"IF(SUM(COUNTIF($M$10:$M$16,\"Sim\")) + SUM(COUNTIF(O19:O29,\"Sim\")) < 3,\n   \"N/D (são necessários pelo menos 3 preços)\",\n   IFERROR(ROUND(_xlfn.STDEV.S(_xlfn._xlws.FILTER($I$10:$I$16,$M$10:$M$16=\"Sim\"), _xlfn._xlws.FILTER($I$19:$I$29,O19:O29=\"Sim\")) /\n   AVERAGE(_xlfn._xlws.FILTER($I$10:$I$16,$M$10:$M$16=\"Sim\"), _xlfn._xlws.FILTER($I$19:$I$29,O19:O29=\"Sim\")),4),O32)\n)","v":7.3099999999999998E-2},{"$f":"IF(SUM(COUNTIF($M$10:$M$16,\"Sim\")) + SUM(COUNTIF(P19:P29,\"Sim\")) < 3,\n   \"N/D (são necessários pelo menos 3 preços)\",\n   IFERROR(ROUND(_xlfn.STDEV.S(_xlfn._xlws.FILTER($I$10:$I$16,$M$10:$M$16=\"Sim\"), _xlfn._xlws.FILTER($I$19:$I$29,P19:P29=\"Sim\")) /\n   AVERAGE(_xlfn._xlws.FILTER($I$10:$I$16,$M$10:$M$16=\"Sim\"), _xlfn._xlws.FILTER($I$19:$I$29,P19:P29=\"Sim\")),4),P32)\n)","v":0.12139999999999999},{"$f":"IF(SUM(COUNTIF($M$10:$M$16,\"Sim\")) + SUM(COUNTIF(Q19:Q29,\"Sim\")) < 3,\n   \"N/D (são necessários pelo menos 3 preços)\",\n   IFERROR(ROUND(_xlfn.STDEV.S(_xlfn._xlws.FILTER($I$10:$I$16,$M$10:$M$16=\"Sim\"), _xlfn._xlws.FILTER($I$19:$I$29,Q19:Q29=\"Sim\")) /\n   AVERAGE(_xlfn._xlws.FILTER($I$10:$I$16,$M$10:$M$16=\"Sim\"), _xlfn._xlws.FILTER($I$19:$I$29,Q19:Q29=\"Sim\")),4),Q32)\n)","v":7.5700000000000003E-2},{"$f":"IF(SUM(COUNTIF($M$10:$M$16,\"Sim\")) + SUM(COUNTIF(R19:R29,\"Sim\")) < 3,\n   \"N/D (são necessários pelo menos 3 preços)\",\n   IFERROR(ROUND(_xlfn.STDEV.S(_xlfn._xlws.FILTER($I$10:$I$16,$M$10:$M$16=\"Sim\"), _xlfn._xlws.FILTER($I$19:$I$29,R19:R29=\"Sim\")) /\n   AVERAGE(_xlfn._xlws.FILTER($I$10:$I$16,$M$10:$M$16=\"Sim\"), _xlfn._xlws.FILTER($I$19:$I$29,R19:R29=\"Sim\")),4),R32)\n)","v":7.0699999999999999E-2},{"$f":"IF(SUM(COUNTIF($S$10:$S$16,\"Sim\")) + SUM(COUNTIF(S19:S29,\"Sim\")) < 3,\n   \"N/D (são necessários pelo menos 3 preços)\",\n   IFERROR(_xlfn.STDEV.S(_xlfn._xlws.FILTER($I$10:$I$16,$S$10:$S$16=\"Sim\"), _xlfn._xlws.FILTER($I$19:$I$29,S19:S29=\"Sim\")) /\n   AVERAGE(_xlfn._xlws.FILTER($I$10:$I$16,$S$10:$S$16=\"Sim\"), _xlfn._xlws.FILTER($I$19:$I$29,S19:S29=\"Sim\")),S32)\n)","v":"N/D (são necessários pelo menos 3 preços)"}]
[null,"PREÇO UNITÁRIO ESTIMADO ADOTADO:",{"$nulls":7},{"$f":"IF($J$33=\"\",\"Selecione metodologia para exclusão de preços\",MIN(J31:J32))","v":4.3},null,"Metodologia sugerida:",{"$f":"IF($M$35=MIN($M$35,$N$35:$R$35),M8,\"Grupos - \"&INDEX({\"Todos\";\"Sem o maior\";\"Sem o menor\";\"Sem o maior e Sem o menor\";\"Sem os dois maiores\"},MATCH(MIN($N$35:$R$35),$N$35:$R$35,0)))","v":"Grupos - Sem os dois maiores"}]
[{"$nulls":11},"Preço estimado sugerido:",{"$f":"IF($M$36=M8,SMALL($M$33:$M$34,1),MIN(INDEX($N$34:$R$34, MATCH(MIN($N$35:$R$35), $N$35:$R$35, 0)),INDEX($N$33:$R$33, MATCH(MIN($N$35:$R$35), $N$35:$R$35, 0))))","v":4.3}]
[{"$nulls":11},"Metodologia a adotar:",{"$f":"IF(INDEX(L18:S18,N38)=0,\"\",INDEX(L18:S18,N38))","v":""},1]

{"sheet":"Peixe 35% 3 a 4 mm","index":4,"n_rows":38,"n_cols":21,"rows_kept":38,"cut":false,"hidden":false,"merged":[[15,12,15,17],[6,2,6,5],[6,12,6,18],[7,1,7,9],[7,12,7,18],[8,12,8,17],[9,12,9,17],[10,12,10,17],[11,12,11,17],[12,12,12,17],[13,12,13,17],[14,12,14,17],[26,1,26,6],[16,1,16,9],[16,12,16,18],[17,1,17,6],[18,1,18,6],[19,1,19,6],[20,1,20,6],[21,1,21,6],[22,1,22,6],[23,1,23,6],[24,1,24,6],[25,1,25,6],[35,12,35,18],[36,12,36,18],[27,1,27,6],[28,1,28,6],[29,1,31,7],[32,1,34,8],[32,9,34,9],[35,1,37,8],[35,9,37,9]]}
[]
[null,"Processo",{"$f":"'Peixe 50% PB Farelo'!C2","v":"59511.000102/2026-55"}]
[null,"Responsável",{"$f":"'Peixe 50% PB Farelo'!C3","v":"JHONES DE LIMA VIEIRA"}]
[null,"Área de Origem",{"$f":"'Peixe 50% PB Farelo'!C4","v":"14ª GTR"}]
[null,"Data da pesquisa",{"$f":"'Peixe 50% PB Farelo'!C5","v":"Janeiro/2026 - Fevereiro/2026"}]
[]
[null,"ITEM:","Ração extrusada para peixe onívoro 35% PB – Proteína Bruta Mín.: 35%, granulometria 3 a 4 mm. Data de validade não inferior a 6 meses.",null,null,null,"UNIDADE DE MEDIDA:",{"$f":"'Peixe 50% PB Farelo'!H7","v":"kg"},"QUANTIDADE:",37500,null,null,"Tabela auxiliar de metodologias para exclusão de preços",{"$nulls":7},"Automática (menor CV)"]
[null,"LICITAÇÕES ANTERIORES",{"$nulls":10},"Licitações Anteriores - Outliers",{"$nulls":7},{"$f":"M18","v":"Outliers"}]
[null,"Órgão","Edital/Ano - Nº do Lote / Item","Quantidade","Valor Unitário","Data","índice de atualização (nome)","Variação acumulada do índice (%)","Preço unitário atualizado","Utilizar?  (Sim/Não)",null,null,"Utilizar?",{"$nulls":5},"Por critério do(a) analista",null,{"$f":"N18","v":"Grupos - Todos"}]
[null,"14ª SR - Fortaleza/CE","Edital 90007/2024 - Item 5",10909,4.18,"2025-01-02","IPA-EP-DI Suprimentos agropecuários",{"$f":"(I10/E10)-1","v":1.6540957444201254E-2},{"$f":"IF(ISBLANK(E10),\"\",E10*(1+(INDEX('índice de atualização'!B:B,MATCH(G10,'índice de atualização'!B:B,0)+COUNTA('índice de atualização'!B:B)-1)-INDEX('índice de atualização'!B:B,MATCH(TEXT(F10,\"MM/AAAA\"),'índice de atualização'!A:A,0)))/INDEX('índice de atualização'!B:B,MATCH(TEXT(F10,\"MM/AAAA\"),'índice de atualização'!A:A,0))))","v":4.2491412021167614},{"$f":"IF(ISNUMBER(I10),IF($J$33<>$S$9,M10,S10),\"\")","v":"Sim"},null,null,{"$f":"IF(ISNUMBER(I10),IF(OR(I10<_xlfn.QUARTILE.INC($I$10:$I$29,1)-1.5*(_xlfn.QUARTILE.INC($I$10:I29,3)-_xlfn.QUARTILE.INC($I$10:$I$29,1)),I10>_xlfn.QUARTILE.INC($I$10:$I$29,3)+1.5*(_xlfn.QUARTILE.INC($I$10:$I$29,3)-_xlfn.QUARTILE.INC($I$10:$I$29,1))),\"Não\",\"Sim\"),\"\")","v":"Sim"},{"$nulls":7},{"$f":"O18","v":"Grupos - Sem o maior"}]
[null,"14ª SR - Fortaleza/CE","Edital 90007/2024 - Item 13",1900,4.0999999999999996,"2025-02-18","IPA-EP-DI Suprimentos agropecuários",{"$f":"(I11/E11)-1","v":4.5072426012993105E-4},{"$f":"IF(ISBLANK(E11),\"\",E11*(1+(INDEX('índice de atualização'!B:B,MATCH(G11,'índice de atualização'!B:B,0)+COUNTA('índice de atualização'!B:B)-1)-INDEX('índice de atualização'!B:B,MATCH(TEXT(F11,\"MM/AAAA\"),'índice de atualização'!A:A,0)))/INDEX('índice de atualização'!B:B,MATCH(TEXT(F11,\"MM/AAAA\"),'índice de atualização'!A:A,0))))","v":4.1018479694665322},{"$f":"IF(ISNUMBER(I11),IF($J$33<>$S$8,M11,S11),\"\")","v":"Sim"},null,null,{"$f":"IF(ISNUMBER(I11),IF(OR(I11<_xlfn.QUARTILE.INC($I$10:$I$29,1)-1.5*(_xlfn.QUARTILE.INC($I$10:I30,3)-_xlfn.QUARTILE.INC($I$10:$I$29,1)),I11>_xlfn.QUARTILE.INC($I$10:$I$29,3)+1.5*(_xlfn.QUARTILE.INC($I$10:$I$29,3)-_xlfn.QUARTILE.INC($I$10:$I$29,1))),\"Não\",\"Sim\"),\"\")","v":"Sim"},{"$nulls":7},{"$f":"P18","v":"Grupos - Sem o menor"}]
[null,"4ª SR - Aracaju/SE","Edital 90002/2025 - Item 3",6000,4.08,"2025-07-11","IPA-EP-DI Suprimentos agropecuários",{"$f":"(I12/E12)-1","v":-2.2368348389686266E-2},{"$f":"IF(ISBLANK(E12),\"\",E12*(1+(INDEX('índice de atualização'!B:B,MATCH(G12,'índice de atualização'!B:B,0)+COUNTA('índice de atualização'!B:B)-1)-INDEX('índice de atualização'!B:B,MATCH(TEXT(F12,\"MM/AAAA\"),'índice de atualização'!A:A,0)))/INDEX('índice de atualização'!B:B,MATCH(TEXT(F12,\"MM/AAAA\"),'índice de atualização'!A:A,0))))","v":3.9887371385700803},{"$f":"IF(ISNUMBER(I12),IF($J$33<>$S$8,M12,S12),\"\")","v":"Sim"},null,null,{"$f":"IF(ISNUMBER(I12),IF(OR(I12<_xlfn.QUARTILE.INC($I$10:$I$29,1)-1.5*(_xlfn.QUARTILE.INC($I$10:I31,3)-_xlfn.QUARTILE.INC($I$10:$I$29,1)),I12>_xlfn.QUARTILE.INC($I$10:$I$29,3)+1.5*(_xlfn.QUARTILE.INC($I$10:$I$29,3)-_xlfn.QUARTILE.INC($I$10:$I$29,1))),\"Não\",\"Sim\"),\"\")","v":"Sim"},{"$f":"$M$12","v":"Sim"},{"$f":"$M$12","v":"Sim"},{"$f":"$M$12","v":"Sim"},{"$f":"$M$12","v":"Sim"},{"$f":"$M$12","v":"Sim"},null,null,{"$f":"Q18","v":"Grupos - Sem o maior e sem o menor"}]
[null,"Codevasf Sede","Edital 90057/2025 - Item 1",{"$f":"1176*25","v":29400},{"$f":"124/25","v":4.96},"2025-12-08","IPA-EP-DI Suprimentos agropecuários",{"$f":"(I13/E13)-1","v":0},{"$f":"IF(ISBLANK(E13),\"\",E13*(1+(INDEX('índice de atualização'!B:B,MATCH(G13,'índice de atualização'!B:B,0)+COUNTA('índice de atualização'!B:B)-1)-INDEX('índice de atualização'!B:B,MATCH(TEXT(F13,\"MM/AAAA\"),'índice de atualização'!A:A,0)))/INDEX('índice de atualização'!B:B,MATCH(TEXT(F13,\"MM/AAAA\"),'índice de atualização'!A:A,0))))","v":4.96},"Sim",null,null,{"$f":"IF(ISNUMBER(I13),IF(OR(I13<_xlfn.QUARTILE.INC($I$10:$I$29,1)-1.5*(_xlfn.QUARTILE.INC($I$10:I32,3)-_xlfn.QUARTILE.INC($I$10:$I$29,1)),I13>_xlfn.QUARTILE.INC($I$10:$I$29,3)+1.5*(_xlfn.QUARTILE.INC($I$10:$I$29,3)-_xlfn.QUARTILE.INC($I$10:$I$29,1))),\"Não\",\"Sim\"),\"\")","v":"Sim"},{"$f":"$M$13","v":"Sim"},{"$f":"$M$13","v":"Sim"},{"$f":"$M$13","v":"Sim"},{"$f":"$M$13","v":"Sim"},{"$f":"$M$13","v":"Sim"},null,null,{"$f":"R18","v":"Grupos - Sem os dois maiores"}]
[{"$nulls":9},"",null,null,{"$f":"IF(ISNUMBER(I14),IF(OR(I14<_xlfn.QUARTILE.INC($I$10:$I$29,1)-1.5*(_xlfn.QUARTILE.INC($I$10:I33,3)-_xlfn.QUARTILE.INC($I$10:$I$29,1)),I14>_xlfn.QUARTILE.INC($I$10:$I$29,3)+1.5*(_xlfn.QUARTILE.INC($I$10:$I$29,3)-_xlfn.QUARTILE.INC($I$10:$I$29,1))),\"Não\",\"Sim\"),\"\")","v":""},{"$f":"$M$14","v":""},{"$f":"$M$14","v":""},{"$f":"$M$14","v":""},{"$f":"$M$14","v":""},{"$f":"$M$14","v":""},null,null,{"$f":"S18","v":"Por critério do(a) analista"}]
[{"$nulls":9},"",null,null,{"$f":"IF(ISNUMBER(I15),IF(OR(I15<_xlfn.QUARTILE.INC($I$10:$I$29,1)-1.5*(_xlfn.QUARTILE.INC($I$10:I36,3)-_xlfn.QUARTILE.INC($I$10:$I$29,1)),I15>_xlfn.QUARTILE.INC($I$10:$I$29,3)+1.5*(_xlfn.QUARTILE.INC($I$10:$I$29,3)-_xlfn.QUARTILE.INC($I$10:$I$29,1))),\"Não\",\"Sim\"),\"\")","v":""},{"$f":"$M$15","v":""},{"$f":"$M$15","v":""},{"$f":"$M$15","v":""},{"$f":"$M$15","v":""},{"$f":"$M$15","v":""}]
[{"$nulls":9},"",null,null,{"$f":"IF(ISNUMBER(I16),IF(OR(I16<_xlfn.QUARTILE.INC($I$10:$I$29,1)-1.5*(_xlfn.QUARTILE.INC($I$10:I39,3)-_xlfn.QUARTILE.INC($I$10:$I$29,1)),I16>_xlfn.QUARTILE.INC($I$10:$I$29,3)+1.5*(_xlfn.QUARTILE.INC($I$10:$I$29,3)-_xlfn.QUARTILE.INC($I$10:$I$29,1))),\"Não\",\"Sim\"),\"\")","v":""},{"$f":"$M$16","v":""},{"$f":"$M$16","v":""},{"$f":"$M$16","v":""},{"$f":"$M$16","v":""},{"$f":"$M$16","v":""}]
[null,"COTAÇÕES DE MERCADO",{"$nulls":10},"Cotações"]
[null,"Empresa",{"$nulls":5},"Data","Preço Unitário","Utilizar? (Sim/Não)",null,null,"Outliers","Grupos - Todos","Grupos - Sem o maior","Grupos - Sem o menor","Grupos - Sem o maior e sem o menor","Grupos - Sem os dois maiores","Por critério do(a) analista"]
[null,"Agrosolo - Guabi",{"$nulls":5},"2026-02-10",{"$f":"119.46/25","v":4.7783999999999995},{"$f":"IF(ISNUMBER(I19),IF($J$33=$M$18,M19,IF($J$33=$N$18,N19,IF($J$33=$O$18,O19,IF($J$33=$P$18,P19,IF($J$33=$Q$18,Q19,IF($J$33=$R$18,R19,IF($J$33=$S$18,S19,\"\"))))))),\"\")","v":"Sim"},null,null,{"$f":"IF(ISNUMBER(I19),IF(OR(I19<_xlfn.QUARTILE.INC($I$10:$I$29,1)-1.5*(_xlfn.QUARTILE.INC($I$10:I40,3)-_xlfn.QUARTILE.INC($I$10:$I$29,1)),I19>_xlfn.QUARTILE.INC($I$10:$I$29,3)+1.5*(_xlfn.QUARTILE.INC($I$10:$I$29,3)-_xlfn.QUARTILE.INC($I$10:$I$29,1))),\"Não\",\"Sim\"),\"\")","v":"Sim"},{"$f":"IF(ISNUMBER(I19),\"Sim\",\"\")","v":"Sim"},{"$f":"IF(ISNUMBER(I19),IF(_xlfn.RANK.EQ(I19,$I$19:$I$29)=1,\"Não\",\"Sim\"),\"\")","v":"Sim"},{"$f":"IF(ISNUMBER(I19),IF(_xlfn.RANK.EQ(I19,$I$19:$I$29)=COUNT($I$19:$I$29),\"Não\",\"Sim\"),\"\")","v":"Sim"},{"$f":"IF(O19=\"\",\"\",IF(AND(O19=\"Sim\",P19=\"Sim\"),\"Sim\",\"Não\"))","v":"Sim"},{"$f":"IF(ISNUMBER(I19),IF(_xlfn.RANK.EQ(I19,$I$19:$I$29)<=2,\"Não\",\"Sim\"),\"\")","v":"Não"}]
[null,"Samaria Rações LTDA",{"$nulls":5},"2026-02-09",{"$f":"104.5/25","v":4.18},"Sim",null,null,{"$f":"IF(ISNUMBER(I20),IF(OR(I20<_xlfn.QUARTILE.INC($I$10:$I$29,1)-1.5*(_xlfn.QUARTILE.INC($I$10:I40,3)-_xlfn.QUARTILE.INC($I$10:$I$29,1)),I20>_xlfn.QUARTILE.INC($I$10:$I$29,3)+1.5*(_xlfn.QUARTILE.INC($I$10:$I$29,3)-_xlfn.QUARTILE.INC($I$10:$I$29,1))),\"Não\",\"Sim\"),\"\")","v":"Sim"},"Sim","Sim","Sim",{"$f":"IF(O20=\"\",\"\",IF(AND(O20=\"Sim\",P20=\"Sim\"),\"Sim\",\"Não\"))","v":"Sim"},"Sim"]
[null,"Integral Mix Agroindustria",{"$nulls":5},"2026-02-07",{"$f":"95.31/25","v":3.8124000000000002},"Não",null,null,{"$f":"IF(ISNUMBER(I21),IF(OR(I21<_xlfn.QUARTILE.INC($I$10:$I$29,1)-1.5*(_xlfn.QUARTILE.INC($I$10:I40,3)-_xlfn.QUARTILE.INC($I$10:$I$29,1)),I21>_xlfn.QUARTILE.INC($I$10:$I$29,3)+1.5*(_xlfn.QUARTILE.INC($I$10:$I$29,3)-_xlfn.QUARTILE.INC($I$10:$I$29,1))),\"Não\",\"Sim\"),\"\")","v":"Sim"},"Sim","Sim","Não","Não","Sim"]
[null,"Comercial do Carmo ME",{"$nulls":5},"2026-02-12",{"$f":"141/25","v":5.64},"Não",null,null,{"$f":"IF(ISNUMBER(I22),IF(OR(I22<_xlfn.QUARTILE.INC($I$10:$I$29,1)-1.5*(_xlfn.QUARTILE.INC($I$10:I40,3)-_xlfn.QUARTILE.INC($I$10:$I$29,1)),I22>_xlfn.QUARTILE.INC($I$10:$I$29,3)+1.5*(_xlfn.QUARTILE.INC($I$10:$I$29,3)-_xlfn.QUARTILE.INC($I$10:$I$29,1))),\"Não\",\"Sim\"),\"\")","v":"Sim"},"Sim","Não","Sim","Não","Não"]
[{"$nulls":9},"",null,null,{"$f":"IF(ISNUMBER(I23),IF(OR(I23<_xlfn.QUARTILE.INC($I$10:$I$29,1)-1.5*(_xlfn.QUARTILE.INC($I$10:I41,3)-_xlfn.QUARTILE.INC($I$10:$I$29,1)),I23>_xlfn.QUARTILE.INC($I$10:$I$29,3)+1.5*(_xlfn.QUARTILE.INC($I$10:$I$29,3)-_xlfn.QUARTILE.INC($I$10:$I$29,1))),\"Não\",\"Sim\"),\"\")","v":""},"","","","",""]
[{"$nulls":9},"",null,null,{"$f":"IF(ISNUMBER(I24),IF(OR(I24<_xlfn.QUARTILE.INC($I$10:$I$29,1)-1.5*(_xlfn.QUARTILE.INC($I$10:I42,3)-_xlfn.QUARTILE.INC($I$10:$I$29,1)),I24>_xlfn.QUARTILE.INC($I$10:$I$29,3)+1.5*(_xlfn.QUARTILE.INC($I$10:$I$29,3)-_xlfn.QUARTILE.INC($I$10:$I$29,1))),\"Não\",\"Sim\"),\"\")","v":""},"","","","",""]
[{"$nulls":9},"",null,null,{"$f":"IF(ISNUMBER(I25),IF(OR(I25<_xlfn.QUARTILE.INC($I$10:$I$29,1)-1.5*(_xlfn.QUARTILE.INC($I$10:I40,3)-_xlfn.QUARTILE.INC($I$10:$I$29,1)),I25>_xlfn.QUARTILE.INC($I$10:$I$29,3)+1.5*(_xlfn.QUARTILE.INC($I$10:$I$29,3)-_xlfn.QUARTILE.INC($I$10:$I$29,1))),\"Não\",\"Sim\"),\"\")","v":""},"","","","",""]
[{"$nulls":9},"",null,null,{"$f":"IF(ISNUMBER(I26),IF(OR(I26<_xlfn.QUARTILE.INC($I$10:$I$29,1)-1.5*(_xlfn.QUARTILE.INC($I$10:I40,3)-_xlfn.QUARTILE.INC($I$10:$I$29,1)),I26>_xlfn.QUARTILE.INC($I$10:$I$29,3)+1.5*(_xlfn.QUARTILE.INC($I$10:$I$29,3)-_xlfn.QUARTILE.INC($I$10:$I$29,1))),\"Não\",\"Sim\"),\"\")","v":""},"","","","",""]
[{"$nulls":9},"",null,null,{"$f":"IF(ISNUMBER(I27),IF(OR(I27<_xlfn.QUARTILE.INC($I$10:$I$29,1)-1.5*(_xlfn.QUARTILE.INC($I$10:I40,3)-_xlfn.QUARTILE.INC($I$10:$I$29,1)),I27>_xlfn.QUARTILE.INC($I$10:$I$29,3)+1.5*(_xlfn.QUARTILE.INC($I$10:$I$29,3)-_xlfn.QUARTILE.INC($I$10:$I$29,1))),\"Não\",\"Sim\"),\"\")","v":""},"","","","",""]
[{"$nulls":9},"",null,null,{"$f":"IF(ISNUMBER(I28),IF(OR(I28<_xlfn.QUARTILE.INC($I$10:$I$29,1)-1.5*(_xlfn.QUARTILE.INC($I$10:I40,3)-_xlfn.QUARTILE.INC($I$10:$I$29,1)),I28>_xlfn.QUARTILE.INC($I$10:$I$29,3)+1.5*(_xlfn.QUARTILE.INC($I$10:$I$29,3)-_xlfn.QUARTILE.INC($I$10:$I$29,1))),\"Não\",\"Sim\"),\"\")","v":""},"","","","",""]
[{"$nulls":9},"",null,null,{"$f":"IF(ISNUMBER(I29),IF(OR(I29<_xlfn.QUARTILE.INC($I$10:$I$29,1)-1.5*(_xlfn.QUARTILE.INC($I$10:I40,3)-_xlfn.QUARTILE.INC($I$10:$I$29,1)),I29>_xlfn.QUARTILE.INC($I$10:$I$29,3)+1.5*(_xlfn.QUARTILE.INC($I$10:$I$29,3)-_xlfn.QUARTILE.INC($I$10:$I$29,1))),\"Não\",\"Sim\"),\"\")","v":""},"","","","",""]
[null,"Observações:",{"$nulls":6},"CV:",{"$f":"IF($J$33=\"\",\"Selecione metodologia para exclusão de preços\",IF(COUNTIF($J$10:$J$29,\"Sim\")<3,\"N/D (são necessários pelo menos 3 preços)\",_xlfn.STDEV.S(IF($J$10:$J$29=\"Sim\",$I$10:$I$29))/AVERAGE(IF($J$10:$J$29=\"Sim\",$I$10:$I$29))))","v":9.0402105794657364E-2},null,"Média (Cotações)",{"$f":"IF(COUNTIF(M19:M29,\"Sim\")<3,\"N/D (são necessários pelo menos 3 preços)\",AVERAGE(IF(M19:M29=\"Sim\",$I19:$I29)))","v":4.6026999999999996},{"$f":"IF(COUNTIF(N19:N29,\"Sim\")<3,\"N/D (são necessários pelo menos 3 preços)\",AVERAGE(IF(N19:N29=\"Sim\",$I19:$I29)))","v":4.6026999999999996},{"$f":"IF(COUNTIF(O19:O29,\"Sim\")<3,\"N/D (são necessários pelo menos 3 preços)\",AVERAGE(IF(O19:O29=\"Sim\",$I19:$I29)))","v":4.2569333333333335},{"$f":"IF(COUNTIF(P19:P29,\"Sim\")<3,\"N/D (são necessários pelo menos 3 preços)\",AVERAGE(IF(P19:P29=\"Sim\",$I19:$I29)))","v":4.866133333333333},{"$f":"IF(COUNTIF(Q19:Q29,\"Sim\")<3,\"N/D (são necessários pelo menos 3 preços)\",AVERAGE(IF(Q19:Q29=\"Sim\",$I19:$I29)))","v":"N/D (são necessários pelo menos 3 preços)"},{"$f":"IF(COUNTIF(R19:R29,\"Sim\")<3,\"N/D (são necessários pelo menos 3 preços)\",AVERAGE(IF(R19:R29=\"Sim\",$I19:$I29)))","v":"N/D (são necessários pelo menos 3 preços)"},{"$f":"IF(COUNTIF(S19:S29,\"Sim\")<3,\"N/D (são necessários pelo menos 3 preços)\",AVERAGE(IF(S19:S29=\"Sim\",$I19:$I29)))","v":"N/D (são necessários pelo menos 3 preços)"}]
[{"$nulls":8},"Média:",{"$f":"IF($J$33=\"\",\"Selecione metodologia para exclusão de preços\",AVERAGE(IF($J$10:$J$29=\"Sim\",$I$10:$I$29)))","v":4.3763543850255617},null,"Mediana (Cotações)",{"$f":"IF(COUNTIF(M19:M29,\"Sim\")<3,\"N/D (são necessários pelo menos 3 preços)\",MEDIAN(IF(M19:M29=\"Sim\",$I19:$I29)))","v":4.4791999999999996},{"$f":"IF(COUNTIF(N19:N29,\"Sim\")<3,\"N/D (são necessários pelo menos 3 preços)\",MEDIAN(IF(N19:N29=\"Sim\",$I19:$I29)))","v":4.4791999999999996},{"$f":"IF(COUNTIF(O19:O29,\"Sim\")<3,\"N/D (são necessários pelo menos 3 preços)\",MEDIAN(IF(O19:O29=\"Sim\",$I19:$I29)))","v":4.18},{"$f":"IF(COUNTIF(P19:P29,\"Sim\")<3,\"N/D (são necessários pelo menos 3 preços)\",MEDIAN(IF(P19:P29=\"Sim\",$I19:$I29)))","v":4.7783999999999995},{"$f":"IF(COUNTIF(Q19:Q29,\"Sim\")<3,\"N/D (são necessários pelo menos 3 preços)\",MEDIAN(IF(Q19:Q29=\"Sim\",$I19:$I29)))","v":"N/D (são necessários pelo menos 3 preços)"},{"$f":"IF(COUNTIF(R19:R29,\"Sim\")<3,\"N/D (são necessários pelo menos 3 preços)\",MEDIAN(IF(R19:R29=\"Sim\",$I19:$I29)))","v":"N/D (são necessários pelo menos 3 preços)"},{"$f":"IF(COUNTIF(S19:S29,\"Sim\")<3,\"N/D (são necessários pelo menos 3 preços)\",MEDIAN(IF(S19:S29=\"Sim\",$I19:$I29)))","v":"N/D (são necessários pelo menos 3 preços)"}]
[{"$nulls":8},"Mediana:",{"$f":"IF($J$33=\"\",\"Selecione metodologia para exclusão de preços\",MEDIAN(IF($J$10:$J$29=\"Sim\",$I$10:$I$29)))","v":4.2145706010583801},null,"CV (Cotações)",{"$f":"IF(COUNTIF(M19:M29,\"Sim\")<3,\"N/D (são necessários pelo menos 3 preços)\",_xlfn.STDEV.S(IF(M19:M29=\"Sim\",$I19:$I29))/AVERAGE(IF(M19:M29=\"Sim\",$I19:$I29)))","v":0.17336284473157099},{"$f":"IF(COUNTIF(N19:N29,\"Sim\")<3,\"N/D (são necessários pelo menos 3 preços)\",_xlfn.STDEV.S(IF(N19:N29=\"Sim\",$I19:$I29))/AVERAGE(IF(N19:N29=\"Sim\",$I19:$I29)))","v":0.17336284473157099},{"$f":"IF(COUNTIF(O19:O29,\"Sim\")<3,\"N/D (são necessários pelo menos 3 preços)\",_xlfn.STDEV.S(IF(O19:O29=\"Sim\",$I19:$I29))/AVERAGE(IF(O19:O29=\"Sim\",$I19:$I29)))","v":0.11453635767909195},{"$f":"IF(COUNTIF(P19:P29,\"Sim\")<3,\"N/D (são necessários pelo menos 3 preços)\",_xlfn.STDEV.S(IF(P19:P29=\"Sim\",$I19:$I29))/AVERAGE(IF(P19:P29=\"Sim\",$I19:$I29)))","v":0.1508268080876991},{"$f":"IF(COUNTIF(Q19:Q29,\"Sim\")<3,\"N/D (são necessários pelo menos 3 preços)\",_xlfn.STDEV.S(IF(Q19:Q29=\"Sim\",$I19:$I29))/AVERAGE(IF(Q19:Q29=\"Sim\",$I19:$I29)))","v":"N/D (são necessários pelo menos 3 preços)"},{"$f":"IF(COUNTIF(R19:R29,\"Sim\")<3,\"N/D (são necessários pelo menos 3 preços)\",_xlfn.STDEV.S(IF(R19:R29=\"Sim\",$I19:$I29))/AVERAGE(IF(R19:R29=\"Sim\",$I19:$I29)))","v":"N/D (são necessários pelo menos 3 preços)"},{"$f":"IF(COUNTIF(S19:S29,\"Sim\")<3,\"N/D (são necessários pelo menos 3 preços)\",_xlfn.STDEV.S(IF(S19:S29=\"Sim\",$I19:$I29))/AVERAGE(IF(S19:S29=\"Sim\",$I19:$I29)))","v":"N/D (são necessários pelo menos 3 preços)"}]
[null,"Metodologia de exclusão de preços adotada:",{"$nulls":7},{"$f":"IF(M38=\"\",INDEX(M18:S18,MATCH(MIN(M35:S35),M35:S35,0)),M38)","v":"Grupos - Sem o maior e sem o menor"},null,"Média",{"$f":"IF(SUM(COUNTIF($M$10:$M$16,\"Sim\")) + SUM(COUNTIF(M19:M29,\"Sim\")) < 3,\n   \"N/D (são necessários pelo menos 3 preços)\",\n   IFERROR(AVERAGE(_xlfn._xlws.FILTER($I$10:$I$16,$M$10:$M$16=\"Sim\"), _xlfn._xlws.FILTER($I$19:$I$29,M19:M29=\"Sim\")),M30))","v":4.4638157887691712},{"$f":"IF(SUM(COUNTIF($M$10:$M$16,\"Sim\")) + SUM(COUNTIF(N19:N29,\"Sim\")) < 3,\n   \"N/D (são necessários pelo menos 3 preços)\",\n   IFERROR(AVERAGE(_xlfn._xlws.FILTER($I$10:$I$16,$M$10:$M$16=\"Sim\"), _xlfn._xlws.FILTER($I$19:$I$29,N19:N29=\"Sim\")),N30))","v":4.4638157887691712},{"$f":"IF(SUM(COUNTIF($M$10:$M$16,\"Sim\")) + SUM(COUNTIF(O19:O29,\"Sim\")) < 3,\n   \"N/D (são necessários pelo menos 3 preços)\",\n   IFERROR(AVERAGE(_xlfn._xlws.FILTER($I$10:$I$16,$M$10:$M$16=\"Sim\"), _xlfn._xlws.FILTER($I$19:$I$29,O19:O29=\"Sim\")),O30))","v":4.2957894728790533},{"$f":"IF(SUM(COUNTIF($M$10:$M$16,\"Sim\")) + SUM(COUNTIF(P19:P29,\"Sim\")) < 3,\n   \"N/D (são necessários pelo menos 3 preços)\",\n   IFERROR(AVERAGE(_xlfn._xlws.FILTER($I$10:$I$16,$M$10:$M$16=\"Sim\"), _xlfn._xlws.FILTER($I$19:$I$29,P19:P29=\"Sim\")),P30))","v":4.5568751871647679},{"$f":"IF(SUM(COUNTIF($M$10:$M$16,\"Sim\")) + SUM(COUNTIF(Q19:Q29,\"Sim\")) < 3,\n   \"N/D (são necessários pelo menos 3 preços)\",\n   IFERROR(AVERAGE(_xlfn._xlws.FILTER($I$10:$I$16,$M$10:$M$16=\"Sim\"), _xlfn._xlws.FILTER($I$19:$I$29,Q19:Q29=\"Sim\")),Q30))","v":4.3763543850255617},{"$f":"IF(SUM(COUNTIF($M$10:$M$16,\"Sim\")) + SUM(COUNTIF(R19:R29,\"Sim\")) < 3,\n   \"N/D (são necessários pelo menos 3 preços)\",\n   IFERROR(AVERAGE(_xlfn._xlws.FILTER($I$10:$I$16,$M$10:$M$16=\"Sim\"), _xlfn._xlws.FILTER($I$19:$I$29,R19:R29=\"Sim\")),R30))","v":4.2153543850255621},{"$f":"IF(SUM(COUNTIF($S$10:$S$16,\"Sim\")) + SUM(COUNTIF(S19:S29,\"Sim\")) < 3,\n   \"N/D (são necessários pelo menos 3 preços)\",\n   IFERROR(AVERAGE(_xlfn._xlws.FILTER($I$10:$I$16,$S$10:$S$16=\"Sim\"), _xlfn._xlws.FILTER($I$19:$I$29,S19:S29=\"Sim\")),S30))","v":"N/D (são necessários pelo menos 3 preços)"}]
[{"$nulls":11},"Mediana",{"$f":"IF(SUM(COUNTIF($M$10:$M$16,\"Sim\")) + SUM(COUNTIF(M19:M29,\"Sim\")) < 3,\n   \"N/D (são necessários pelo menos 3 preços)\",\n   IFERROR(MEDIAN(_xlfn._xlws.FILTER($I$10:$I$16,$M$10:$M$16=\"Sim\"), _xlfn._xlws.FILTER($I$19:$I$29,M19:M29=\"Sim\")),M30))","v":4.2145706010583801},{"$f":"IF(SUM(COUNTIF($M$10:$M$16,\"Sim\")) + SUM(COUNTIF(N19:N29,\"Sim\")) < 3,\n   \"N/D (são necessários pelo menos 3 preços)\",\n   IFERROR(MEDIAN(_xlfn._xlws.FILTER($I$10:$I$16,$M$10:$M$16=\"Sim\"), _xlfn._xlws.FILTER($I$19:$I$29,N19:N29=\"Sim\")),N30))","v":4.2145706010583801},{"$f":"IF(SUM(COUNTIF($M$10:$M$16,\"Sim\")) + SUM(COUNTIF(O19:O29,\"Sim\")) < 3,\n   \"N/D (são necessários pelo menos 3 preços)\",\n   IFERROR(MEDIAN(_xlfn._xlws.FILTER($I$10:$I$16,$M$10:$M$16=\"Sim\"), _xlfn._xlws.FILTER($I$19:$I$29,O19:O29=\"Sim\")),O30))","v":4.18},{"$f":"IF(SUM(COUNTIF($M$10:$M$16,\"Sim\")) + SUM(COUNTIF(P19:P29,\"Sim\")) < 3,\n   \"N/D (são necessários pelo menos 3 preços)\",\n   IFERROR(MEDIAN(_xlfn._xlws.FILTER($I$10:$I$16,$M$10:$M$16=\"Sim\"), _xlfn._xlws.FILTER($I$19:$I$29,P19:P29=\"Sim\")),P30))","v":4.2491412021167614},{"$f":"IF(SUM(COUNTIF($M$10:$M$16,\"Sim\")) + SUM(COUNTIF(Q19:Q29,\"Sim\")) < 3,\n   \"N/D (são necessários pelo menos 3 preços)\",\n   IFERROR(MEDIAN(_xlfn._xlws.FILTER($I$10:$I$16,$M$10:$M$16=\"Sim\"), _xlfn._xlws.FILTER($I$19:$I$29,Q19:Q29=\"Sim\")),Q30))","v":4.2145706010583801},{"$f":"IF(SUM(COUNTIF($M$10:$M$16,\"Sim\")) + SUM(COUNTIF(R19:R29,\"Sim\")) < 3,\n   \"N/D (são necessários pelo menos 3 preços)\",\n   IFERROR(MEDIAN(_xlfn._xlws.FILTER($I$10:$I$16,$M$10:$M$16=\"Sim\"), _xlfn._xlws.FILTER($I$19:$I$29,R19:R29=\"Sim\")),R30))","v":4.1409239847332664},{"$f":"IF(SUM(COUNTIF($S$10:$S$16,\"Sim\")) + SUM(COUNTIF(S19:S29,\"Sim\")) < 3,\n   \"N/D (são necessários pelo menos 3 preços)\",\n   IFERROR(MEDIAN(_xlfn._xlws.FILTER($I$10:$I$16,$S$10:$S$16=\"Sim\"), _xlfn._xlws.FILTER($I$19:$I$29,S19:S29=\"Sim\")),S30))","v":"N/D (são necessários pelo menos 3 preços)"}]
[{"$nulls":11},"CV",{"$f":"IF(SUM(COUNTIF($M$10:$M$16,\"Sim\")) + SUM(COUNTIF(M19:M29,\"Sim\")) < 3,\n   \"N/D (são necessários pelo menos 3 preços)\",\n   IFERROR(ROUND(_xlfn.STDEV.S(_xlfn._xlws.FILTER($I$10:$I$16,$M$10:$M$16=\"Sim\"), _xlfn._xlws.FILTER($I$19:$I$29,M19:M29=\"Sim\")) /\n   AVERAGE(_xlfn._xlws.FILTER($I$10:$I$16,$M$10:$M$16=\"Sim\"), _xlfn._xlws.FILTER($I$19:$I$29,M19:M29=\"Sim\")),4),M32)\n)","v":0.13750000000000001},{"$f":"IF(SUM(COUNTIF($M$10:$M$16,\"Sim\")) + SUM(COUNTIF(N19:N29,\"Sim\")) < 3,\n   \"N/D (são necessários pelo menos 3 preços)\",\n   IFERROR(ROUND(_xlfn.STDEV.S(_xlfn._xlws.FILTER($I$10:$I$16,$M$10:$M$16=\"Sim\"), _xlfn._xlws.FILTER($I$19:$I$29,N19:N29=\"Sim\")) /\n   AVERAGE(_xlfn._xlws.FILTER($I$10:$I$16,$M$10:$M$16=\"Sim\"), _xlfn._xlws.FILTER($I$19:$I$29,N19:N29=\"Sim\")),4),N32)\n)","v":0.13750000000000001},{"$f":"IF(SUM(COUNTIF($M$10:$M$16,\"Sim\")) + SUM(COUNTIF(O19:O29,\"Sim\")) < 3,\n   \"N/D (são necessários pelo menos 3 preços)\",\n   IFERROR(ROUND(_xlfn.STDEV.S(_xlfn._xlws.FILTER($I$10:$I$16,$M$10:$M$16=\"Sim\"), _xlfn._xlws.FILTER($I$19:$I$29,O19:O29=\"Sim\")) /\n   AVERAGE(_xlfn._xlws.FILTER($I$10:$I$16,$M$10:$M$16=\"Sim\"), _xlfn._xlws.FILTER($I$19:$I$29,O19:O29=\"Sim\")),4),O32)\n)","v":9.7600000000000006E-2},{"$f":"IF(SUM(COUNTIF($M$10:$M$16,\"Sim\")) + SUM(COUNTIF(P19:P29,\"Sim\")) < 3,\n   \"N/D (são necessários pelo menos 3 preços)\",\n   IFERROR(ROUND(_xlfn.STDEV.S(_xlfn._xlws.FILTER($I$10:$I$16,$M$10:$M$16=\"Sim\"), _xlfn._xlws.FILTER($I$19:$I$29,P19:P29=\"Sim\")) /\n   AVERAGE(_xlfn._xlws.FILTER($I$10:$I$16,$M$10:$M$16=\"Sim\"), _xlfn._xlws.FILTER($I$19:$I$29,P19:P29=\"Sim\")),4),P32)\n)","v":0.13139999999999999},{"$f":"IF(SUM(COUNTIF($M$10:$M$16,\"Sim\")) + SUM(COUNTIF(Q19:Q29,\"Sim\")) < 3,\n   \"N/D (são necessários pelo menos 3 preços)\",\n   IFERROR(ROUND(_xlfn.STDEV.S(_xlfn._xlws.FILTER($I$10:$I$16,$M$10:$M$16=\"Sim\"), _xlfn._xlws.FILTER($I$19:$I$29,Q19:Q29=\"Sim\")) /\n   AVERAGE(_xlfn._xlws.FILTER($I$10:$I$16,$M$10:$M$16=\"Sim\"), _xlfn._xlws.FILTER($I$19:$I$29,Q19:Q29=\"Sim\")),4),Q32)\n)","v":9.0399999999999994E-2},{"$f":"IF(SUM(COUNTIF($M$10:$M$16,\"Sim\")) + SUM(COUNTIF(R19:R29,\"Sim\")) < 3,\n   \"N/D (são necessários pelo menos 3 preços)\",\n   IFERROR(ROUND(_xlfn.STDEV.S(_xlfn._xlws.FILTER($I$10:$I$16,$M$10:$M$16=\"Sim\"), _xlfn._xlws.FILTER($I$19:$I$29,R19:R29=\"Sim\")) /\n   AVERAGE(_xlfn._xlws.FILTER($I$10:$I$16,$M$10:$M$16=\"Sim\"), _xlfn._xlws.FILTER($I$19:$I$29,R19:R29=\"Sim\")),4),R32)\n)","v":9.3899999999999997E-2},{"$f":"IF(SUM(COUNTIF($S$10:$S$16,\"Sim\")) + SUM(COUNTIF(S19:S29,\"Sim\")) < 3,\n   \"N/D (são necessários pelo menos 3 preços)\",\n   IFERROR(_xlfn.STDEV.S(_xlfn._xlws.FILTER($I$10:$I$16,$S$10:$S$16=\"Sim\"), _xlfn._xlws.FILTER($I$19:$I$29,S19:S29=\"Sim\")) /\n   AVERAGE(_xlfn._xlws.FILTER($I$10:$I$16,$S$10:$S$16=\"Sim\"), _xlfn._xlws.FILTER($I$19:$I$29,S19:S29=\"Sim\")),S32)\n)","v":"N/D (são necessários pelo menos 3 preços)"}]
[null,"PREÇO UNITÁRIO ESTIMADO ADOTADO:",{"$nulls":7},{"$f":"IF($J$33=\"\",\"Selecione metodologia para exclusão de preços\",MIN(J31:J32))","v":4.2145706010583801},null,"Metodologia sugerida:",{"$f":"IF($M$35=MIN($M$35,$N$35:$R$35),M8,\"Grupos - \"&INDEX({\"Todos\";\"Sem o maior\";\"Sem o menor\";\"Sem o maior e Sem o menor\";\"Sem os dois maiores\"},MATCH(MIN($N$35:$R$35),$N$35:$R$35,0)))","v":"Grupos - Sem o maior e Sem o menor"}]
[{"$nulls":11},"Preço estimado sugerido:",{"$f":"IF($M$36=M8,SMALL($M$33:$M$34,1),MIN(INDEX($N$34:$R$34, MATCH(MIN($N$35:$R$35), $N$35:$R$35, 0)),INDEX($N$33:$R$33, MATCH(MIN($N$35:$R$35), $N$35:$R$35, 0))))","v":4.2145706010583801}]
[{"$nulls":11},"Metodologia a adotar:",{"$f":"IF(INDEX(L18:S18,N38)=0,\"\",INDEX(L18:S18,N38))","v":""},1]

{"sheet":"Peixe 32% 3 a 5 mm","index":5,"n_rows":38,"n_cols":21,"rows_kept":38,"cut":false,"hidden":false,"merged":[[15,12,15,17],[6,2,6,5],[6,12,6,18],[7,1,7,9],[7,12,7,18],[8,12,8,17],[9,12,9,17],[10,12,10,17],[11,12,11,17],[12,12,12,17],[13,12,13,17],[14,12,14,17],[26,1,26,6],[16,1,16,9],[16,12,16,18],[17,1,17,6],[18,1,18,6],[19,1,19,6],[20,1,20,6],[21,1,21,6],[22,1,22,6],[23,1,23,6],[24,1,24,6],[25,1,25,6],[35,12,35,18],[36,12,36,18],[27,1,27,6],[28,1,28,6],[29,1,31,7],[32,1,34,8],[32,9,34,9],[35,1,37,8],[35,9,37,9]]}
[]
[null,"Processo",{"$f":"'Peixe 50% PB Farelo'!C2","v":"59511.000102/2026-55"}]
[null,"Responsável",{"$f":"'Peixe 50% PB Farelo'!C3","v":"JHONES DE LIMA VIEIRA"}]
[null,"Área de Origem",{"$f":"'Peixe 50% PB Farelo'!C4","v":"14ª GTR"}]
[null,"Data da pesquisa",{"$f":"'Peixe 50% PB Farelo'!C5","v":"Janeiro/2026 - Fevereiro/2026"}]
[]
[null,"ITEM:","Ração extrusada para peixe onívoro 32% PB – Proteína Bruta Mín.: 32%, granulometria 3 a 5 mm. Data de validade não inferior a 6 meses.",null,null,null,"UNIDADE DE MEDIDA:",{"$f":"'Peixe 50% PB Farelo'!H7","v":"kg"},"QUANTIDADE:",75000,null,null,"Tabela auxiliar de metodologias para exclusão de preços",{"$nulls":7},"Automática (menor CV)"]
[null,"LICITAÇÕES ANTERIORES",{"$nulls":10},"Licitações Anteriores - Outliers",{"$nulls":7},{"$f":"M18","v":"Outliers"}]
[null,"Órgão","Edital/Ano - Nº do Lote / Item","Quantidade","Valor Unitário","Data","índice de atualização (nome)","Variação acumulada do índice (%)","Preço unitário atualizado","Utilizar?  (Sim/Não)",null,null,"Utilizar?",{"$nulls":5},"Por critério do(a) analista",null,{"$f":"N18","v":"Grupos - Todos"}]
[null,"14ª SR - Fortaleza/CE","Edital 90007/2024 - Item 6",37262,3.3,"2025-01-02","IPA-EP-DI Suprimentos agropecuários",{"$f":"(I10/E10)-1","v":1.6540957444201254E-2},{"$f":"IF(ISBLANK(E10),\"\",E10*(1+(INDEX('índice de atualização'!B:B,MATCH(G10,'índice de atualização'!B:B,0)+COUNTA('índice de atualização'!B:B)-1)-INDEX('índice de atualização'!B:B,MATCH(TEXT(F10,\"MM/AAAA\"),'índice de atualização'!A:A,0)))/INDEX('índice de atualização'!B:B,MATCH(TEXT(F10,\"MM/AAAA\"),'índice de atualização'!A:A,0))))","v":3.3545851595658638},{"$f":"IF(ISNUMBER(I10),IF($J$33<>$S$9,M10,S10),\"\")","v":"Sim"},null,null,{"$f":"IF(ISNUMBER(I10),IF(OR(I10<_xlfn.QUARTILE.INC($I$10:$I$29,1)-1.5*(_xlfn.QUARTILE.INC($I$10:I29,3)-_xlfn.QUARTILE.INC($I$10:$I$29,1)),I10>_xlfn.QUARTILE.INC($I$10:$I$29,3)+1.5*(_xlfn.QUARTILE.INC($I$10:$I$29,3)-_xlfn.QUARTILE.INC($I$10:$I$29,1))),\"Não\",\"Sim\"),\"\")","v":"Sim"},{"$nulls":7},{"$f":"O18","v":"Grupos - Sem o maior"}]
[null,"14ª SR - Fortaleza/CE","Edital 90007/2024 - Item 14",6550,3.38,"2025-02-18","IPA-EP-DI Suprimentos agropecuários",{"$f":"(I11/E11)-1","v":4.5072426012993105E-4},{"$f":"IF(ISBLANK(E11),\"\",E11*(1+(INDEX('índice de atualização'!B:B,MATCH(G11,'índice de atualização'!B:B,0)+COUNTA('índice de atualização'!B:B)-1)-INDEX('índice de atualização'!B:B,MATCH(TEXT(F11,\"MM/AAAA\"),'índice de atualização'!A:A,0)))/INDEX('índice de atualização'!B:B,MATCH(TEXT(F11,\"MM/AAAA\"),'índice de atualização'!A:A,0))))","v":3.3815234479992391},{"$f":"IF(ISNUMBER(I11),IF($J$33<>$S$8,M11,S11),\"\")","v":"Sim"},null,null,{"$f":"IF(ISNUMBER(I11),IF(OR(I11<_xlfn.QUARTILE.INC($I$10:$I$29,1)-1.5*(_xlfn.QUARTILE.INC($I$10:I30,3)-_xlfn.QUARTILE.INC($I$10:$I$29,1)),I11>_xlfn.QUARTILE.INC($I$10:$I$29,3)+1.5*(_xlfn.QUARTILE.INC($I$10:$I$29,3)-_xlfn.QUARTILE.INC($I$10:$I$29,1))),\"Não\",\"Sim\"),\"\")","v":"Sim"},{"$nulls":7},{"$f":"P18","v":"Grupos - Sem o menor"}]
[{"$nulls":9},"",null,null,{"$f":"IF(ISNUMBER(I12),IF(OR(I12<_xlfn.QUARTILE.INC($I$10:$I$29,1)-1.5*(_xlfn.QUARTILE.INC($I$10:I31,3)-_xlfn.QUARTILE.INC($I$10:$I$29,1)),I12>_xlfn.QUARTILE.INC($I$10:$I$29,3)+1.5*(_xlfn.QUARTILE.INC($I$10:$I$29,3)-_xlfn.QUARTILE.INC($I$10:$I$29,1))),\"Não\",\"Sim\"),\"\")","v":""},{"$f":"$M$12","v":""},{"$f":"$M$12","v":""},{"$f":"$M$12","v":""},{"$f":"$M$12","v":""},{"$f":"$M$12","v":""},null,null,{"$f":"Q18","v":"Grupos - Sem o maior e sem o menor"}]
[{"$nulls":9},"",null,null,{"$f":"IF(ISNUMBER(I13),IF(OR(I13<_xlfn.QUARTILE.INC($I$10:$I$29,1)-1.5*(_xlfn.QUARTILE.INC($I$10:I32,3)-_xlfn.QUARTILE.INC($I$10:$I$29,1)),I13>_xlfn.QUARTILE.INC($I$10:$I$29,3)+1.5*(_xlfn.QUARTILE.INC($I$10:$I$29,3)-_xlfn.QUARTILE.INC($I$10:$I$29,1))),\"Não\",\"Sim\"),\"\")","v":""},{"$f":"$M$13","v":""},{"$f":"$M$13","v":""},{"$f":"$M$13","v":""},{"$f":"$M$13","v":""},{"$f":"$M$13","v":""},null,null,{"$f":"R18","v":"Grupos - Sem os dois maiores"}]
[{"$nulls":9},"",null,null,{"$f":"IF(ISNUMBER(I14),IF(OR(I14<_xlfn.QUARTILE.INC($I$10:$I$29,1)-1.5*(_xlfn.QUARTILE.INC($I$10:I33,3)-_xlfn.QUARTILE.INC($I$10:$I$29,1)),I14>_xlfn.QUARTILE.INC($I$10:$I$29,3)+1.5*(_xlfn.QUARTILE.INC($I$10:$I$29,3)-_xlfn.QUARTILE.INC($I$10:$I$29,1))),\"Não\",\"Sim\"),\"\")","v":""},{"$f":"$M$14","v":""},{"$f":"$M$14","v":""},{"$f":"$M$14","v":""},{"$f":"$M$14","v":""},{"$f":"$M$14","v":""},null,null,{"$f":"S18","v":"Por critério do(a) analista"}]
[{"$nulls":9},"",null,null,{"$f":"IF(ISNUMBER(I15),IF(OR(I15<_xlfn.QUARTILE.INC($I$10:$I$29,1)-1.5*(_xlfn.QUARTILE.INC($I$10:I36,3)-_xlfn.QUARTILE.INC($I$10:$I$29,1)),I15>_xlfn.QUARTILE.INC($I$10:$I$29,3)+1.5*(_xlfn.QUARTILE.INC($I$10:$I$29,3)-_xlfn.QUARTILE.INC($I$10:$I$29,1))),\"Não\",\"Sim\"),\"\")","v":""},{"$f":"$M$15","v":""},{"$f":"$M$15","v":""},{"$f":"$M$15","v":""},{"$f":"$M$15","v":""},{"$f":"$M$15","v":""}]
[{"$nulls":9},"",null,null,{"$f":"IF(ISNUMBER(I16),IF(OR(I16<_xlfn.QUARTILE.INC($I$10:$I$29,1)-1.5*(_xlfn.QUARTILE.INC($I$10:I39,3)-_xlfn.QUARTILE.INC($I$10:$I$29,1)),I16>_xlfn.QUARTILE.INC($I$10:$I$29,3)+1.5*(_xlfn.QUARTILE.INC($I$10:$I$29,3)-_xlfn.QUARTILE.INC($I$10:$I$29,1))),\"Não\",\"Sim\"),\"\")","v":""},{"$f":"$M$16","v":""},{"$f":"$M$16","v":""},{"$f":"$M$16","v":""},{"$f":"$M$16","v":""},{"$f":"$M$16","v":""}]
[null,"COTAÇÕES DE MERCADO",{"$nulls":10},"Cotações"]
[null,"Empresa",{"$nulls":5},"Data","Preço Unitário","Utilizar? (Sim/Não)",null,null,"Outliers","Grupos - Todos","Grupos - Sem o maior","Grupos - Sem o menor","Grupos - Sem o maior e sem o menor","Grupos - Sem os dois maiores","Por critério do(a) analista"]
[null,"Agrosolo - Guabi",{"$nulls":5},"2026-02-10",{"$f":"102.8/25","v":4.1120000000000001},{"$f":"IF(ISNUMBER(I19),IF($J$33=$M$18,M19,IF($J$33=$N$18,N19,IF($J$33=$O$18,O19,IF($J$33=$P$18,P19,IF($J$33=$Q$18,Q19,IF($J$33=$R$18,R19,IF($J$33=$S$18,S19,\"\"))))))),\"\")","v":"Não"},null,null,{"$f":"IF(ISNUMBER(I19),IF(OR(I19<_xlfn.QUARTILE.INC($I$10:$I$29,1)-1.5*(_xlfn.QUARTILE.INC($I$10:I40,3)-_xlfn.QUARTILE.INC($I$10:$I$29,1)),I19>_xlfn.QUARTILE.INC($I$10:$I$29,3)+1.5*(_xlfn.QUARTILE.INC($I$10:$I$29,3)-_xlfn.QUARTILE.INC($I$10:$I$29,1))),\"Não\",\"Sim\"),\"\")","v":"Sim"},{"$f":"IF(ISNUMBER(I19),\"Sim\",\"\")","v":"Sim"},{"$f":"IF(ISNUMBER(I19),IF(_xlfn.RANK.EQ(I19,$I$19:$I$29)=1,\"Não\",\"Sim\"),\"\")","v":"Sim"},{"$f":"IF(ISNUMBER(I19),IF(_xlfn.RANK.EQ(I19,$I$19:$I$29)=COUNT($I$19:$I$29),\"Não\",\"Sim\"),\"\")","v":"Sim"},{"$f":"IF(O19=\"\",\"\",IF(AND(O19=\"Sim\",P19=\"Sim\"),\"Sim\",\"Não\"))","v":"Sim"},{"$f":"IF(ISNUMBER(I19),IF(_xlfn.RANK.EQ(I19,$I$19:$I$29)<=2,\"Não\",\"Sim\"),\"\")","v":"Não"}]
[null,"Samaria Rações LTDA",{"$nulls":5},"2026-02-09",{"$f":"82.5/25","v":3.3},"Sim",null,null,{"$f":"IF(ISNUMBER(I20),IF(OR(I20<_xlfn.QUARTILE.INC($I$10:$I$29,1)-1.5*(_xlfn.QUARTILE.INC($I$10:I40,3)-_xlfn.QUARTILE.INC($I$10:$I$29,1)),I20>_xlfn.QUARTILE.INC($I$10:$I$29,3)+1.5*(_xlfn.QUARTILE.INC($I$10:$I$29,3)-_xlfn.QUARTILE.INC($I$10:$I$29,1))),\"Não\",\"Sim\"),\"\")","v":"Sim"},"Sim","Sim","Não",{"$f":"IF(O20=\"\",\"\",IF(AND(O20=\"Sim\",P20=\"Sim\"),\"Sim\",\"Não\"))","v":"Não"},"Sim"]
[null,"Integral Mix Agroindustria",{"$nulls":5},"2026-02-07",{"$f":"95.31/25","v":3.8124000000000002},"Sim",null,null,{"$f":"IF(ISNUMBER(I21),IF(OR(I21<_xlfn.QUARTILE.INC($I$10:$I$29,1)-1.5*(_xlfn.QUARTILE.INC($I$10:I40,3)-_xlfn.QUARTILE.INC($I$10:$I$29,1)),I21>_xlfn.QUARTILE.INC($I$10:$I$29,3)+1.5*(_xlfn.QUARTILE.INC($I$10:$I$29,3)-_xlfn.QUARTILE.INC($I$10:$I$29,1))),\"Não\",\"Sim\"),\"\")","v":"Sim"},"Sim","Sim","Sim","Sim","Sim"]
[null,"Comercial do Carmo ME",{"$nulls":5},"2026-02-12",{"$f":"111/25","v":4.4400000000000004},"Não",null,null,{"$f":"IF(ISNUMBER(I22),IF(OR(I22<_xlfn.QUARTILE.INC($I$10:$I$29,1)-1.5*(_xlfn.QUARTILE.INC($I$10:I40,3)-_xlfn.QUARTILE.INC($I$10:$I$29,1)),I22>_xlfn.QUARTILE.INC($I$10:$I$29,3)+1.5*(_xlfn.QUARTILE.INC($I$10:$I$29,3)-_xlfn.QUARTILE.INC($I$10:$I$29,1))),\"Não\",\"Sim\"),\"\")","v":"Sim"},"Sim","Não","Sim","Não","Não"]
[{"$nulls":9},"",null,null,{"$f":"IF(ISNUMBER(I23),IF(OR(I23<_xlfn.QUARTILE.INC($I$10:$I$29,1)-1.5*(_xlfn.QUARTILE.INC($I$10:I41,3)-_xlfn.QUARTILE.INC($I$10:$I$29,1)),I23>_xlfn.QUARTILE.INC($I$10:$I$29,3)+1.5*(_xlfn.QUARTILE.INC($I$10:$I$29,3)-_xlfn.QUARTILE.INC($I$10:$I$29,1))),\"Não\",\"Sim\"),\"\")","v":""},"","","","",""]
[{"$nulls":9},"",null,null,{"$f":"IF(ISNUMBER(I24),IF(OR(I24<_xlfn.QUARTILE.INC($I$10:$I$29,1)-1.5*(_xlfn.QUARTILE.INC($I$10:I42,3)-_xlfn.QUARTILE.INC($I$10:$I$29,1)),I24>_xlfn.QUARTILE.INC($I$10:$I$29,3)+1.5*(_xlfn.QUARTILE.INC($I$10:$I$29,3)-_xlfn.QUARTILE.INC($I$10:$I$29,1))),\"Não\",\"Sim\"),\"\")","v":""},"","","","",""]
[{"$nulls":9},"",null,null,{"$f":"IF(ISNUMBER(I25),IF(OR(I25<_xlfn.QUARTILE.INC($I$10:$I$29,1)-1.5*(_xlfn.QUARTILE.INC($I$10:I40,3)-_xlfn.QUARTILE.INC($I$10:$I$29,1)),I25>_xlfn.QUARTILE.INC($I$10:$I$29,3)+1.5*(_xlfn.QUARTILE.INC($I$10:$I$29,3)-_xlfn.QUARTILE.INC($I$10:$I$29,1))),\"Não\",\"Sim\"),\"\")","v":""},"","","","",""]
[{"$nulls":9},"",null,null,{"$f":"IF(ISNUMBER(I26),IF(OR(I26<_xlfn.QUARTILE.INC($I$10:$I$29,1)-1.5*(_xlfn.QUARTILE.INC($I$10:I40,3)-_xlfn.QUARTILE.INC($I$10:$I$29,1)),I26>_xlfn.QUARTILE.INC($I$10:$I$29,3)+1.5*(_xlfn.QUARTILE.INC($I$10:$I$29,3)-_xlfn.QUARTILE.INC($I$10:$I$29,1))),\"Não\",\"Sim\"),\"\")","v":""},"","","","",""]
[{"$nulls":9},"",null,null,{"$f":"IF(ISNUMBER(I27),IF(OR(I27<_xlfn.QUARTILE.INC($I$10:$I$29,1)-1.5*(_xlfn.QUARTILE.INC($I$10:I40,3)-_xlfn.QUARTILE.INC($I$10:$I$29,1)),I27>_xlfn.QUARTILE.INC($I$10:$I$29,3)+1.5*(_xlfn.QUARTILE.INC($I$10:$I$29,3)-_xlfn.QUARTILE.INC($I$10:$I$29,1))),\"Não\",\"Sim\"),\"\")","v":""},"","","","",""]
[{"$nulls":9},"",null,null,{"$f":"IF(ISNUMBER(I28),IF(OR(I28<_xlfn.QUARTILE.INC($I$10:$I$29,1)-1.5*(_xlfn.QUARTILE.INC($I$10:I40,3)-_xlfn.QUARTILE.INC($I$10:$I$29,1)),I28>_xlfn.QUARTILE.INC($I$10:$I$29,3)+1.5*(_xlfn.QUARTILE.INC($I$10:$I$29,3)-_xlfn.QUARTILE.INC($I$10:$I$29,1))),\"Não\",\"Sim\"),\"\")","v":""},"","","","",""]
[{"$nulls":9},"",null,null,{"$f":"IF(ISNUMBER(I29),IF(OR(I29<_xlfn.QUARTILE.INC($I$10:$I$29,1)-1.5*(_xlfn.QUARTILE.INC($I$10:I40,3)-_xlfn.QUARTILE.INC($I$10:$I$29,1)),I29>_xlfn.QUARTILE.INC($I$10:$I$29,3)+1.5*(_xlfn.QUARTILE.INC($I$10:$I$29,3)-_xlfn.QUARTILE.INC($I$10:$I$29,1))),\"Não\",\"Sim\"),\"\")","v":""},"","","","",""]
[null,"Observações:",{"$nulls":6},"CV:",{"$f":"IF($J$33=\"\",\"Selecione metodologia para exclusão de preços\",IF(COUNTIF($J$10:$J$29,\"Sim\")<3,\"N/D (são necessários pelo menos 3 preços)\",_xlfn.STDEV.S(IF($J$10:$J$29=\"Sim\",$I$10:$I$29))/AVERAGE(IF($J$10:$J$29=\"Sim\",$I$10:$I$29))))","v":6.8156090934036073E-2},null,"Média (Cotações)",{"$f":"IF(COUNTIF(M19:M29,\"Sim\")<3,\"N/D (são necessários pelo menos 3 preços)\",AVERAGE(IF(M19:M29=\"Sim\",$I19:$I29)))","v":3.9161000000000001},{"$f":"IF(COUNTIF(N19:N29,\"Sim\")<3,\"N/D (são necessários pelo menos 3 preços)\",AVERAGE(IF(N19:N29=\"Sim\",$I19:$I29)))","v":3.9161000000000001},{"$f":"IF(COUNTIF(O19:O29,\"Sim\")<3,\"N/D (são necessários pelo menos 3 preços)\",AVERAGE(IF(O19:O29=\"Sim\",$I19:$I29)))","v":3.7414666666666663},{"$f":"IF(COUNTIF(P19:P29,\"Sim\")<3,\"N/D (são necessários pelo menos 3 preços)\",AVERAGE(IF(P19:P29=\"Sim\",$I19:$I29)))","v":4.1214666666666666},{"$f":"IF(COUNTIF(Q19:Q29,\"Sim\")<3,\"N/D (são necessários pelo menos 3 preços)\",AVERAGE(IF(Q19:Q29=\"Sim\",$I19:$I29)))","v":"N/D (são necessários pelo menos 3 preços)"},{"$f":"IF(COUNTIF(R19:R29,\"Sim\")<3,\"N/D (são necessários pelo menos 3 preços)\",AVERAGE(IF(R19:R29=\"Sim\",$I19:$I29)))","v":"N/D (são necessários pelo menos 3 preços)"},{"$f":"IF(COUNTIF(S19:S29,\"Sim\")<3,\"N/D (são necessários pelo menos 3 preços)\",AVERAGE(IF(S19:S29=\"Sim\",$I19:$I29)))","v":"N/D (são necessários pelo menos 3 preços)"}]
[{"$nulls":8},"Média:",{"$f":"IF($J$33=\"\",\"Selecione metodologia para exclusão de preços\",AVERAGE(IF($J$10:$J$29=\"Sim\",$I$10:$I$29)))","v":3.4621271518912757},null,"Mediana (Cotações)",{"$f":"IF(COUNTIF(M19:M29,\"Sim\")<3,\"N/D (são necessários pelo menos 3 preços)\",MEDIAN(IF(M19:M29=\"Sim\",$I19:$I29)))","v":3.9622000000000002},{"$f":"IF(COUNTIF(N19:N29,\"Sim\")<3,\"N/D (são necessários pelo menos 3 preços)\",MEDIAN(IF(N19:N29=\"Sim\",$I19:$I29)))","v":3.9622000000000002},{"$f":"IF(COUNTIF(O19:O29,\"Sim\")<3,\"N/D (são necessários pelo menos 3 preços)\",MEDIAN(IF(O19:O29=\"Sim\",$I19:$I29)))","v":3.8124000000000002},{"$f":"IF(COUNTIF(P19:P29,\"Sim\")<3,\"N/D (são necessários pelo menos 3 preços)\",MEDIAN(IF(P19:P29=\"Sim\",$I19:$I29)))","v":4.1120000000000001},{"$f":"IF(COUNTIF(Q19:Q29,\"Sim\")<3,\"N/D (são necessários pelo menos 3 preços)\",MEDIAN(IF(Q19:Q29=\"Sim\",$I19:$I29)))","v":"N/D (são necessários pelo menos 3 preços)"},{"$f":"IF(COUNTIF(R19:R29,\"Sim\")<3,\"N/D (são necessários pelo menos 3 preços)\",MEDIAN(IF(R19:R29=\"Sim\",$I19:$I29)))","v":"N/D (são necessários pelo menos 3 preços)"},{"$f":"IF(COUNTIF(S19:S29,\"Sim\")<3,\"N/D (são necessários pelo menos 3 preços)\",MEDIAN(IF(S19:S29=\"Sim\",$I19:$I29)))","v":"N/D (são necessários pelo menos 3 preços)"}]
[{"$nulls":8},"Mediana:",{"$f":"IF($J$33=\"\",\"Selecione metodologia para exclusão de preços\",MEDIAN(IF($J$10:$J$29=\"Sim\",$I$10:$I$29)))","v":3.3680543037825514},null,"CV (Cotações)",{"$f":"IF(COUNTIF(M19:M29,\"Sim\")<3,\"N/D (são necessários pelo menos 3 preços)\",_xlfn.STDEV.S(IF(M19:M29=\"Sim\",$I19:$I29))/AVERAGE(IF(M19:M29=\"Sim\",$I19:$I29)))","v":0.12362865330364263},{"$f":"IF(COUNTIF(N19:N29,\"Sim\")<3,\"N/D (são necessários pelo menos 3 preços)\",_xlfn.STDEV.S(IF(N19:N29=\"Sim\",$I19:$I29))/AVERAGE(IF(N19:N29=\"Sim\",$I19:$I29)))","v":0.12362865330364263},{"$f":"IF(COUNTIF(O19:O29,\"Sim\")<3,\"N/D (são necessários pelo menos 3 preços)\",_xlfn.STDEV.S(IF(O19:O29=\"Sim\",$I19:$I29))/AVERAGE(IF(O19:O29=\"Sim\",$I19:$I29)))","v":0.10974868805639987},{"$f":"IF(COUNTIF(P19:P29,\"Sim\")<3,\"N/D (são necessários pelo menos 3 preços)\",_xlfn.STDEV.S(IF(P19:P29=\"Sim\",$I19:$I29))/AVERAGE(IF(P19:P29=\"Sim\",$I19:$I29)))","v":7.6163924867955188E-2},{"$f":"IF(COUNTIF(Q19:Q29,\"Sim\")<3,\"N/D (são necessários pelo menos 3 preços)\",_xlfn.STDEV.S(IF(Q19:Q29=\"Sim\",$I19:$I29))/AVERAGE(IF(Q19:Q29=\"Sim\",$I19:$I29)))","v":"N/D (são necessários pelo menos 3 preços)"},{"$f":"IF(COUNTIF(R19:R29,\"Sim\")<3,\"N/D (são necessários pelo menos 3 preços)\",_xlfn.STDEV.S(IF(R19:R29=\"Sim\",$I19:$I29))/AVERAGE(IF(R19:R29=\"Sim\",$I19:$I29)))","v":"N/D (são necessários pelo menos 3 preços)"},{"$f":"IF(COUNTIF(S19:S29,\"Sim\")<3,\"N/D (são necessários pelo menos 3 preços)\",_xlfn.STDEV.S(IF(S19:S29=\"Sim\",$I19:$I29))/AVERAGE(IF(S19:S29=\"Sim\",$I19:$I29)))","v":"N/D (são necessários pelo menos 3 preços)"}]
[null,"Metodologia de exclusão de preços adotada:",{"$nulls":7},{"$f":"IF(M38=\"\",INDEX(M18:S18,MATCH(MIN(M35:S35),M35:S35,0)),M38)","v":"Grupos - Sem os dois maiores"},null,"Média",{"$f":"IF(SUM(COUNTIF($M$10:$M$16,\"Sim\")) + SUM(COUNTIF(M19:M29,\"Sim\")) < 3,\n   \"N/D (são necessários pelo menos 3 preços)\",\n   IFERROR(AVERAGE(_xlfn._xlws.FILTER($I$10:$I$16,$M$10:$M$16=\"Sim\"), _xlfn._xlws.FILTER($I$19:$I$29,M19:M29=\"Sim\")),M30))","v":3.7334181012608507},{"$f":"IF(SUM(COUNTIF($M$10:$M$16,\"Sim\")) + SUM(COUNTIF(N19:N29,\"Sim\")) < 3,\n   \"N/D (são necessários pelo menos 3 preços)\",\n   IFERROR(AVERAGE(_xlfn._xlws.FILTER($I$10:$I$16,$M$10:$M$16=\"Sim\"), _xlfn._xlws.FILTER($I$19:$I$29,N19:N29=\"Sim\")),N30))","v":3.7334181012608507},{"$f":"IF(SUM(COUNTIF($M$10:$M$16,\"Sim\")) + SUM(COUNTIF(O19:O29,\"Sim\")) < 3,\n   \"N/D (são necessários pelo menos 3 preços)\",\n   IFERROR(AVERAGE(_xlfn._xlws.FILTER($I$10:$I$16,$M$10:$M$16=\"Sim\"), _xlfn._xlws.FILTER($I$19:$I$29,O19:O29=\"Sim\")),O30))","v":3.5921017215130204},{"$f":"IF(SUM(COUNTIF($M$10:$M$16,\"Sim\")) + SUM(COUNTIF(P19:P29,\"Sim\")) < 3,\n   \"N/D (são necessários pelo menos 3 preços)\",\n   IFERROR(AVERAGE(_xlfn._xlws.FILTER($I$10:$I$16,$M$10:$M$16=\"Sim\"), _xlfn._xlws.FILTER($I$19:$I$29,P19:P29=\"Sim\")),P30))","v":3.8201017215130206},{"$f":"IF(SUM(COUNTIF($M$10:$M$16,\"Sim\")) + SUM(COUNTIF(Q19:Q29,\"Sim\")) < 3,\n   \"N/D (são necessários pelo menos 3 preços)\",\n   IFERROR(AVERAGE(_xlfn._xlws.FILTER($I$10:$I$16,$M$10:$M$16=\"Sim\"), _xlfn._xlws.FILTER($I$19:$I$29,Q19:Q29=\"Sim\")),Q30))","v":3.6651271518912756},{"$f":"IF(SUM(COUNTIF($M$10:$M$16,\"Sim\")) + SUM(COUNTIF(R19:R29,\"Sim\")) < 3,\n   \"N/D (são necessários pelo menos 3 preços)\",\n   IFERROR(AVERAGE(_xlfn._xlws.FILTER($I$10:$I$16,$M$10:$M$16=\"Sim\"), _xlfn._xlws.FILTER($I$19:$I$29,R19:R29=\"Sim\")),R30))","v":3.4621271518912757},{"$f":"IF(SUM(COUNTIF($S$10:$S$16,\"Sim\")) + SUM(COUNTIF(S19:S29,\"Sim\")) < 3,\n   \"N/D (são necessários pelo menos 3 preços)\",\n   IFERROR(AVERAGE(_xlfn._xlws.FILTER($I$10:$I$16,$S$10:$S$16=\"Sim\"), _xlfn._xlws.FILTER($I$19:$I$29,S19:S29=\"Sim\")),S30))","v":"N/D (são necessários pelo menos 3 preços)"}]
[{"$nulls":11},"Mediana",{"$f":"IF(SUM(COUNTIF($M$10:$M$16,\"Sim\")) + SUM(COUNTIF(M19:M29,\"Sim\")) < 3,\n   \"N/D (são necessários pelo menos 3 preços)\",\n   IFERROR(MEDIAN(_xlfn._xlws.FILTER($I$10:$I$16,$M$10:$M$16=\"Sim\"), _xlfn._xlws.FILTER($I$19:$I$29,M19:M29=\"Sim\")),M30))","v":3.5969617239996197},{"$f":"IF(SUM(COUNTIF($M$10:$M$16,\"Sim\")) + SUM(COUNTIF(N19:N29,\"Sim\")) < 3,\n   \"N/D (são necessários pelo menos 3 preços)\",\n   IFERROR(MEDIAN(_xlfn._xlws.FILTER($I$10:$I$16,$M$10:$M$16=\"Sim\"), _xlfn._xlws.FILTER($I$19:$I$29,N19:N29=\"Sim\")),N30))","v":3.5969617239996197},{"$f":"IF(SUM(COUNTIF($M$10:$M$16,\"Sim\")) + SUM(COUNTIF(O19:O29,\"Sim\")) < 3,\n   \"N/D (são necessários pelo menos 3 preços)\",\n   IFERROR(MEDIAN(_xlfn._xlws.FILTER($I$10:$I$16,$M$10:$M$16=\"Sim\"), _xlfn._xlws.FILTER($I$19:$I$29,O19:O29=\"Sim\")),O30))","v":3.3815234479992391},{"$f":"IF(SUM(COUNTIF($M$10:$M$16,\"Sim\")) + SUM(COUNTIF(P19:P29,\"Sim\")) < 3,\n   \"N/D (são necessários pelo menos 3 preços)\",\n   IFERROR(MEDIAN(_xlfn._xlws.FILTER($I$10:$I$16,$M$10:$M$16=\"Sim\"), _xlfn._xlws.FILTER($I$19:$I$29,P19:P29=\"Sim\")),P30))","v":3.8124000000000002},{"$f":"IF(SUM(COUNTIF($M$10:$M$16,\"Sim\")) + SUM(COUNTIF(Q19:Q29,\"Sim\")) < 3,\n   \"N/D (são necessários pelo menos 3 preços)\",\n   IFERROR(MEDIAN(_xlfn._xlws.FILTER($I$10:$I$16,$M$10:$M$16=\"Sim\"), _xlfn._xlws.FILTER($I$19:$I$29,Q19:Q29=\"Sim\")),Q30))","v":3.5969617239996197},{"$f":"IF(SUM(COUNTIF($M$10:$M$16,\"Sim\")) + SUM(COUNTIF(R19:R29,\"Sim\")) < 3,\n   \"N/D (são necessários pelo menos 3 preços)\",\n   IFERROR(MEDIAN(_xlfn._xlws.FILTER($I$10:$I$16,$M$10:$M$16=\"Sim\"), _xlfn._xlws.FILTER($I$19:$I$29,R19:R29=\"Sim\")),R30))","v":3.3680543037825514},{"$f":"IF(SUM(COUNTIF($S$10:$S$16,\"Sim\")) + SUM(COUNTIF(S19:S29,\"Sim\")) < 3,\n   \"N/D (são necessários pelo menos 3 preços)\",\n   IFERROR(MEDIAN(_xlfn._xlws.FILTER($I$10:$I$16,$S$10:$S$16=\"Sim\"), _xlfn._xlws.FILTER($I$19:$I$29,S19:S29=\"Sim\")),S30))","v":"N/D (são necessários pelo menos 3 preços)"}]
[{"$nulls":11},"CV",{"$f":"IF(SUM(COUNTIF($M$10:$M$16,\"Sim\")) + SUM(COUNTIF(M19:M29,\"Sim\")) < 3,\n   \"N/D (são necessários pelo menos 3 preços)\",\n   IFERROR(ROUND(_xlfn.STDEV.S(_xlfn._xlws.FILTER($I$10:$I$16,$M$10:$M$16=\"Sim\"), _xlfn._xlws.FILTER($I$19:$I$29,M19:M29=\"Sim\")) /\n   AVERAGE(_xlfn._xlws.FILTER($I$10:$I$16,$M$10:$M$16=\"Sim\"), _xlfn._xlws.FILTER($I$19:$I$29,M19:M29=\"Sim\")),4),M32)\n)","v":0.12590000000000001},{"$f":"IF(SUM(COUNTIF($M$10:$M$16,\"Sim\")) + SUM(COUNTIF(N19:N29,\"Sim\")) < 3,\n   \"N/D (são necessários pelo menos 3 preços)\",\n   IFERROR(ROUND(_xlfn.STDEV.S(_xlfn._xlws.FILTER($I$10:$I$16,$M$10:$M$16=\"Sim\"), _xlfn._xlws.FILTER($I$19:$I$29,N19:N29=\"Sim\")) /\n   AVERAGE(_xlfn._xlws.FILTER($I$10:$I$16,$M$10:$M$16=\"Sim\"), _xlfn._xlws.FILTER($I$19:$I$29,N19:N29=\"Sim\")),4),N32)\n)","v":0.12590000000000001},{"$f":"IF(SUM(COUNTIF($M$10:$M$16,\"Sim\")) + SUM(COUNTIF(O19:O29,\"Sim\")) < 3,\n   \"N/D (são necessários pelo menos 3 preços)\",\n   IFERROR(ROUND(_xlfn.STDEV.S(_xlfn._xlws.FILTER($I$10:$I$16,$M$10:$M$16=\"Sim\"), _xlfn._xlws.FILTER($I$19:$I$29,O19:O29=\"Sim\")) /\n   AVERAGE(_xlfn._xlws.FILTER($I$10:$I$16,$M$10:$M$16=\"Sim\"), _xlfn._xlws.FILTER($I$19:$I$29,O19:O29=\"Sim\")),4),O32)\n)","v":9.8900000000000002E-2},{"$f":"IF(SUM(COUNTIF($M$10:$M$16,\"Sim\")) + SUM(COUNTIF(P19:P29,\"Sim\")) < 3,\n   \"N/D (são necessários pelo menos 3 preços)\",\n   IFERROR(ROUND(_xlfn.STDEV.S(_xlfn._xlws.FILTER($I$10:$I$16,$M$10:$M$16=\"Sim\"), _xlfn._xlws.FILTER($I$19:$I$29,P19:P29=\"Sim\")) /\n   AVERAGE(_xlfn._xlws.FILTER($I$10:$I$16,$M$10:$M$16=\"Sim\"), _xlfn._xlws.FILTER($I$19:$I$29,P19:P29=\"Sim\")),4),P32)\n)","v":0.1227},{"$f":"IF(SUM(COUNTIF($M$10:$M$16,\"Sim\")) + SUM(COUNTIF(Q19:Q29,\"Sim\")) < 3,\n   \"N/D (são necessários pelo menos 3 preços)\",\n   IFERROR(ROUND(_xlfn.STDEV.S(_xlfn._xlws.FILTER($I$10:$I$16,$M$10:$M$16=\"Sim\"), _xlfn._xlws.FILTER($I$19:$I$29,Q19:Q29=\"Sim\")) /\n   AVERAGE(_xlfn._xlws.FILTER($I$10:$I$16,$M$10:$M$16=\"Sim\"), _xlfn._xlws.FILTER($I$19:$I$29,Q19:Q29=\"Sim\")),4),Q32)\n)","v":9.9400000000000002E-2},{"$f":"IF(SUM(COUNTIF($M$10:$M$16,\"Sim\")) + SUM(COUNTIF(R19:R29,\"Sim\")) < 3,\n   \"N/D (são necessários pelo menos 3 preços)\",\n   IFERROR(ROUND(_xlfn.STDEV.S(_xlfn._xlws.FILTER($I$10:$I$16,$M$10:$M$16=\"Sim\"), _xlfn._xlws.FILTER($I$19:$I$29,R19:R29=\"Sim\")) /\n   AVERAGE(_xlfn._xlws.FILTER($I$10:$I$16,$M$10:$M$16=\"Sim\"), _xlfn._xlws.FILTER($I$19:$I$29,R19:R29=\"Sim\")),4),R32)\n)","v":6.8199999999999997E-2},{"$f":"IF(SUM(COUNTIF($S$10:$S$16,\"Sim\")) + SUM(COUNTIF(S19:S29,\"Sim\")) < 3,\n   \"N/D (são necessários pelo menos 3 preços)\",\n   IFERROR(_xlfn.STDEV.S(_xlfn._xlws.FILTER($I$10:$I$16,$S$10:$S$16=\"Sim\"), _xlfn._xlws.FILTER($I$19:$I$29,S19:S29=\"Sim\")) /\n   AVERAGE(_xlfn._xlws.FILTER($I$10:$I$16,$S$10:$S$16=\"Sim\"), _xlfn._xlws.FILTER($I$19:$I$29,S19:S29=\"Sim\")),S32)\n)","v":"N/D (são necessários pelo menos 3 preços)"}]
[null,"PREÇO UNITÁRIO ESTIMADO ADOTADO:",{"$nulls":7},{"$f":"IF($J$33=\"\",\"Selecione metodologia para exclusão de preços\",MIN(J31:J32))","v":3.3680543037825514},null,"Metodologia sugerida:",{"$f":"IF($M$35=MIN($M$35,$N$35:$R$35),M8,\"Grupos - \"&INDEX({\"Todos\";\"Sem o maior\";\"Sem o menor\";\"Sem o maior e Sem o menor\";\"Sem os dois maiores\"},MATCH(MIN($N$35:$R$35),$N$35:$R$35,0)))","v":"Grupos - Sem os dois maiores"}]
[{"$nulls":11},"Preço estimado sugerido:",{"$f":"IF($M$36=M8,SMALL($M$33:$M$34,1),MIN(INDEX($N$34:$R$34, MATCH(MIN($N$35:$R$35), $N$35:$R$35, 0)),INDEX($N$33:$R$33, MATCH(MIN($N$35:$R$35), $N$35:$R$35, 0))))","v":3.3680543037825514}]
[{"$nulls":11},"Metodologia a adotar:",{"$f":"IF(INDEX(L18:S18,N38)=0,\"\",INDEX(L18:S18,N38))","v":""},1]

{"sheet":"Peixe 32% 4 a 6 mm","index":6,"n_rows":38,"n_cols":21,"rows_kept":38,"cut":false,"hidden":false,"merged":[[15,12,15,17],[6,2,6,5],[6,12,6,18],[7,1,7,9],[7,12,7,18],[8,12,8,17],[9,12,9,17],[10,12,10,17],[11,12,11,17],[12,12,12,17],[13,12,13,17],[14,12,14,17],[26,1,26,6],[16,1,16,9],[16,12,16,18],[17,1,17,6],[18,1,18,6],[19,1,19,6],[20,1,20,6],[21,1,21,6],[22,1,22,6],[23,1,23,6],[24,1,24,6],[25,1,25,6],[35,12,35,18],[36,12,36,18],[27,1,27,6],[28,1,28,6],[29,1,31,7],[32,1,34,8],[32,9,34,9],[35,1,37,8],[35,9,37,9]]}
[]
[null,"Processo",{"$f":"'Peixe 50% PB Farelo'!C2","v":"59511.000102/2026-55"}]
[null,"Responsável",{"$f":"'Peixe 50% PB Farelo'!C3","v":"JHONES DE LIMA VIEIRA"}]
[null,"Área de Origem",{"$f":"'Peixe 50% PB Farelo'!C4","v":"14ª GTR"}]
[null,"Data da pesquisa",{"$f":"'Peixe 50% PB Farelo'!C5","v":"Janeiro/2026 - Fevereiro/2026"}]
[]
[null,"ITEM:","Ração extrusada para peixe onívoro 32% PB – Proteína Bruta Mín.: 32%, granulometria 4 a 6 mm. Data de validade não inferior a 6 meses.",null,null,null,"UNIDADE DE MEDIDA:",{"$f":"'Peixe 50% PB Farelo'!H7","v":"kg"},"QUANTIDADE:",75000,null,null,"Tabela auxiliar de metodologias para exclusão de preços",{"$nulls":7},"Automática (menor CV)"]
[null,"LICITAÇÕES ANTERIORES",{"$nulls":10},"Licitações Anteriores - Outliers",{"$nulls":7},{"$f":"M18","v":"Outliers"}]
[null,"Órgão","Edital/Ano - Nº do Lote / Item","Quantidade","Valor Unitário","Data","índice de atualização (nome)","Variação acumulada do índice (%)","Preço unitário atualizado","Utilizar?  (Sim/Não)",null,null,"Utilizar?",{"$nulls":5},"Por critério do(a) analista",null,{"$f":"N18","v":"Grupos - Todos"}]
[null,"14ª SR - Fortaleza/CE","Edital 90007/2024 - Item 7",66647,2.75,"2025-01-02","IPA-EP-DI Suprimentos agropecuários",{"$f":"(I10/E10)-1","v":1.6540957444201254E-2},{"$f":"IF(ISBLANK(E10),\"\",E10*(1+(INDEX('índice de atualização'!B:B,MATCH(G10,'índice de atualização'!B:B,0)+COUNTA('índice de atualização'!B:B)-1)-INDEX('índice de atualização'!B:B,MATCH(TEXT(F10,\"MM/AAAA\"),'índice de atualização'!A:A,0)))/INDEX('índice de atualização'!B:B,MATCH(TEXT(F10,\"MM/AAAA\"),'índice de atualização'!A:A,0))))","v":2.7954876329715534},{"$f":"IF(ISNUMBER(I10),IF($J$33<>$S$9,M10,S10),\"\")","v":"Sim"},null,null,{"$f":"IF(ISNUMBER(I10),IF(OR(I10<_xlfn.QUARTILE.INC($I$10:$I$29,1)-1.5*(_xlfn.QUARTILE.INC($I$10:I29,3)-_xlfn.QUARTILE.INC($I$10:$I$29,1)),I10>_xlfn.QUARTILE.INC($I$10:$I$29,3)+1.5*(_xlfn.QUARTILE.INC($I$10:$I$29,3)-_xlfn.QUARTILE.INC($I$10:$I$29,1))),\"Não\",\"Sim\"),\"\")","v":"Sim"},{"$nulls":7},{"$f":"O18","v":"Grupos - Sem o maior"}]
[null,"14ª SR - Fortaleza/CE","Edital 90007/2024 - Item 15",11750,2.78,"2025-02-18","IPA-EP-DI Suprimentos agropecuários",{"$f":"(I11/E11)-1","v":4.5072426012993105E-4},{"$f":"IF(ISBLANK(E11),\"\",E11*(1+(INDEX('índice de atualização'!B:B,MATCH(G11,'índice de atualização'!B:B,0)+COUNTA('índice de atualização'!B:B)-1)-INDEX('índice de atualização'!B:B,MATCH(TEXT(F11,\"MM/AAAA\"),'índice de atualização'!A:A,0)))/INDEX('índice de atualização'!B:B,MATCH(TEXT(F11,\"MM/AAAA\"),'índice de atualização'!A:A,0))))","v":2.7812530134431612},{"$f":"IF(ISNUMBER(I11),IF($J$33<>$S$8,M11,S11),\"\")","v":"Sim"},null,null,{"$f":"IF(ISNUMBER(I11),IF(OR(I11<_xlfn.QUARTILE.INC($I$10:$I$29,1)-1.5*(_xlfn.QUARTILE.INC($I$10:I30,3)-_xlfn.QUARTILE.INC($I$10:$I$29,1)),I11>_xlfn.QUARTILE.INC($I$10:$I$29,3)+1.5*(_xlfn.QUARTILE.INC($I$10:$I$29,3)-_xlfn.QUARTILE.INC($I$10:$I$29,1))),\"Não\",\"Sim\"),\"\")","v":"Sim"},{"$nulls":7},{"$f":"P18","v":"Grupos - Sem o menor"}]
[null,"11ª SR - Amapá/AP","Edital 90126/2024 - Item 2 e 6",62500,3.72,"2025-05-13","IPA-EP-DI Suprimentos agropecuários",{"$f":"(I12/E12)-1","v":-3.9878408355853878E-2},{"$f":"IF(ISBLANK(E12),\"\",E12*(1+(INDEX('índice de atualização'!B:B,MATCH(G12,'índice de atualização'!B:B,0)+COUNTA('índice de atualização'!B:B)-1)-INDEX('índice de atualização'!B:B,MATCH(TEXT(F12,\"MM/AAAA\"),'índice de atualização'!A:A,0)))/INDEX('índice de atualização'!B:B,MATCH(TEXT(F12,\"MM/AAAA\"),'índice de atualização'!A:A,0))))","v":3.5716523209162236},"Sim",null,null,{"$f":"IF(ISNUMBER(I12),IF(OR(I12<_xlfn.QUARTILE.INC($I$10:$I$29,1)-1.5*(_xlfn.QUARTILE.INC($I$10:I31,3)-_xlfn.QUARTILE.INC($I$10:$I$29,1)),I12>_xlfn.QUARTILE.INC($I$10:$I$29,3)+1.5*(_xlfn.QUARTILE.INC($I$10:$I$29,3)-_xlfn.QUARTILE.INC($I$10:$I$29,1))),\"Não\",\"Sim\"),\"\")","v":"Sim"},{"$f":"$M$12","v":"Sim"},{"$f":"$M$12","v":"Sim"},{"$f":"$M$12","v":"Sim"},{"$f":"$M$12","v":"Sim"},{"$f":"$M$12","v":"Sim"},null,null,{"$f":"Q18","v":"Grupos - Sem o maior e sem o menor"}]
[null,"Codevasf Sede","Edital 90057/2025 - Item 2",{"$f":"4900*25","v":122500},{"$f":"93.57/25","v":3.7427999999999999},"2025-12-08","IPA-EP-DI Suprimentos agropecuários",0,{"$f":"IF(ISBLANK(E13),\"\",E13*(1+(INDEX('índice de atualização'!B:B,MATCH(G13,'índice de atualização'!B:B,0)+COUNTA('índice de atualização'!B:B)-1)-INDEX('índice de atualização'!B:B,MATCH(TEXT(F13,\"MM/AAAA\"),'índice de atualização'!A:A,0)))/INDEX('índice de atualização'!B:B,MATCH(TEXT(F13,\"MM/AAAA\"),'índice de atualização'!A:A,0))))","v":3.7427999999999999},"Sim",null,null,{"$f":"IF(ISNUMBER(I13),IF(OR(I13<_xlfn.QUARTILE.INC($I$10:$I$29,1)-1.5*(_xlfn.QUARTILE.INC($I$10:I32,3)-_xlfn.QUARTILE.INC($I$10:$I$29,1)),I13>_xlfn.QUARTILE.INC($I$10:$I$29,3)+1.5*(_xlfn.QUARTILE.INC($I$10:$I$29,3)-_xlfn.QUARTILE.INC($I$10:$I$29,1))),\"Não\",\"Sim\"),\"\")","v":"Sim"},{"$f":"$M$13","v":"Sim"},{"$f":"$M$13","v":"Sim"},{"$f":"$M$13","v":"Sim"},{"$f":"$M$13","v":"Sim"},{"$f":"$M$13","v":"Sim"},null,null,{"$f":"R18","v":"Grupos - Sem os dois maiores"}]
[{"$nulls":8},{"$f":"IF(ISBLANK(E14),\"\",E14*(1+(INDEX('índice de atualização'!B:B,MATCH(G14,'índice de atualização'!B:B,0)+COUNTA('índice de atualização'!B:B)-1)-INDEX('índice de atualização'!B:B,MATCH(TEXT(F14,\"MM/AAAA\"),'índice de atualização'!A:A,0)))/INDEX('índice de atualização'!B:B,MATCH(TEXT(F14,\"MM/AAAA\"),'índice de atualização'!A:A,0))))","v":""},"",null,null,{"$f":"IF(ISNUMBER(I14),IF(OR(I14<_xlfn.QUARTILE.INC($I$10:$I$29,1)-1.5*(_xlfn.QUARTILE.INC($I$10:I33,3)-_xlfn.QUARTILE.INC($I$10:$I$29,1)),I14>_xlfn.QUARTILE.INC($I$10:$I$29,3)+1.5*(_xlfn.QUARTILE.INC($I$10:$I$29,3)-_xlfn.QUARTILE.INC($I$10:$I$29,1))),\"Não\",\"Sim\"),\"\")","v":""},{"$f":"$M$14","v":""},{"$f":"$M$14","v":""},{"$f":"$M$14","v":""},{"$f":"$M$14","v":""},{"$f":"$M$14","v":""},null,null,{"$f":"S18","v":"Por critério do(a) analista"}]
[{"$nulls":8},{"$f":"IF(ISBLANK(E15),\"\",E15*(1+(INDEX('índice de atualização'!B:B,MATCH(G15,'índice de atualização'!B:B,0)+COUNTA('índice de atualização'!B:B)-1)-INDEX('índice de atualização'!B:B,MATCH(TEXT(F15,\"MM/AAAA\"),'índice de atualização'!A:A,0)))/INDEX('índice de atualização'!B:B,MATCH(TEXT(F15,\"MM/AAAA\"),'índice de atualização'!A:A,0))))","v":""},"",null,null,{"$f":"IF(ISNUMBER(I15),IF(OR(I15<_xlfn.QUARTILE.INC($I$10:$I$29,1)-1.5*(_xlfn.QUARTILE.INC($I$10:I36,3)-_xlfn.QUARTILE.INC($I$10:$I$29,1)),I15>_xlfn.QUARTILE.INC($I$10:$I$29,3)+1.5*(_xlfn.QUARTILE.INC($I$10:$I$29,3)-_xlfn.QUARTILE.INC($I$10:$I$29,1))),\"Não\",\"Sim\"),\"\")","v":""},{"$f":"$M$15","v":""},{"$f":"$M$15","v":""},{"$f":"$M$15","v":""},{"$f":"$M$15","v":""},{"$f":"$M$15","v":""}]
[{"$nulls":8},{"$f":"IF(ISBLANK(E16),\"\",E16*(1+(INDEX('índice de atualização'!B:B,MATCH(G16,'índice de atualização'!B:B,0)+COUNTA('índice de atualização'!B:B)-1)-INDEX('índice de atualização'!B:B,MATCH(TEXT(F16,\"MM/AAAA\"),'índice de atualização'!A:A,0)))/INDEX('índice de atualização'!B:B,MATCH(TEXT(F16,\"MM/AAAA\"),'índice de atualização'!A:A,0))))","v":""},"",null,null,{"$f":"IF(ISNUMBER(I16),IF(OR(I16<_xlfn.QUARTILE.INC($I$10:$I$29,1)-1.5*(_xlfn.QUARTILE.INC($I$10:I39,3)-_xlfn.QUARTILE.INC($I$10:$I$29,1)),I16>_xlfn.QUARTILE.INC($I$10:$I$29,3)+1.5*(_xlfn.QUARTILE.INC($I$10:$I$29,3)-_xlfn.QUARTILE.INC($I$10:$I$29,1))),\"Não\",\"Sim\"),\"\")","v":""},{"$f":"$M$16","v":""},{"$f":"$M$16","v":""},{"$f":"$M$16","v":""},{"$f":"$M$16","v":""},{"$f":"$M$16","v":""}]
[null,"COTAÇÕES DE MERCADO",{"$nulls":10},"Cotações"]
[null,"Empresa",{"$nulls":5},"Data","Preço Unitário","Utilizar? (Sim/Não)",null,null,"Outliers","Grupos - Todos","Grupos - Sem o maior","Grupos - Sem o menor","Grupos - Sem o maior e sem o menor","Grupos - Sem os dois maiores","Por critério do(a) analista"]
[null,"Agrosolo - Guabi",{"$nulls":5},"2026-02-10",{"$f":"102.8/25","v":4.1120000000000001},{"$f":"IF(ISNUMBER(I19),IF($J$33=$M$18,M19,IF($J$33=$N$18,N19,IF($J$33=$O$18,O19,IF($J$33=$P$18,P19,IF($J$33=$Q$18,Q19,IF($J$33=$R$18,R19,IF($J$33=$S$18,S19,\"\"))))))),\"\")","v":"Não"},null,null,{"$f":"IF(ISNUMBER(I19),IF(OR(I19<_xlfn.QUARTILE.INC($I$10:$I$29,1)-1.5*(_xlfn.QUARTILE.INC($I$10:I40,3)-_xlfn.QUARTILE.INC($I$10:$I$29,1)),I19>_xlfn.QUARTILE.INC($I$10:$I$29,3)+1.5*(_xlfn.QUARTILE.INC($I$10:$I$29,3)-_xlfn.QUARTILE.INC($I$10:$I$29,1))),\"Não\",\"Sim\"),\"\")","v":"Sim"},{"$f":"IF(ISNUMBER(I19),\"Sim\",\"\")","v":"Sim"},{"$f":"IF(ISNUMBER(I19),IF(_xlfn.RANK.EQ(I19,$I$19:$I$29)=1,\"Não\",\"Sim\"),\"\")","v":"Não"},{"$f":"IF(ISNUMBER(I19),IF(_xlfn.RANK.EQ(I19,$I$19:$I$29)=COUNT($I$19:$I$29),\"Não\",\"Sim\"),\"\")","v":"Sim"},{"$f":"IF(O19=\"\",\"\",IF(AND(O19=\"Sim\",P19=\"Sim\"),\"Sim\",\"Não\"))","v":"Não"},{"$f":"IF(ISNUMBER(I19),IF(_xlfn.RANK.EQ(I19,$I$19:$I$29)<=2,\"Não\",\"Sim\"),\"\")","v":"Não"}]
[null,"Samaria Rações LTDA",{"$nulls":5},"2026-02-09",{"$f":"72/25","v":2.88},"Sim",null,null,{"$f":"IF(ISNUMBER(I20),IF(OR(I20<_xlfn.QUARTILE.INC($I$10:$I$29,1)-1.5*(_xlfn.QUARTILE.INC($I$10:I40,3)-_xlfn.QUARTILE.INC($I$10:$I$29,1)),I20>_xlfn.QUARTILE.INC($I$10:$I$29,3)+1.5*(_xlfn.QUARTILE.INC($I$10:$I$29,3)-_xlfn.QUARTILE.INC($I$10:$I$29,1))),\"Não\",\"Sim\"),\"\")","v":"Sim"},"Sim","Sim","Não",{"$f":"IF(O20=\"\",\"\",IF(AND(O20=\"Sim\",P20=\"Sim\"),\"Sim\",\"Não\"))","v":"Não"},"Sim"]
[null,"Integral Mix Agroindustria",{"$nulls":5},"2026-02-07",{"$f":"78.78/25","v":3.1512000000000002},"Sim",null,null,{"$f":"IF(ISNUMBER(I21),IF(OR(I21<_xlfn.QUARTILE.INC($I$10:$I$29,1)-1.5*(_xlfn.QUARTILE.INC($I$10:I40,3)-_xlfn.QUARTILE.INC($I$10:$I$29,1)),I21>_xlfn.QUARTILE.INC($I$10:$I$29,3)+1.5*(_xlfn.QUARTILE.INC($I$10:$I$29,3)-_xlfn.QUARTILE.INC($I$10:$I$29,1))),\"Não\",\"Sim\"),\"\")","v":"Sim"},"Sim","Sim","Sim","Sim","Sim"]
[null,"Comercial do Carmo ME",{"$nulls":5},"2026-02-12",{"$f":"97/25","v":3.88},"Não",null,null,{"$f":"IF(ISNUMBER(I22),IF(OR(I22<_xlfn.QUARTILE.INC($I$10:$I$29,1)-1.5*(_xlfn.QUARTILE.INC($I$10:I40,3)-_xlfn.QUARTILE.INC($I$10:$I$29,1)),I22>_xlfn.QUARTILE.INC($I$10:$I$29,3)+1.5*(_xlfn.QUARTILE.INC($I$10:$I$29,3)-_xlfn.QUARTILE.INC($I$10:$I$29,1))),\"Não\",\"Sim\"),\"\")","v":"Sim"},"Sim","Sim","Sim","Sim","Não"]
[{"$nulls":9},"",null,null,{"$f":"IF(ISNUMBER(I23),IF(OR(I23<_xlfn.QUARTILE.INC($I$10:$I$29,1)-1.5*(_xlfn.QUARTILE.INC($I$10:I41,3)-_xlfn.QUARTILE.INC($I$10:$I$29,1)),I23>_xlfn.QUARTILE.INC($I$10:$I$29,3)+1.5*(_xlfn.QUARTILE.INC($I$10:$I$29,3)-_xlfn.QUARTILE.INC($I$10:$I$29,1))),\"Não\",\"Sim\"),\"\")","v":""},"","","","",""]
[{"$nulls":9},"",null,null,{"$f":"IF(ISNUMBER(I24),IF(OR(I24<_xlfn.QUARTILE.INC($I$10:$I$29,1)-1.5*(_xlfn.QUARTILE.INC($I$10:I42,3)-_xlfn.QUARTILE.INC($I$10:$I$29,1)),I24>_xlfn.QUARTILE.INC($I$10:$I$29,3)+1.5*(_xlfn.QUARTILE.INC($I$10:$I$29,3)-_xlfn.QUARTILE.INC($I$10:$I$29,1))),\"Não\",\"Sim\"),\"\")","v":""},"","","","",""]
[{"$nulls":9},"",null,null,{"$f":"IF(ISNUMBER(I25),IF(OR(I25<_xlfn.QUARTILE.INC($I$10:$I$29,1)-1.5*(_xlfn.QUARTILE.INC($I$10:I40,3)-_xlfn.QUARTILE.INC($I$10:$I$29,1)),I25>_xlfn.QUARTILE.INC($I$10:$I$29,3)+1.5*(_xlfn.QUARTILE.INC($I$10:$I$29,3)-_xlfn.QUARTILE.INC($I$10:$I$29,1))),\"Não\",\"Sim\"),\"\")","v":""},"","","","",""]
[{"$nulls":9},"",null,null,{"$f":"IF(ISNUMBER(I26),IF(OR(I26<_xlfn.QUARTILE.INC($I$10:$I$29,1)-1.5*(_xlfn.QUARTILE.INC($I$10:I40,3)-_xlfn.QUARTILE.INC($I$10:$I$29,1)),I26>_xlfn.QUARTILE.INC($I$10:$I$29,3)+1.5*(_xlfn.QUARTILE.INC($I$10:$I$29,3)-_xlfn.QUARTILE.INC($I$10:$I$29,1))),\"Não\",\"Sim\"),\"\")","v":""},"","","","",""]
[{"$nulls":9},"",null,null,{"$f":"IF(ISNUMBER(I27),IF(OR(I27<_xlfn.QUARTILE.INC($I$10:$I$29,1)-1.5*(_xlfn.QUARTILE.INC($I$10:I40,3)-_xlfn.QUARTILE.INC($I$10:$I$29,1)),I27>_xlfn.QUARTILE.INC($I$10:$I$29,3)+1.5*(_xlfn.QUARTILE.INC($I$10:$I$29,3)-_xlfn.QUARTILE.INC($I$10:$I$29,1))),\"Não\",\"Sim\"),\"\")","v":""},"","","","",""]
[{"$nulls":9},"",null,null,{"$f":"IF(ISNUMBER(I28),IF(OR(I28<_xlfn.QUARTILE.INC($I$10:$I$29,1)-1.5*(_xlfn.QUARTILE.INC($I$10:I40,3)-_xlfn.QUARTILE.INC($I$10:$I$29,1)),I28>_xlfn.QUARTILE.INC($I$10:$I$29,3)+1.5*(_xlfn.QUARTILE.INC($I$10:$I$29,3)-_xlfn.QUARTILE.INC($I$10:$I$29,1))),\"Não\",\"Sim\"),\"\")","v":""},"","","","",""]
[{"$nulls":9},"",null,null,{"$f":"IF(ISNUMBER(I29),IF(OR(I29<_xlfn.QUARTILE.INC($I$10:$I$29,1)-1.5*(_xlfn.QUARTILE.INC($I$10:I40,3)-_xlfn.QUARTILE.INC($I$10:$I$29,1)),I29>_xlfn.QUARTILE.INC($I$10:$I$29,3)+1.5*(_xlfn.QUARTILE.INC($I$10:$I$29,3)-_xlfn.QUARTILE.INC($I$10:$I$29,1))),\"Não\",\"Sim\"),\"\")","v":""},"","","","",""]
[null,"Observações:",{"$nulls":6},"CV:",{"$f":"IF($J$33=\"\",\"Selecione metodologia para exclusão de preços\",IF(COUNTIF($J$10:$J$29,\"Sim\")<3,\"N/D (são necessários pelo menos 3 preços)\",_xlfn.STDEV.S(IF($J$10:$J$29=\"Sim\",$I$10:$I$29))/AVERAGE(IF($J$10:$J$29=\"Sim\",$I$10:$I$29))))","v":0.13178471733601069},null,"Média (Cotações)",{"$f":"IF(COUNTIF(M19:M29,\"Sim\")<3,\"N/D (são necessários pelo menos 3 preços)\",AVERAGE(IF(M19:M29=\"Sim\",$I19:$I29)))","v":3.5057999999999998},{"$f":"IF(COUNTIF(N19:N29,\"Sim\")<3,\"N/D (são necessários pelo menos 3 preços)\",AVERAGE(IF(N19:N29=\"Sim\",$I19:$I29)))","v":3.5057999999999998},{"$f":"IF(COUNTIF(O19:O29,\"Sim\")<3,\"N/D (são necessários pelo menos 3 preços)\",AVERAGE(IF(O19:O29=\"Sim\",$I19:$I29)))","v":3.3037333333333336},{"$f":"IF(COUNTIF(P19:P29,\"Sim\")<3,\"N/D (são necessários pelo menos 3 preços)\",AVERAGE(IF(P19:P29=\"Sim\",$I19:$I29)))","v":3.7143999999999999},{"$f":"IF(COUNTIF(Q19:Q29,\"Sim\")<3,\"N/D (são necessários pelo menos 3 preços)\",AVERAGE(IF(Q19:Q29=\"Sim\",$I19:$I29)))","v":"N/D (são necessários pelo menos 3 preços)"},{"$f":"IF(COUNTIF(R19:R29,\"Sim\")<3,\"N/D (são necessários pelo menos 3 preços)\",AVERAGE(IF(R19:R29=\"Sim\",$I19:$I29)))","v":"N/D (são necessários pelo menos 3 preços)"},{"$f":"IF(COUNTIF(S19:S29,\"Sim\")<3,\"N/D (são necessários pelo menos 3 preços)\",AVERAGE(IF(S19:S29=\"Sim\",$I19:$I29)))","v":"N/D (são necessários pelo menos 3 preços)"}]
[{"$nulls":8},"Média:",{"$f":"IF($J$33=\"\",\"Selecione metodologia para exclusão de preços\",AVERAGE(IF($J$10:$J$29=\"Sim\",$I$10:$I$29)))","v":3.1537321612218228},null,"Mediana (Cotações)",{"$f":"IF(COUNTIF(M19:M29,\"Sim\")<3,\"N/D (são necessários pelo menos 3 preços)\",MEDIAN(IF(M19:M29=\"Sim\",$I19:$I29)))","v":3.5156000000000001},{"$f":"IF(COUNTIF(N19:N29,\"Sim\")<3,\"N/D (são necessários pelo menos 3 preços)\",MEDIAN(IF(N19:N29=\"Sim\",$I19:$I29)))","v":3.5156000000000001},{"$f":"IF(COUNTIF(O19:O29,\"Sim\")<3,\"N/D (são necessários pelo menos 3 preços)\",MEDIAN(IF(O19:O29=\"Sim\",$I19:$I29)))","v":3.1512000000000002},{"$f":"IF(COUNTIF(P19:P29,\"Sim\")<3,\"N/D (são necessários pelo menos 3 preços)\",MEDIAN(IF(P19:P29=\"Sim\",$I19:$I29)))","v":3.88},{"$f":"IF(COUNTIF(Q19:Q29,\"Sim\")<3,\"N/D (são necessários pelo menos 3 preços)\",MEDIAN(IF(Q19:Q29=\"Sim\",$I19:$I29)))","v":"N/D (são necessários pelo menos 3 preços)"},{"$f":"IF(COUNTIF(R19:R29,\"Sim\")<3,\"N/D (são necessários pelo menos 3 preços)\",MEDIAN(IF(R19:R29=\"Sim\",$I19:$I29)))","v":"N/D (são necessários pelo menos 3 preços)"},{"$f":"IF(COUNTIF(S19:S29,\"Sim\")<3,\"N/D (são necessários pelo menos 3 preços)\",MEDIAN(IF(S19:S29=\"Sim\",$I19:$I29)))","v":"N/D (são necessários pelo menos 3 preços)"}]
[{"$nulls":8},"Mediana:",{"$f":"IF($J$33=\"\",\"Selecione metodologia para exclusão de preços\",MEDIAN(IF($J$10:$J$29=\"Sim\",$I$10:$I$29)))","v":3.0156000000000001},null,"CV (Cotações)",{"$f":"IF(COUNTIF(M19:M29,\"Sim\")<3,\"N/D (são necessários pelo menos 3 preços)\",_xlfn.STDEV.S(IF(M19:M29=\"Sim\",$I19:$I29))/AVERAGE(IF(M19:M29=\"Sim\",$I19:$I29)))","v":0.16671965876429101},{"$f":"IF(COUNTIF(N19:N29,\"Sim\")<3,\"N/D (são necessários pelo menos 3 preços)\",_xlfn.STDEV.S(IF(N19:N29=\"Sim\",$I19:$I29))/AVERAGE(IF(N19:N29=\"Sim\",$I19:$I29)))","v":0.16671965876429101},{"$f":"IF(COUNTIF(O19:O29,\"Sim\")<3,\"N/D (são necessários pelo menos 3 preços)\",_xlfn.STDEV.S(IF(O19:O29=\"Sim\",$I19:$I29))/AVERAGE(IF(O19:O29=\"Sim\",$I19:$I29)))","v":0.15653669648932272},{"$f":"IF(COUNTIF(P19:P29,\"Sim\")<3,\"N/D (são necessários pelo menos 3 preços)\",_xlfn.STDEV.S(IF(P19:P29=\"Sim\",$I19:$I29))/AVERAGE(IF(P19:P29=\"Sim\",$I19:$I29)))","v":0.13497465482546114},{"$f":"IF(COUNTIF(Q19:Q29,\"Sim\")<3,\"N/D (são necessários pelo menos 3 preços)\",_xlfn.STDEV.S(IF(Q19:Q29=\"Sim\",$I19:$I29))/AVERAGE(IF(Q19:Q29=\"Sim\",$I19:$I29)))","v":"N/D (são necessários pelo menos 3 preços)"},{"$f":"IF(COUNTIF(R19:R29,\"Sim\")<3,\"N/D (são necessários pelo menos 3 preços)\",_xlfn.STDEV.S(IF(R19:R29=\"Sim\",$I19:$I29))/AVERAGE(IF(R19:R29=\"Sim\",$I19:$I29)))","v":"N/D (são necessários pelo menos 3 preços)"},{"$f":"IF(COUNTIF(S19:S29,\"Sim\")<3,\"N/D (são necessários pelo menos 3 preços)\",_xlfn.STDEV.S(IF(S19:S29=\"Sim\",$I19:$I29))/AVERAGE(IF(S19:S29=\"Sim\",$I19:$I29)))","v":"N/D (são necessários pelo menos 3 preços)"}]
[null,"Metodologia de exclusão de preços adotada:",{"$nulls":7},{"$f":"IF(M38=\"\",INDEX(M18:S18,MATCH(MIN(M35:S35),M35:S35,0)),M38)","v":"Grupos - Sem os dois maiores"},null,"Média",{"$f":"IF(SUM(COUNTIF($M$10:$M$16,\"Sim\")) + SUM(COUNTIF(M19:M29,\"Sim\")) < 3,\n   \"N/D (são necessários pelo menos 3 preços)\",\n   IFERROR(AVERAGE(_xlfn._xlws.FILTER($I$10:$I$16,$M$10:$M$16=\"Sim\"), _xlfn._xlws.FILTER($I$19:$I$29,M19:M29=\"Sim\")),M30))","v":3.3642991209163671},{"$f":"IF(SUM(COUNTIF($M$10:$M$16,\"Sim\")) + SUM(COUNTIF(N19:N29,\"Sim\")) < 3,\n   \"N/D (são necessários pelo menos 3 preços)\",\n   IFERROR(AVERAGE(_xlfn._xlws.FILTER($I$10:$I$16,$M$10:$M$16=\"Sim\"), _xlfn._xlws.FILTER($I$19:$I$29,N19:N29=\"Sim\")),N30))","v":3.3642991209163671},{"$f":"IF(SUM(COUNTIF($M$10:$M$16,\"Sim\")) + SUM(COUNTIF(O19:O29,\"Sim\")) < 3,\n   \"N/D (são necessários pelo menos 3 preços)\",\n   IFERROR(AVERAGE(_xlfn._xlws.FILTER($I$10:$I$16,$M$10:$M$16=\"Sim\"), _xlfn._xlws.FILTER($I$19:$I$29,O19:O29=\"Sim\")),O30))","v":3.257484709618705},{"$f":"IF(SUM(COUNTIF($M$10:$M$16,\"Sim\")) + SUM(COUNTIF(P19:P29,\"Sim\")) < 3,\n   \"N/D (são necessários pelo menos 3 preços)\",\n   IFERROR(AVERAGE(_xlfn._xlws.FILTER($I$10:$I$16,$M$10:$M$16=\"Sim\"), _xlfn._xlws.FILTER($I$19:$I$29,P19:P29=\"Sim\")),P30))","v":3.4334847096187056},{"$f":"IF(SUM(COUNTIF($M$10:$M$16,\"Sim\")) + SUM(COUNTIF(Q19:Q29,\"Sim\")) < 3,\n   \"N/D (são necessários pelo menos 3 preços)\",\n   IFERROR(AVERAGE(_xlfn._xlws.FILTER($I$10:$I$16,$M$10:$M$16=\"Sim\"), _xlfn._xlws.FILTER($I$19:$I$29,Q19:Q29=\"Sim\")),Q30))","v":3.3203988278884893},{"$f":"IF(SUM(COUNTIF($M$10:$M$16,\"Sim\")) + SUM(COUNTIF(R19:R29,\"Sim\")) < 3,\n   \"N/D (são necessários pelo menos 3 preços)\",\n   IFERROR(AVERAGE(_xlfn._xlws.FILTER($I$10:$I$16,$M$10:$M$16=\"Sim\"), _xlfn._xlws.FILTER($I$19:$I$29,R19:R29=\"Sim\")),R30))","v":3.1537321612218228},{"$f":"IF(SUM(COUNTIF($S$10:$S$16,\"Sim\")) + SUM(COUNTIF(S19:S29,\"Sim\")) < 3,\n   \"N/D (são necessários pelo menos 3 preços)\",\n   IFERROR(AVERAGE(_xlfn._xlws.FILTER($I$10:$I$16,$S$10:$S$16=\"Sim\"), _xlfn._xlws.FILTER($I$19:$I$29,S19:S29=\"Sim\")),S30))","v":"N/D (são necessários pelo menos 3 preços)"}]
[{"$nulls":11},"Mediana",{"$f":"IF(SUM(COUNTIF($M$10:$M$16,\"Sim\")) + SUM(COUNTIF(M19:M29,\"Sim\")) < 3,\n   \"N/D (são necessários pelo menos 3 preços)\",\n   IFERROR(MEDIAN(_xlfn._xlws.FILTER($I$10:$I$16,$M$10:$M$16=\"Sim\"), _xlfn._xlws.FILTER($I$19:$I$29,M19:M29=\"Sim\")),M30))","v":3.3614261604581119},{"$f":"IF(SUM(COUNTIF($M$10:$M$16,\"Sim\")) + SUM(COUNTIF(N19:N29,\"Sim\")) < 3,\n   \"N/D (são necessários pelo menos 3 preços)\",\n   IFERROR(MEDIAN(_xlfn._xlws.FILTER($I$10:$I$16,$M$10:$M$16=\"Sim\"), _xlfn._xlws.FILTER($I$19:$I$29,N19:N29=\"Sim\")),N30))","v":3.3614261604581119},{"$f":"IF(SUM(COUNTIF($M$10:$M$16,\"Sim\")) + SUM(COUNTIF(O19:O29,\"Sim\")) < 3,\n   \"N/D (são necessários pelo menos 3 preços)\",\n   IFERROR(MEDIAN(_xlfn._xlws.FILTER($I$10:$I$16,$M$10:$M$16=\"Sim\"), _xlfn._xlws.FILTER($I$19:$I$29,O19:O29=\"Sim\")),O30))","v":3.1512000000000002},{"$f":"IF(SUM(COUNTIF($M$10:$M$16,\"Sim\")) + SUM(COUNTIF(P19:P29,\"Sim\")) < 3,\n   \"N/D (são necessários pelo menos 3 preços)\",\n   IFERROR(MEDIAN(_xlfn._xlws.FILTER($I$10:$I$16,$M$10:$M$16=\"Sim\"), _xlfn._xlws.FILTER($I$19:$I$29,P19:P29=\"Sim\")),P30))","v":3.5716523209162236},{"$f":"IF(SUM(COUNTIF($M$10:$M$16,\"Sim\")) + SUM(COUNTIF(Q19:Q29,\"Sim\")) < 3,\n   \"N/D (são necessários pelo menos 3 preços)\",\n   IFERROR(MEDIAN(_xlfn._xlws.FILTER($I$10:$I$16,$M$10:$M$16=\"Sim\"), _xlfn._xlws.FILTER($I$19:$I$29,Q19:Q29=\"Sim\")),Q30))","v":3.3614261604581119},{"$f":"IF(SUM(COUNTIF($M$10:$M$16,\"Sim\")) + SUM(COUNTIF(R19:R29,\"Sim\")) < 3,\n   \"N/D (são necessários pelo menos 3 preços)\",\n   IFERROR(MEDIAN(_xlfn._xlws.FILTER($I$10:$I$16,$M$10:$M$16=\"Sim\"), _xlfn._xlws.FILTER($I$19:$I$29,R19:R29=\"Sim\")),R30))","v":3.0156000000000001},{"$f":"IF(SUM(COUNTIF($S$10:$S$16,\"Sim\")) + SUM(COUNTIF(S19:S29,\"Sim\")) < 3,\n   \"N/D (são necessários pelo menos 3 preços)\",\n   IFERROR(MEDIAN(_xlfn._xlws.FILTER($I$10:$I$16,$S$10:$S$16=\"Sim\"), _xlfn._xlws.FILTER($I$19:$I$29,S19:S29=\"Sim\")),S30))","v":"N/D (são necessários pelo menos 3 preços)"}]
[{"$nulls":11},"CV",{"$f":"IF(SUM(COUNTIF($M$10:$M$16,\"Sim\")) + SUM(COUNTIF(M19:M29,\"Sim\")) < 3,\n   \"N/D (são necessários pelo menos 3 preços)\",\n   IFERROR(ROUND(_xlfn.STDEV.S(_xlfn._xlws.FILTER($I$10:$I$16,$M$10:$M$16=\"Sim\"), _xlfn._xlws.FILTER($I$19:$I$29,M19:M29=\"Sim\")) /\n   AVERAGE(_xlfn._xlws.FILTER($I$10:$I$16,$M$10:$M$16=\"Sim\"), _xlfn._xlws.FILTER($I$19:$I$29,M19:M29=\"Sim\")),4),M32)\n)","v":0.15709999999999999},{"$f":"IF(SUM(COUNTIF($M$10:$M$16,\"Sim\")) + SUM(COUNTIF(N19:N29,\"Sim\")) < 3,\n   \"N/D (são necessários pelo menos 3 preços)\",\n   IFERROR(ROUND(_xlfn.STDEV.S(_xlfn._xlws.FILTER($I$10:$I$16,$M$10:$M$16=\"Sim\"), _xlfn._xlws.FILTER($I$19:$I$29,N19:N29=\"Sim\")) /\n   AVERAGE(_xlfn._xlws.FILTER($I$10:$I$16,$M$10:$M$16=\"Sim\"), _xlfn._xlws.FILTER($I$19:$I$29,N19:N29=\"Sim\")),4),N32)\n)","v":0.15709999999999999},{"$f":"IF(SUM(COUNTIF($M$10:$M$16,\"Sim\")) + SUM(COUNTIF(O19:O29,\"Sim\")) < 3,\n   \"N/D (são necessários pelo menos 3 preços)\",\n   IFERROR(ROUND(_xlfn.STDEV.S(_xlfn._xlws.FILTER($I$10:$I$16,$M$10:$M$16=\"Sim\"), _xlfn._xlws.FILTER($I$19:$I$29,O19:O29=\"Sim\")) /\n   AVERAGE(_xlfn._xlws.FILTER($I$10:$I$16,$M$10:$M$16=\"Sim\"), _xlfn._xlws.FILTER($I$19:$I$29,O19:O29=\"Sim\")),4),O32)\n)","v":0.14380000000000001},{"$f":"IF(SUM(COUNTIF($M$10:$M$16,\"Sim\")) + SUM(COUNTIF(P19:P29,\"Sim\")) < 3,\n   \"N/D (são necessários pelo menos 3 preços)\",\n   IFERROR(ROUND(_xlfn.STDEV.S(_xlfn._xlws.FILTER($I$10:$I$16,$M$10:$M$16=\"Sim\"), _xlfn._xlws.FILTER($I$19:$I$29,P19:P29=\"Sim\")) /\n   AVERAGE(_xlfn._xlws.FILTER($I$10:$I$16,$M$10:$M$16=\"Sim\"), _xlfn._xlws.FILTER($I$19:$I$29,P19:P29=\"Sim\")),4),P32)\n)","v":0.15440000000000001},{"$f":"IF(SUM(COUNTIF($M$10:$M$16,\"Sim\")) + SUM(COUNTIF(Q19:Q29,\"Sim\")) < 3,\n   \"N/D (são necessários pelo menos 3 preços)\",\n   IFERROR(ROUND(_xlfn.STDEV.S(_xlfn._xlws.FILTER($I$10:$I$16,$M$10:$M$16=\"Sim\"), _xlfn._xlws.FILTER($I$19:$I$29,Q19:Q29=\"Sim\")) /\n   AVERAGE(_xlfn._xlws.FILTER($I$10:$I$16,$M$10:$M$16=\"Sim\"), _xlfn._xlws.FILTER($I$19:$I$29,Q19:Q29=\"Sim\")),4),Q32)\n)","v":0.1444},{"$f":"IF(SUM(COUNTIF($M$10:$M$16,\"Sim\")) + SUM(COUNTIF(R19:R29,\"Sim\")) < 3,\n   \"N/D (são necessários pelo menos 3 preços)\",\n   IFERROR(ROUND(_xlfn.STDEV.S(_xlfn._xlws.FILTER($I$10:$I$16,$M$10:$M$16=\"Sim\"), _xlfn._xlws.FILTER($I$19:$I$29,R19:R29=\"Sim\")) /\n   AVERAGE(_xlfn._xlws.FILTER($I$10:$I$16,$M$10:$M$16=\"Sim\"), _xlfn._xlws.FILTER($I$19:$I$29,R19:R29=\"Sim\")),4),R32)\n)","v":0.1318},{"$f":"IF(SUM(COUNTIF($S$10:$S$16,\"Sim\")) + SUM(COUNTIF(S19:S29,\"Sim\")) < 3,\n   \"N/D (são necessários pelo menos 3 preços)\",\n   IFERROR(_xlfn.STDEV.S(_xlfn._xlws.FILTER($I$10:$I$16,$S$10:$S$16=\"Sim\"), _xlfn._xlws.FILTER($I$19:$I$29,S19:S29=\"Sim\")) /\n   AVERAGE(_xlfn._xlws.FILTER($I$10:$I$16,$S$10:$S$16=\"Sim\"), _xlfn._xlws.FILTER($I$19:$I$29,S19:S29=\"Sim\")),S32)\n)","v":"N/D (são necessários pelo menos 3 preços)"}]
[null,"PREÇO UNITÁRIO ESTIMADO ADOTADO:",{"$nulls":7},{"$f":"IF($J$33=\"\",\"Selecione metodologia para exclusão de preços\",MIN(J31:J32))","v":3.0156000000000001},null,"Metodologia sugerida:",{"$f":"IF($M$35=MIN($M$35,$N$35:$R$35),M8,\"Grupos - \"&INDEX({\"Todos\";\"Sem o maior\";\"Sem o menor\";\"Sem o maior e Sem o menor\";\"Sem os dois maiores\"},MATCH(MIN($N$35:$R$35),$N$35:$R$35,0)))","v":"Grupos - Sem os dois maiores"}]
[{"$nulls":11},"Preço estimado sugerido:",{"$f":"IF($M$36=M8,SMALL($M$33:$M$34,1),MIN(INDEX($N$34:$R$34, MATCH(MIN($N$35:$R$35), $N$35:$R$35, 0)),INDEX($N$33:$R$33, MATCH(MIN($N$35:$R$35), $N$35:$R$35, 0))))","v":3.0156000000000001}]
[{"$nulls":11},"Metodologia a adotar:",{"$f":"IF(INDEX(L18:S18,N38)=0,\"\",INDEX(L18:S18,N38))","v":""},1]

{"sheet":"Peixe 32% 6 a 8 mm","index":7,"n_rows":39,"n_cols":21,"rows_kept":39,"cut":false,"hidden":false,"merged":[[16,12,16,17],[6,2,6,5],[6,12,6,18],[7,1,7,9],[7,12,7,18],[8,12,8,17],[9,12,9,17],[10,12,10,17],[11,12,11,17],[12,12,12,17],[13,12,13,17],[15,12,15,17],[14,12,14,17],[27,1,27,6],[17,1,17,9],[17,12,17,18],[18,1,18,6],[19,1,19,6],[20,1,20,6],[21,1,21,6],[22,1,22,6],[23,1,23,6],[24,1,24,6],[25,1,25,6],[26,1,26,6],[36,12,36,18],[37,12,37,18],[28,1,28,6],[29,1,29,6],[30,1,32,7],[33,1,35,8],[33,9,35,9],[36,1,38,8],[36,9,38,9]]}
[]
[null,"Processo",{"$f":"'Peixe 50% PB Farelo'!C2","v":"59511.000102/2026-55"}]
[null,"Responsável",{"$f":"'Peixe 50% PB Farelo'!C3","v":"JHONES DE LIMA VIEIRA"}]
[null,"Área de Origem",{"$f":"'Peixe 50% PB Farelo'!C4","v":"14ª GTR"}]
[null,"Data da pesquisa",{"$f":"'Peixe 50% PB Farelo'!C5","v":"Janeiro/2026 - Fevereiro/2026"}]
[]
[null,"ITEM:","Ração extrusada para peixe onívoro 32% PB – Proteína Bruta Mín.: 32%, granulometria 6 a 8 mm. Data de validade não inferior a 6 meses.",null,null,null,"UNIDADE DE MEDIDA:",{"$f":"'Peixe 50% PB Farelo'!H7","v":"kg"},"QUANTIDADE:",75000,null,null,"Tabela auxiliar de metodologias para exclusão de preços",{"$nulls":7},"Automática (menor CV)"]
[null,"LICITAÇÕES ANTERIORES",{"$nulls":10},"Licitações Anteriores - Outliers",{"$nulls":7},{"$f":"M19","v":"Outliers"}]
[null,"Órgão","Edital/Ano - Nº do Lote / Item","Quantidade","Valor Unitário","Data","índice de atualização (nome)","Variação acumulada do índice (%)","Preço unitário atualizado","Utilizar?  (Sim/Não)",null,null,"Utilizar?",{"$nulls":5},"Por critério do(a) analista",null,{"$f":"N19","v":"Grupos - Todos"}]
[null,"14ª SR - Fortaleza/CE","Edital 90007/2024 - Item 8",37245,2.77,"2025-01-02","IPA-EP-DI Suprimentos agropecuários",{"$f":"(I10/E10)-1","v":1.6540957444201254E-2},{"$f":"IF(ISBLANK(E10),\"\",E10*(1+(INDEX('índice de atualização'!B:B,MATCH(G10,'índice de atualização'!B:B,0)+COUNTA('índice de atualização'!B:B)-1)-INDEX('índice de atualização'!B:B,MATCH(TEXT(F10,\"MM/AAAA\"),'índice de atualização'!A:A,0)))/INDEX('índice de atualização'!B:B,MATCH(TEXT(F10,\"MM/AAAA\"),'índice de atualização'!A:A,0))))","v":2.8158184521204377},{"$f":"IF(ISNUMBER(I10),IF($J$34<>$S$9,M10,S10),\"\")","v":"Sim"},null,null,{"$f":"IF(ISNUMBER(I10),IF(OR(I10<_xlfn.QUARTILE.INC($I$10:$I$30,1)-1.5*(_xlfn.QUARTILE.INC($I$10:I30,3)-_xlfn.QUARTILE.INC($I$10:$I$30,1)),I10>_xlfn.QUARTILE.INC($I$10:$I$30,3)+1.5*(_xlfn.QUARTILE.INC($I$10:$I$30,3)-_xlfn.QUARTILE.INC($I$10:$I$30,1))),\"Não\",\"Sim\"),\"\")","v":"Sim"},{"$nulls":7},{"$f":"O19","v":"Grupos - Sem o maior"}]
[null,"14ª SR - Fortaleza/CE","Edital 90007/2024 - Item 16",6550,2.75,"2025-02-18","IPA-EP-DI Suprimentos agropecuários",{"$f":"(I11/E11)-1","v":4.5072426012993105E-4},{"$f":"IF(ISBLANK(E11),\"\",E11*(1+(INDEX('índice de atualização'!B:B,MATCH(G11,'índice de atualização'!B:B,0)+COUNTA('índice de atualização'!B:B)-1)-INDEX('índice de atualização'!B:B,MATCH(TEXT(F11,\"MM/AAAA\"),'índice de atualização'!A:A,0)))/INDEX('índice de atualização'!B:B,MATCH(TEXT(F11,\"MM/AAAA\"),'índice de atualização'!A:A,0))))","v":2.7512394917153573},{"$f":"IF(ISNUMBER(I11),IF($J$34<>$S$8,M11,S11),\"\")","v":"Sim"},null,null,{"$f":"IF(ISNUMBER(I11),IF(OR(I11<_xlfn.QUARTILE.INC($I$10:$I$30,1)-1.5*(_xlfn.QUARTILE.INC($I$10:I31,3)-_xlfn.QUARTILE.INC($I$10:$I$30,1)),I11>_xlfn.QUARTILE.INC($I$10:$I$30,3)+1.5*(_xlfn.QUARTILE.INC($I$10:$I$30,3)-_xlfn.QUARTILE.INC($I$10:$I$30,1))),\"Não\",\"Sim\"),\"\")","v":"Sim"},{"$nulls":7},{"$f":"P19","v":"Grupos - Sem o menor"}]
[null,"Codevasf Sede","Edital 90057/2025 - Item 2",{"$f":"6860*25","v":171500},{"$f":"94.2/25","v":3.7680000000000002},"2025-12-08","IPA-EP-DI Suprimentos agropecuários",{"$f":"(I12/E12)-1","v":0},{"$f":"IF(ISBLANK(E12),\"\",E12*(1+(INDEX('índice de atualização'!B:B,MATCH(G12,'índice de atualização'!B:B,0)+COUNTA('índice de atualização'!B:B)-1)-INDEX('índice de atualização'!B:B,MATCH(TEXT(F12,\"MM/AAAA\"),'índice de atualização'!A:A,0)))/INDEX('índice de atualização'!B:B,MATCH(TEXT(F12,\"MM/AAAA\"),'índice de atualização'!A:A,0))))","v":3.7680000000000002},"Sim",null,null,{"$f":"IF(ISNUMBER(I12),IF(OR(I12<_xlfn.QUARTILE.INC($I$10:$I$30,1)-1.5*(_xlfn.QUARTILE.INC($I$10:I32,3)-_xlfn.QUARTILE.INC($I$10:$I$30,1)),I12>_xlfn.QUARTILE.INC($I$10:$I$30,3)+1.5*(_xlfn.QUARTILE.INC($I$10:$I$30,3)-_xlfn.QUARTILE.INC($I$10:$I$30,1))),\"Não\",\"Sim\"),\"\")","v":"Sim"},{"$f":"$M$12","v":"Sim"},{"$f":"$M$12","v":"Sim"},{"$f":"$M$12","v":"Sim"},{"$f":"$M$12","v":"Sim"},{"$f":"$M$12","v":"Sim"},null,null,{"$f":"Q19","v":"Grupos - Sem o maior e sem o menor"}]
[null,"11ª SR - Amapá/AP","Edital 90126/2024 - Item 3 e 7",87500,3.74,"2025-05-13","IPA-EP-DI Suprimentos agropecuários",-3.9878408355853878E-2,{"$f":"IF(ISBLANK(E13),\"\",E13*(1+(INDEX('índice de atualização'!B:B,MATCH(G13,'índice de atualização'!B:B,0)+COUNTA('índice de atualização'!B:B)-1)-INDEX('índice de atualização'!B:B,MATCH(TEXT(F13,\"MM/AAAA\"),'índice de atualização'!A:A,0)))/INDEX('índice de atualização'!B:B,MATCH(TEXT(F13,\"MM/AAAA\"),'índice de atualização'!A:A,0))))","v":3.5908547527491068},"Sim",null,null,{"$f":"IF(ISNUMBER(I13),IF(OR(I13<_xlfn.QUARTILE.INC($I$10:$I$30,1)-1.5*(_xlfn.QUARTILE.INC($I$10:I33,3)-_xlfn.QUARTILE.INC($I$10:$I$30,1)),I13>_xlfn.QUARTILE.INC($I$10:$I$30,3)+1.5*(_xlfn.QUARTILE.INC($I$10:$I$30,3)-_xlfn.QUARTILE.INC($I$10:$I$30,1))),\"Não\",\"Sim\"),\"\")","v":"Sim"},{"$f":"$M$13","v":"Sim"},{"$f":"$M$13","v":"Sim"},{"$f":"$M$13","v":"Sim"},{"$f":"$M$13","v":"Sim"},{"$f":"$M$13","v":"Sim"},null,null,{"$f":"R19","v":"Grupos - Sem os dois maiores"}]
[null,"4ª SR - Aracaju/SE","Edital 90002/2025 - Item 4",6000,3.48,"2025-07-11","IPA-EP-DI Suprimentos agropecuários",{"$f":"(I14/E14)-1","v":-2.2368348389686266E-2},{"$f":"IF(ISBLANK(E14),\"\",E14*(1+(INDEX('índice de atualização'!B:B,MATCH(G14,'índice de atualização'!B:B,0)+COUNTA('índice de atualização'!B:B)-1)-INDEX('índice de atualização'!B:B,MATCH(TEXT(F14,\"MM/AAAA\"),'índice de atualização'!A:A,0)))/INDEX('índice de atualização'!B:B,MATCH(TEXT(F14,\"MM/AAAA\"),'índice de atualização'!A:A,0))))","v":3.4021581476038918},"Sim",null,null,{"$f":"IF(ISNUMBER(I14),IF(OR(I14<_xlfn.QUARTILE.INC($I$10:$I$30,1)-1.5*(_xlfn.QUARTILE.INC($I$10:I34,3)-_xlfn.QUARTILE.INC($I$10:$I$30,1)),I14>_xlfn.QUARTILE.INC($I$10:$I$30,3)+1.5*(_xlfn.QUARTILE.INC($I$10:$I$30,3)-_xlfn.QUARTILE.INC($I$10:$I$30,1))),\"Não\",\"Sim\"),\"\")","v":"Sim"},{"$f":"$M$14","v":"Sim"},"Sim","Sim","Sim","Sim",null,null,{"$f":"S19","v":"Por critério do(a) analista"}]
[{"$nulls":8},{"$f":"IF(ISBLANK(E15),\"\",E15*(1+(INDEX('índice de atualização'!B:B,MATCH(G15,'índice de atualização'!B:B,0)+COUNTA('índice de atualização'!B:B)-1)-INDEX('índice de atualização'!B:B,MATCH(TEXT(F15,\"MM/AAAA\"),'índice de atualização'!A:A,0)))/INDEX('índice de atualização'!B:B,MATCH(TEXT(F15,\"MM/AAAA\"),'índice de atualização'!A:A,0))))","v":""},"",null,null,{"$f":"IF(ISNUMBER(I15),IF(OR(I15<_xlfn.QUARTILE.INC($I$10:$I$30,1)-1.5*(_xlfn.QUARTILE.INC($I$10:I35,3)-_xlfn.QUARTILE.INC($I$10:$I$30,1)),I15>_xlfn.QUARTILE.INC($I$10:$I$30,3)+1.5*(_xlfn.QUARTILE.INC($I$10:$I$30,3)-_xlfn.QUARTILE.INC($I$10:$I$30,1))),\"Não\",\"Sim\"),\"\")","v":""},"Sim","Sim","Sim","Sim","Sim"]
[{"$nulls":8},{"$f":"IF(ISBLANK(E16),\"\",E16*(1+(INDEX('índice de atualização'!B:B,MATCH(G16,'índice de atualização'!B:B,0)+COUNTA('índice de atualização'!B:B)-1)-INDEX('índice de atualização'!B:B,MATCH(TEXT(F16,\"MM/AAAA\"),'índice de atualização'!A:A,0)))/INDEX('índice de atualização'!B:B,MATCH(TEXT(F16,\"MM/AAAA\"),'índice de atualização'!A:A,0))))","v":""},"",null,null,{"$f":"IF(ISNUMBER(I16),IF(OR(I16<_xlfn.QUARTILE.INC($I$10:$I$30,1)-1.5*(_xlfn.QUARTILE.INC($I$10:I37,3)-_xlfn.QUARTILE.INC($I$10:$I$30,1)),I16>_xlfn.QUARTILE.INC($I$10:$I$30,3)+1.5*(_xlfn.QUARTILE.INC($I$10:$I$30,3)-_xlfn.QUARTILE.INC($I$10:$I$30,1))),\"Não\",\"Sim\"),\"\")","v":""},{"$f":"$M$16","v":""},{"$f":"$M$16","v":""},{"$f":"$M$16","v":""},{"$f":"$M$16","v":""},{"$f":"$M$16","v":""}]
[{"$nulls":8},{"$f":"IF(ISBLANK(E17),\"\",E17*(1+(INDEX('índice de atualização'!B:B,MATCH(G17,'índice de atualização'!B:B,0)+COUNTA('índice de atualização'!B:B)-1)-INDEX('índice de atualização'!B:B,MATCH(TEXT(F17,\"MM/AAAA\"),'índice de atualização'!A:A,0)))/INDEX('índice de atualização'!B:B,MATCH(TEXT(F17,\"MM/AAAA\"),'índice de atualização'!A:A,0))))","v":""},"",null,null,{"$f":"IF(ISNUMBER(I17),IF(OR(I17<_xlfn.QUARTILE.INC($I$10:$I$30,1)-1.5*(_xlfn.QUARTILE.INC($I$10:I40,3)-_xlfn.QUARTILE.INC($I$10:$I$30,1)),I17>_xlfn.QUARTILE.INC($I$10:$I$30,3)+1.5*(_xlfn.QUARTILE.INC($I$10:$I$30,3)-_xlfn.QUARTILE.INC($I$10:$I$30,1))),\"Não\",\"Sim\"),\"\")","v":""},{"$f":"$M$17","v":""},{"$f":"$M$17","v":""},{"$f":"$M$17","v":""},{"$f":"$M$17","v":""},{"$f":"$M$17","v":""}]
[null,"COTAÇÕES DE MERCADO",{"$nulls":10},"Cotações"]
[null,"Empresa",{"$nulls":5},"Data","Preço Unitário","Utilizar? (Sim/Não)",null,null,"Outliers","Grupos - Todos","Grupos - Sem o maior","Grupos - Sem o menor","Grupos - Sem o maior e sem o menor","Grupos - Sem os dois maiores","Por critério do(a) analista"]
[null,"Agrosolo - Guabi",{"$nulls":5},"2026-02-10",{"$f":"93.59/25","v":3.7436000000000003},{"$f":"IF(ISNUMBER(I20),IF($J$34=$M$19,M20,IF($J$34=$N$19,N20,IF($J$34=$O$19,O20,IF($J$34=$P$19,P20,IF($J$34=$Q$19,Q20,IF($J$34=$R$19,R20,IF($J$34=$S$19,S20,\"\"))))))),\"\")","v":"Sim"},null,null,{"$f":"IF(ISNUMBER(I20),IF(OR(I20<_xlfn.QUARTILE.INC($I$10:$I$30,1)-1.5*(_xlfn.QUARTILE.INC($I$10:I41,3)-_xlfn.QUARTILE.INC($I$10:$I$30,1)),I20>_xlfn.QUARTILE.INC($I$10:$I$30,3)+1.5*(_xlfn.QUARTILE.INC($I$10:$I$30,3)-_xlfn.QUARTILE.INC($I$10:$I$30,1))),\"Não\",\"Sim\"),\"\")","v":"Sim"},{"$f":"IF(ISNUMBER(I20),\"Sim\",\"\")","v":"Sim"},{"$f":"IF(ISNUMBER(I20),IF(_xlfn.RANK.EQ(I20,$I$20:$I$30)=1,\"Não\",\"Sim\"),\"\")","v":"Sim"},{"$f":"IF(ISNUMBER(I20),IF(_xlfn.RANK.EQ(I20,$I$20:$I$30)=COUNT($I$20:$I$30),\"Não\",\"Sim\"),\"\")","v":"Sim"},{"$f":"IF(O20=\"\",\"\",IF(AND(O20=\"Sim\",P20=\"Sim\"),\"Sim\",\"Não\"))","v":"Sim"},{"$f":"IF(ISNUMBER(I20),IF(_xlfn.RANK.EQ(I20,$I$20:$I$30)<=2,\"Não\",\"Sim\"),\"\")","v":"Sim"}]
[null,"Supra - Aqua Line",{"$nulls":5},"2026-02-10",{"$f":"199/25","v":7.96},"Não",null,null,{"$f":"IF(ISNUMBER(I21),IF(OR(I21<_xlfn.QUARTILE.INC($I$10:$I$30,1)-1.5*(_xlfn.QUARTILE.INC($I$10:I41,3)-_xlfn.QUARTILE.INC($I$10:$I$30,1)),I21>_xlfn.QUARTILE.INC($I$10:$I$30,3)+1.5*(_xlfn.QUARTILE.INC($I$10:$I$30,3)-_xlfn.QUARTILE.INC($I$10:$I$30,1))),\"Não\",\"Sim\"),\"\")","v":"Não"},{"$f":"IF(ISNUMBER(I21),\"Sim\",\"\")","v":"Sim"},"Não","Sim",{"$f":"IF(O21=\"\",\"\",IF(AND(O21=\"Sim\",P21=\"Sim\"),\"Sim\",\"Não\"))","v":"Não"},"Não"]
[null,"Samaria Rações LTDA",{"$nulls":5},"2026-02-09",{"$f":"72/25","v":2.88},"Sim",null,null,{"$f":"IF(ISNUMBER(I22),IF(OR(I22<_xlfn.QUARTILE.INC($I$10:$I$30,1)-1.5*(_xlfn.QUARTILE.INC($I$10:I41,3)-_xlfn.QUARTILE.INC($I$10:$I$30,1)),I22>_xlfn.QUARTILE.INC($I$10:$I$30,3)+1.5*(_xlfn.QUARTILE.INC($I$10:$I$30,3)-_xlfn.QUARTILE.INC($I$10:$I$30,1))),\"Não\",\"Sim\"),\"\")","v":"Sim"},"Sim","Sim","Não","Não","Sim"]
[null,"Integral Mix Agroindustria",{"$nulls":5},"2026-02-07",{"$f":"78.78/25","v":3.1512000000000002},"Sim",null,null,{"$f":"IF(ISNUMBER(I23),IF(OR(I23<_xlfn.QUARTILE.INC($I$10:$I$30,1)-1.5*(_xlfn.QUARTILE.INC($I$10:I41,3)-_xlfn.QUARTILE.INC($I$10:$I$30,1)),I23>_xlfn.QUARTILE.INC($I$10:$I$30,3)+1.5*(_xlfn.QUARTILE.INC($I$10:$I$30,3)-_xlfn.QUARTILE.INC($I$10:$I$30,1))),\"Não\",\"Sim\"),\"\")","v":"Sim"},"Sim","Sim","Sim","Sim","Sim"]
[null,"Comercial do Carmo ME",{"$nulls":5},"2026-02-12",{"$f":"97/25","v":3.88},"Não",null,null,{"$f":"IF(ISNUMBER(I24),IF(OR(I24<_xlfn.QUARTILE.INC($I$10:$I$30,1)-1.5*(_xlfn.QUARTILE.INC($I$10:I42,3)-_xlfn.QUARTILE.INC($I$10:$I$30,1)),I24>_xlfn.QUARTILE.INC($I$10:$I$30,3)+1.5*(_xlfn.QUARTILE.INC($I$10:$I$30,3)-_xlfn.QUARTILE.INC($I$10:$I$30,1))),\"Não\",\"Sim\"),\"\")","v":"Sim"},"Sim","Sim","Sim","Sim","Não"]
[{"$nulls":9},"",null,null,{"$f":"IF(ISNUMBER(I25),IF(OR(I25<_xlfn.QUARTILE.INC($I$10:$I$30,1)-1.5*(_xlfn.QUARTILE.INC($I$10:I43,3)-_xlfn.QUARTILE.INC($I$10:$I$30,1)),I25>_xlfn.QUARTILE.INC($I$10:$I$30,3)+1.5*(_xlfn.QUARTILE.INC($I$10:$I$30,3)-_xlfn.QUARTILE.INC($I$10:$I$30,1))),\"Não\",\"Sim\"),\"\")","v":""},"","","","",""]
[{"$nulls":9},"",null,null,{"$f":"IF(ISNUMBER(I26),IF(OR(I26<_xlfn.QUARTILE.INC($I$10:$I$30,1)-1.5*(_xlfn.QUARTILE.INC($I$10:I41,3)-_xlfn.QUARTILE.INC($I$10:$I$30,1)),I26>_xlfn.QUARTILE.INC($I$10:$I$30,3)+1.5*(_xlfn.QUARTILE.INC($I$10:$I$30,3)-_xlfn.QUARTILE.INC($I$10:$I$30,1))),\"Não\",\"Sim\"),\"\")","v":""},"","","","",""]
[{"$nulls":9},"",null,null,{"$f":"IF(ISNUMBER(I27),IF(OR(I27<_xlfn.QUARTILE.INC($I$10:$I$30,1)-1.5*(_xlfn.QUARTILE.INC($I$10:I41,3)-_xlfn.QUARTILE.INC($I$10:$I$30,1)),I27>_xlfn.QUARTILE.INC($I$10:$I$30,3)+1.5*(_xlfn.QUARTILE.INC($I$10:$I$30,3)-_xlfn.QUARTILE.INC($I$10:$I$30,1))),\"Não\",\"Sim\"),\"\")","v":""},"","","","",""]
[{"$nulls":9},"",null,null,{"$f":"IF(ISNUMBER(I28),IF(OR(I28<_xlfn.QUARTILE.INC($I$10:$I$30,1)-1.5*(_xlfn.QUARTILE.INC($I$10:I41,3)-_xlfn.QUARTILE.INC($I$10:$I$30,1)),I28>_xlfn.QUARTILE.INC($I$10:$I$30,3)+1.5*(_xlfn.QUARTILE.INC($I$10:$I$30,3)-_xlfn.QUARTILE.INC($I$10:$I$30,1))),\"Não\",\"Sim\"),\"\")","v":""},"","","","",""]
[{"$nulls":9},"",null,null,{"$f":"IF(ISNUMBER(I29),IF(OR(I29<_xlfn.QUARTILE.INC($I$10:$I$30,1)-1.5*(_xlfn.QUARTILE.INC($I$10:I41,3)-_xlfn.QUARTILE.INC($I$10:$I$30,1)),I29>_xlfn.QUARTILE.INC($I$10:$I$30,3)+1.5*(_xlfn.QUARTILE.INC($I$10:$I$30,3)-_xlfn.QUARTILE.INC($I$10:$I$30,1))),\"Não\",\"Sim\"),\"\")","v":""},"","","","",""]
[{"$nulls":9},"",null,null,{"$f":"IF(ISNUMBER(I30),IF(OR(I30<_xlfn.QUARTILE.INC($I$10:$I$30,1)-1.5*(_xlfn.QUARTILE.INC($I$10:I41,3)-_xlfn.QUARTILE.INC($I$10:$I$30,1)),I30>_xlfn.QUARTILE.INC($I$10:$I$30,3)+1.5*(_xlfn.QUARTILE.INC($I$10:$I$30,3)-_xlfn.QUARTILE.INC($I$10:$I$30,1))),\"Não\",\"Sim\"),\"\")","v":""},"","","","",""]
[null,"Observações:",{"$nulls":6},"CV:",{"$f":"IF($J$34=\"\",\"Selecione metodologia para exclusão de preços\",IF(COUNTIF($J$10:$J$30,\"Sim\")<3,\"N/D (são necessários pelo menos 3 preços)\",_xlfn.STDEV.S(IF($J$10:$J$30=\"Sim\",$I$10:$I$30))/AVERAGE(IF($J$10:$J$30=\"Sim\",$I$10:$I$30))))","v":0.12867524962062329},null,"Média (Cotações)",{"$f":"IF(COUNTIF(M20:M30,\"Sim\")<3,\"N/D (são necessários pelo menos 3 preços)\",AVERAGE(IF(M20:M30=\"Sim\",$I20:$I30)))","v":3.4136999999999995},{"$f":"IF(COUNTIF(N20:N30,\"Sim\")<3,\"N/D (são necessários pelo menos 3 preços)\",AVERAGE(IF(N20:N30=\"Sim\",$I20:$I30)))","v":4.3229600000000001},{"$f":"IF(COUNTIF(O20:O30,\"Sim\")<3,\"N/D (são necessários pelo menos 3 preços)\",AVERAGE(IF(O20:O30=\"Sim\",$I20:$I30)))","v":3.4136999999999995},{"$f":"IF(COUNTIF(P20:P30,\"Sim\")<3,\"N/D (são necessários pelo menos 3 preços)\",AVERAGE(IF(P20:P30=\"Sim\",$I20:$I30)))","v":4.6837},{"$f":"IF(COUNTIF(Q20:Q30,\"Sim\")<3,\"N/D (são necessários pelo menos 3 preços)\",AVERAGE(IF(Q20:Q30=\"Sim\",$I20:$I30)))","v":3.5915999999999997},{"$f":"IF(COUNTIF(R20:R30,\"Sim\")<3,\"N/D (são necessários pelo menos 3 preços)\",AVERAGE(IF(R20:R30=\"Sim\",$I20:$I30)))","v":3.2582666666666662},{"$f":"IF(COUNTIF(S20:S30,\"Sim\")<3,\"N/D (são necessários pelo menos 3 preços)\",AVERAGE(IF(S20:S30=\"Sim\",$I20:$I30)))","v":"N/D (são necessários pelo menos 3 preços)"}]
[{"$nulls":8},"Média:",{"$f":"IF($J$34=\"\",\"Selecione metodologia para exclusão de preços\",AVERAGE(IF($J$10:$J$30=\"Sim\",$I$10:$I$30)))","v":3.2628588555235991},null,"Mediana (Cotações)",{"$f":"IF(COUNTIF(M20:M30,\"Sim\")<3,\"N/D (são necessários pelo menos 3 preços)\",MEDIAN(IF(M20:M30=\"Sim\",$I20:$I30)))","v":3.4474},{"$f":"IF(COUNTIF(N20:N30,\"Sim\")<3,\"N/D (são necessários pelo menos 3 preços)\",MEDIAN(IF(N20:N30=\"Sim\",$I20:$I30)))","v":3.7436000000000003},{"$f":"IF(COUNTIF(O20:O30,\"Sim\")<3,\"N/D (são necessários pelo menos 3 preços)\",MEDIAN(IF(O20:O30=\"Sim\",$I20:$I30)))","v":3.4474},{"$f":"IF(COUNTIF(P20:P30,\"Sim\")<3,\"N/D (são necessários pelo menos 3 preços)\",MEDIAN(IF(P20:P30=\"Sim\",$I20:$I30)))","v":3.8117999999999999},{"$f":"IF(COUNTIF(Q20:Q30,\"Sim\")<3,\"N/D (são necessários pelo menos 3 preços)\",MEDIAN(IF(Q20:Q30=\"Sim\",$I20:$I30)))","v":3.7436000000000003},{"$f":"IF(COUNTIF(R20:R30,\"Sim\")<3,\"N/D (são necessários pelo menos 3 preços)\",MEDIAN(IF(R20:R30=\"Sim\",$I20:$I30)))","v":3.1512000000000002},{"$f":"IF(COUNTIF(S20:S30,\"Sim\")<3,\"N/D (são necessários pelo menos 3 preços)\",MEDIAN(IF(S20:S30=\"Sim\",$I20:$I30)))","v":"N/D (são necessários pelo menos 3 preços)"}]
[{"$nulls":8},"Mediana:",{"$f":"IF($J$34=\"\",\"Selecione metodologia para exclusão de preços\",MEDIAN(IF($J$10:$J$30=\"Sim\",$I$10:$I$30)))","v":3.276679073801946},null,"CV (Cotações)",{"$f":"IF(COUNTIF(M20:M30,\"Sim\")<3,\"N/D (são necessários pelo menos 3 preços)\",_xlfn.STDEV.S(IF(M20:M30=\"Sim\",$I20:$I30))/AVERAGE(IF(M20:M30=\"Sim\",$I20:$I30)))","v":0.1394672359513538},{"$f":"IF(COUNTIF(N20:N30,\"Sim\")<3,\"N/D (são necessários pelo menos 3 preços)\",_xlfn.STDEV.S(IF(N20:N30=\"Sim\",$I20:$I30))/AVERAGE(IF(N20:N30=\"Sim\",$I20:$I30)))","v":0.47989187063670141},{"$f":"IF(COUNTIF(O20:O30,\"Sim\")<3,\"N/D (são necessários pelo menos 3 preços)\",_xlfn.STDEV.S(IF(O20:O30=\"Sim\",$I20:$I30))/AVERAGE(IF(O20:O30=\"Sim\",$I20:$I30)))","v":0.1394672359513538},{"$f":"IF(COUNTIF(P20:P30,\"Sim\")<3,\"N/D (são necessários pelo menos 3 preços)\",_xlfn.STDEV.S(IF(P20:P30=\"Sim\",$I20:$I30))/AVERAGE(IF(P20:P30=\"Sim\",$I20:$I30)))","v":0.47120660633613337},{"$f":"IF(COUNTIF(Q20:Q30,\"Sim\")<3,\"N/D (são necessários pelo menos 3 preços)\",_xlfn.STDEV.S(IF(Q20:Q30=\"Sim\",$I20:$I30))/AVERAGE(IF(Q20:Q30=\"Sim\",$I20:$I30)))","v":0.10787594250953554},{"$f":"IF(COUNTIF(R20:R30,\"Sim\")<3,\"N/D (são necessários pelo menos 3 preços)\",_xlfn.STDEV.S(IF(R20:R30=\"Sim\",$I20:$I30))/AVERAGE(IF(R20:R30=\"Sim\",$I20:$I30)))","v":0.13554543547223069},{"$f":"IF(COUNTIF(S20:S30,\"Sim\")<3,\"N/D (são necessários pelo menos 3 preços)\",_xlfn.STDEV.S(IF(S20:S30=\"Sim\",$I20:$I30))/AVERAGE(IF(S20:S30=\"Sim\",$I20:$I30)))","v":"N/D (são necessários pelo menos 3 preços)"}]
[null,"Metodologia de exclusão de preços adotada:",{"$nulls":7},{"$f":"IF(M39=\"\",INDEX(M19:S19,MATCH(MIN(M36:S36),M36:S36,0)),M39)","v":"Grupos - Sem os dois maiores"},null,"Média",{"$f":"IF(SUM(COUNTIF($M$10:$M$17,\"Sim\")) + SUM(COUNTIF(M20:M30,\"Sim\")) < 3,\n   \"N/D (são necessários pelo menos 3 preços)\",\n   IFERROR(AVERAGE(_xlfn._xlws.FILTER($I$10:$I$17,$M$10:$M$17=\"Sim\"), _xlfn._xlws.FILTER($I$20:$I$30,M20:M30=\"Sim\")),M31))","v":3.3314300937987547},{"$f":"IF(SUM(COUNTIF($M$10:$M$17,\"Sim\")) + SUM(COUNTIF(N20:N30,\"Sim\")) < 3,\n   \"N/D (são necessários pelo menos 3 preços)\",\n   IFERROR(AVERAGE(_xlfn._xlws.FILTER($I$10:$I$17,$M$10:$M$17=\"Sim\"), _xlfn._xlws.FILTER($I$20:$I$30,N20:N30=\"Sim\")),N31))","v":3.7942870844188796},{"$f":"IF(SUM(COUNTIF($M$10:$M$17,\"Sim\")) + SUM(COUNTIF(O20:O30,\"Sim\")) < 3,\n   \"N/D (são necessários pelo menos 3 preços)\",\n   IFERROR(AVERAGE(_xlfn._xlws.FILTER($I$10:$I$17,$M$10:$M$17=\"Sim\"), _xlfn._xlws.FILTER($I$20:$I$30,O20:O30=\"Sim\")),O31))","v":3.3314300937987547},{"$f":"IF(SUM(COUNTIF($M$10:$M$17,\"Sim\")) + SUM(COUNTIF(P20:P30,\"Sim\")) < 3,\n   \"N/D (são necessários pelo menos 3 preços)\",\n   IFERROR(AVERAGE(_xlfn._xlws.FILTER($I$10:$I$17,$M$10:$M$17=\"Sim\"), _xlfn._xlws.FILTER($I$20:$I$30,P20:P30=\"Sim\")),P31))","v":3.8958745382431994},{"$f":"IF(SUM(COUNTIF($M$10:$M$17,\"Sim\")) + SUM(COUNTIF(Q20:Q30,\"Sim\")) < 3,\n   \"N/D (são necessários pelo menos 3 preços)\",\n   IFERROR(AVERAGE(_xlfn._xlws.FILTER($I$10:$I$17,$M$10:$M$17=\"Sim\"), _xlfn._xlws.FILTER($I$20:$I$30,Q20:Q30=\"Sim\")),Q31))","v":3.3878588555235991},{"$f":"IF(SUM(COUNTIF($M$10:$M$17,\"Sim\")) + SUM(COUNTIF(R20:R30,\"Sim\")) < 3,\n   \"N/D (são necessários pelo menos 3 preços)\",\n   IFERROR(AVERAGE(_xlfn._xlws.FILTER($I$10:$I$17,$M$10:$M$17=\"Sim\"), _xlfn._xlws.FILTER($I$20:$I$30,R20:R30=\"Sim\")),R31))","v":3.2628588555235991},{"$f":"IF(SUM(COUNTIF($S$10:$S$17,\"Sim\")) + SUM(COUNTIF(S20:S30,\"Sim\")) < 3,\n   \"N/D (são necessários pelo menos 3 preços)\",\n   IFERROR(AVERAGE(_xlfn._xlws.FILTER($I$10:$I$17,$S$10:$S$17=\"Sim\"), _xlfn._xlws.FILTER($I$20:$I$30,S20:S30=\"Sim\")),S31))","v":"N/D (são necessários pelo menos 3 preços)"}]
[{"$nulls":11},"Mediana",{"$f":"IF(SUM(COUNTIF($M$10:$M$17,\"Sim\")) + SUM(COUNTIF(M20:M30,\"Sim\")) < 3,\n   \"N/D (são necessários pelo menos 3 preços)\",\n   IFERROR(MEDIAN(_xlfn._xlws.FILTER($I$10:$I$17,$M$10:$M$17=\"Sim\"), _xlfn._xlws.FILTER($I$20:$I$30,M20:M30=\"Sim\")),M31))","v":3.4021581476038918},{"$f":"IF(SUM(COUNTIF($M$10:$M$17,\"Sim\")) + SUM(COUNTIF(N20:N30,\"Sim\")) < 3,\n   \"N/D (são necessários pelo menos 3 preços)\",\n   IFERROR(MEDIAN(_xlfn._xlws.FILTER($I$10:$I$17,$M$10:$M$17=\"Sim\"), _xlfn._xlws.FILTER($I$20:$I$30,N20:N30=\"Sim\")),N31))","v":3.4965064501764993},{"$f":"IF(SUM(COUNTIF($M$10:$M$17,\"Sim\")) + SUM(COUNTIF(O20:O30,\"Sim\")) < 3,\n   \"N/D (são necessários pelo menos 3 preços)\",\n   IFERROR(MEDIAN(_xlfn._xlws.FILTER($I$10:$I$17,$M$10:$M$17=\"Sim\"), _xlfn._xlws.FILTER($I$20:$I$30,O20:O30=\"Sim\")),O31))","v":3.4021581476038918},{"$f":"IF(SUM(COUNTIF($M$10:$M$17,\"Sim\")) + SUM(COUNTIF(P20:P30,\"Sim\")) < 3,\n   \"N/D (são necessários pelo menos 3 preços)\",\n   IFERROR(MEDIAN(_xlfn._xlws.FILTER($I$10:$I$17,$M$10:$M$17=\"Sim\"), _xlfn._xlws.FILTER($I$20:$I$30,P20:P30=\"Sim\")),P31))","v":3.5908547527491068},{"$f":"IF(SUM(COUNTIF($M$10:$M$17,\"Sim\")) + SUM(COUNTIF(Q20:Q30,\"Sim\")) < 3,\n   \"N/D (são necessários pelo menos 3 preços)\",\n   IFERROR(MEDIAN(_xlfn._xlws.FILTER($I$10:$I$17,$M$10:$M$17=\"Sim\"), _xlfn._xlws.FILTER($I$20:$I$30,Q20:Q30=\"Sim\")),Q31))","v":3.4965064501764993},{"$f":"IF(SUM(COUNTIF($M$10:$M$17,\"Sim\")) + SUM(COUNTIF(R20:R30,\"Sim\")) < 3,\n   \"N/D (são necessários pelo menos 3 preços)\",\n   IFERROR(MEDIAN(_xlfn._xlws.FILTER($I$10:$I$17,$M$10:$M$17=\"Sim\"), _xlfn._xlws.FILTER($I$20:$I$30,R20:R30=\"Sim\")),R31))","v":3.276679073801946},{"$f":"IF(SUM(COUNTIF($S$10:$S$17,\"Sim\")) + SUM(COUNTIF(S20:S30,\"Sim\")) < 3,\n   \"N/D (são necessários pelo menos 3 preços)\",\n   IFERROR(MEDIAN(_xlfn._xlws.FILTER($I$10:$I$17,$S$10:$S$17=\"Sim\"), _xlfn._xlws.FILTER($I$20:$I$30,S20:S30=\"Sim\")),S31))","v":"N/D (são necessários pelo menos 3 preços)"}]
[{"$nulls":11},"CV",{"$f":"IF(SUM(COUNTIF($M$10:$M$17,\"Sim\")) + SUM(COUNTIF(M20:M30,\"Sim\")) < 3,\n   \"N/D (são necessários pelo menos 3 preços)\",\n   IFERROR(ROUND(_xlfn.STDEV.S(_xlfn._xlws.FILTER($I$10:$I$17,$M$10:$M$17=\"Sim\"), _xlfn._xlws.FILTER($I$20:$I$30,M20:M30=\"Sim\")) /\n   AVERAGE(_xlfn._xlws.FILTER($I$10:$I$17,$M$10:$M$17=\"Sim\"), _xlfn._xlws.FILTER($I$20:$I$30,M20:M30=\"Sim\")),4),M33)\n)","v":0.1331},{"$f":"IF(SUM(COUNTIF($M$10:$M$17,\"Sim\")) + SUM(COUNTIF(N20:N30,\"Sim\")) < 3,\n   \"N/D (são necessários pelo menos 3 preços)\",\n   IFERROR(ROUND(_xlfn.STDEV.S(_xlfn._xlws.FILTER($I$10:$I$17,$M$10:$M$17=\"Sim\"), _xlfn._xlws.FILTER($I$20:$I$30,N20:N30=\"Sim\")) /\n   AVERAGE(_xlfn._xlws.FILTER($I$10:$I$17,$M$10:$M$17=\"Sim\"), _xlfn._xlws.FILTER($I$20:$I$30,N20:N30=\"Sim\")),4),N33)\n)","v":0.4012},{"$f":"IF(SUM(COUNTIF($M$10:$M$17,\"Sim\")) + SUM(COUNTIF(O20:O30,\"Sim\")) < 3,\n   \"N/D (são necessários pelo menos 3 preços)\",\n   IFERROR(ROUND(_xlfn.STDEV.S(_xlfn._xlws.FILTER($I$10:$I$17,$M$10:$M$17=\"Sim\"), _xlfn._xlws.FILTER($I$20:$I$30,O20:O30=\"Sim\")) /\n   AVERAGE(_xlfn._xlws.FILTER($I$10:$I$17,$M$10:$M$17=\"Sim\"), _xlfn._xlws.FILTER($I$20:$I$30,O20:O30=\"Sim\")),4),O33)\n)","v":0.1331},{"$f":"IF(SUM(COUNTIF($M$10:$M$17,\"Sim\")) + SUM(COUNTIF(P20:P30,\"Sim\")) < 3,\n   \"N/D (são necessários pelo menos 3 preços)\",\n   IFERROR(ROUND(_xlfn.STDEV.S(_xlfn._xlws.FILTER($I$10:$I$17,$M$10:$M$17=\"Sim\"), _xlfn._xlws.FILTER($I$20:$I$30,P20:P30=\"Sim\")) /\n   AVERAGE(_xlfn._xlws.FILTER($I$10:$I$17,$M$10:$M$17=\"Sim\"), _xlfn._xlws.FILTER($I$20:$I$30,P20:P30=\"Sim\")),4),P33)\n)","v":0.40510000000000002},{"$f":"IF(SUM(COUNTIF($M$10:$M$17,\"Sim\")) + SUM(COUNTIF(Q20:Q30,\"Sim\")) < 3,\n   \"N/D (são necessários pelo menos 3 preços)\",\n   IFERROR(ROUND(_xlfn.STDEV.S(_xlfn._xlws.FILTER($I$10:$I$17,$M$10:$M$17=\"Sim\"), _xlfn._xlws.FILTER($I$20:$I$30,Q20:Q30=\"Sim\")) /\n   AVERAGE(_xlfn._xlws.FILTER($I$10:$I$17,$M$10:$M$17=\"Sim\"), _xlfn._xlws.FILTER($I$20:$I$30,Q20:Q30=\"Sim\")),4),Q33)\n)","v":0.1293},{"$f":"IF(SUM(COUNTIF($M$10:$M$17,\"Sim\")) + SUM(COUNTIF(R20:R30,\"Sim\")) < 3,\n   \"N/D (são necessários pelo menos 3 preços)\",\n   IFERROR(ROUND(_xlfn.STDEV.S(_xlfn._xlws.FILTER($I$10:$I$17,$M$10:$M$17=\"Sim\"), _xlfn._xlws.FILTER($I$20:$I$30,R20:R30=\"Sim\")) /\n   AVERAGE(_xlfn._xlws.FILTER($I$10:$I$17,$M$10:$M$17=\"Sim\"), _xlfn._xlws.FILTER($I$20:$I$30,R20:R30=\"Sim\")),4),R33)\n)","v":0.12870000000000001},{"$f":"IF(SUM(COUNTIF($S$10:$S$17,\"Sim\")) + SUM(COUNTIF(S20:S30,\"Sim\")) < 3,\n   \"N/D (são necessários pelo menos 3 preços)\",\n   IFERROR(_xlfn.STDEV.S(_xlfn._xlws.FILTER($I$10:$I$17,$S$10:$S$17=\"Sim\"), _xlfn._xlws.FILTER($I$20:$I$30,S20:S30=\"Sim\")) /\n   AVERAGE(_xlfn._xlws.FILTER($I$10:$I$17,$S$10:$S$17=\"Sim\"), _xlfn._xlws.FILTER($I$20:$I$30,S20:S30=\"Sim\")),S33)\n)","v":"N/D (são necessários pelo menos 3 preços)"}]
[null,"PREÇO UNITÁRIO ESTIMADO ADOTADO:",{"$nulls":7},{"$f":"IF($J$34=\"\",\"Selecione metodologia para exclusão de preços\",MIN(J32:J33))","v":3.2628588555235991},null,"Metodologia sugerida:",{"$f":"IF($M$36=MIN($M$36,$N$36:$R$36),M8,\"Grupos - \"&INDEX({\"Todos\";\"Sem o maior\";\"Sem o menor\";\"Sem o maior e Sem o menor\";\"Sem os dois maiores\"},MATCH(MIN($N$36:$R$36),$N$36:$R$36,0)))","v":"Grupos - Sem os dois maiores"}]
[{"$nulls":11},"Preço estimado sugerido:",{"$f":"IF($M$37=M8,SMALL($M$34:$M$35,1),MIN(INDEX($N$35:$R$35, MATCH(MIN($N$36:$R$36), $N$36:$R$36, 0)),INDEX($N$34:$R$34, MATCH(MIN($N$36:$R$36), $N$36:$R$36, 0))))","v":3.2628588555235991}]
[{"$nulls":11},"Metodologia a adotar:",{"$f":"IF(INDEX(L19:S19,N39)=0,\"\",INDEX(L19:S19,N39))","v":""},1]

{"sheet":"Camarão 40% 700 a 1000","index":8,"n_rows":39,"n_cols":21,"rows_kept":39,"cut":false,"hidden":false,"merged":[[15,12,15,17],[6,2,6,5],[6,12,6,18],[7,1,7,9],[7,12,7,18],[8,12,8,17],[9,12,9,17],[10,12,10,17],[11,12,11,17],[12,12,12,17],[13,12,13,17],[14,12,14,17],[26,1,26,6],[16,12,16,17],[17,1,17,9],[17,12,17,18],[18,1,18,6],[19,1,19,6],[20,1,20,6],[21,1,21,6],[22,1,22,6],[23,1,23,6],[24,1,24,6],[25,1,25,6],[36,1,38,8],[36,9,38,9],[36,12,36,18],[37,12,37,18],[27,1,27,6],[28,1,28,6],[29,1,29,6],[30,1,32,7],[33,1,35,8],[33,9,35,9]]}
[]
[null,"Processo",{"$f":"'Peixe 50% PB Farelo'!C2","v":"59511.000102/2026-55"}]
[null,"Responsável",{"$f":"'Peixe 50% PB Farelo'!C3","v":"JHONES DE LIMA VIEIRA"}]
[null,"Área de Origem",{"$f":"'Peixe 50% PB Farelo'!C4","v":"14ª GTR"}]
[null,"Data da pesquisa",{"$f":"'Peixe 50% PB Farelo'!C5","v":"Janeiro/2026 - Fevereiro/2026"}]
[]
[null,"ITEM:","Ração micro extrusada para camarão 40% PB – Proteína Bruta Mín.: 40%, 700 a 1000 micras Data de validade não inferior a 3 meses.",null,null,null,"UNIDADE DE MEDIDA:","Kg","QUANTIDADE:",21000,null,null,"Tabela auxiliar de metodologias para exclusão de preços",{"$nulls":7},"Automática (menor CV)"]
[null,"LICITAÇÕES ANTERIORES",{"$nulls":10},"Licitações Anteriores - Outliers",{"$nulls":7},{"$f":"M19","v":"Outliers"}]
[null,"Órgão","Edital/Ano - Nº do Lote / Item","Quantidade","Valor Unitário","Data","índice de atualização (nome)","Variação acumulada do índice (%)","Preço unitário atualizado","Utilizar?  (Sim/Não)",null,null,"Utilizar?",{"$nulls":5},"Por critério do(a) analista",null,{"$f":"N19","v":"Grupos - Todos"}]
[null,"14ª SR - Fortaleza/CE","Edital 90007/2024 - Item 17",4920,5.8,"2025-01-02","IPA-EP-DI Suprimentos agropecuários",{"$f":"(I10/E10)-1","v":1.6540957444201254E-2},{"$f":"IF(ISBLANK(E10),\"\",E10*(1+(INDEX('índice de atualização'!B:B,MATCH(G10,'índice de atualização'!B:B,0)+COUNTA('índice de atualização'!B:B)-1)-INDEX('índice de atualização'!B:B,MATCH(TEXT(F10,\"MM/AAAA\"),'índice de atualização'!A:A,0)))/INDEX('índice de atualização'!B:B,MATCH(TEXT(F10,\"MM/AAAA\"),'índice de atualização'!A:A,0))))","v":5.8959375531763669},{"$f":"IF(ISNUMBER(I10),IF($J$34<>$S$9,M10,S10),\"\")","v":"Sim"},null,null,{"$f":"IF(ISNUMBER(I10),IF(OR(I10<_xlfn.QUARTILE.INC($I$10:$I$30,1)-1.5*(_xlfn.QUARTILE.INC($I$10:I30,3)-_xlfn.QUARTILE.INC($I$10:$I$30,1)),I10>_xlfn.QUARTILE.INC($I$10:$I$30,3)+1.5*(_xlfn.QUARTILE.INC($I$10:$I$30,3)-_xlfn.QUARTILE.INC($I$10:$I$30,1))),\"Não\",\"Sim\"),\"\")","v":"Sim"},{"$nulls":7},{"$f":"O19","v":"Grupos - Sem o maior"}]
[null,"14ª SR - Fortaleza/CE","Edital 90007/2024 - Item 20",210,6.35,"2025-02-18","IPA-EP-DI Suprimentos agropecuários",4.5072426012993105E-4,{"$f":"IF(ISBLANK(E11),\"\",E11*(1+(INDEX('índice de atualização'!B:B,MATCH(G11,'índice de atualização'!B:B,0)+COUNTA('índice de atualização'!B:B)-1)-INDEX('índice de atualização'!B:B,MATCH(TEXT(F11,\"MM/AAAA\"),'índice de atualização'!A:A,0)))/INDEX('índice de atualização'!B:B,MATCH(TEXT(F11,\"MM/AAAA\"),'índice de atualização'!A:A,0))))","v":6.3528620990518245},{"$f":"IF(ISNUMBER(I11),IF($J$34<>$S$8,M11,S11),\"\")","v":"Sim"},null,null,{"$f":"IF(ISNUMBER(I11),IF(OR(I11<_xlfn.QUARTILE.INC($I$10:$I$30,1)-1.5*(_xlfn.QUARTILE.INC($I$10:I31,3)-_xlfn.QUARTILE.INC($I$10:$I$30,1)),I11>_xlfn.QUARTILE.INC($I$10:$I$30,3)+1.5*(_xlfn.QUARTILE.INC($I$10:$I$30,3)-_xlfn.QUARTILE.INC($I$10:$I$30,1))),\"Não\",\"Sim\"),\"\")","v":"Sim"},{"$nulls":7},{"$f":"P19","v":"Grupos - Sem o menor"}]
[{"$nulls":8},{"$f":"IF(ISBLANK(E12),\"\",E12*(1+(INDEX('índice de atualização'!B:B,MATCH(G12,'índice de atualização'!B:B,0)+COUNTA('índice de atualização'!B:B)-1)-INDEX('índice de atualização'!B:B,MATCH(TEXT(F12,\"MM/AAAA\"),'índice de atualização'!A:A,0)))/INDEX('índice de atualização'!B:B,MATCH(TEXT(F12,\"MM/AAAA\"),'índice de atualização'!A:A,0))))","v":""},"",null,null,{"$f":"IF(ISNUMBER(I12),IF(OR(I12<_xlfn.QUARTILE.INC($I$10:$I$30,1)-1.5*(_xlfn.QUARTILE.INC($I$10:I32,3)-_xlfn.QUARTILE.INC($I$10:$I$30,1)),I12>_xlfn.QUARTILE.INC($I$10:$I$30,3)+1.5*(_xlfn.QUARTILE.INC($I$10:$I$30,3)-_xlfn.QUARTILE.INC($I$10:$I$30,1))),\"Não\",\"Sim\"),\"\")","v":""},{"$f":"$M$12","v":""},{"$f":"$M$12","v":""},{"$f":"$M$12","v":""},{"$f":"$M$12","v":""},{"$f":"$M$12","v":""},null,null,{"$f":"Q19","v":"Grupos - Sem o maior e sem o menor"}]
[{"$nulls":8},{"$f":"IF(ISBLANK(E13),\"\",E13*(1+(INDEX('índice de atualização'!B:B,MATCH(G13,'índice de atualização'!B:B,0)+COUNTA('índice de atualização'!B:B)-1)-INDEX('índice de atualização'!B:B,MATCH(TEXT(F13,\"MM/AAAA\"),'índice de atualização'!A:A,0)))/INDEX('índice de atualização'!B:B,MATCH(TEXT(F13,\"MM/AAAA\"),'índice de atualização'!A:A,0))))","v":""},"",null,null,{"$f":"IF(ISNUMBER(I13),IF(OR(I13<_xlfn.QUARTILE.INC($I$10:$I$30,1)-1.5*(_xlfn.QUARTILE.INC($I$10:I33,3)-_xlfn.QUARTILE.INC($I$10:$I$30,1)),I13>_xlfn.QUARTILE.INC($I$10:$I$30,3)+1.5*(_xlfn.QUARTILE.INC($I$10:$I$30,3)-_xlfn.QUARTILE.INC($I$10:$I$30,1))),\"Não\",\"Sim\"),\"\")","v":""},{"$f":"$M$13","v":""},{"$f":"$M$13","v":""},{"$f":"$M$13","v":""},{"$f":"$M$13","v":""},{"$f":"$M$13","v":""},null,null,{"$f":"R19","v":"Grupos - Sem os dois maiores"}]
[{"$nulls":8},{"$f":"IF(ISBLANK(E14),\"\",E14*(1+(INDEX('índice de atualização'!B:B,MATCH(G14,'índice de atualização'!B:B,0)+COUNTA('índice de atualização'!B:B)-1)-INDEX('índice de atualização'!B:B,MATCH(TEXT(F14,\"MM/AAAA\"),'índice de atualização'!A:A,0)))/INDEX('índice de atualização'!B:B,MATCH(TEXT(F14,\"MM/AAAA\"),'índice de atualização'!A:A,0))))","v":""},"",null,null,{"$f":"IF(ISNUMBER(I14),IF(OR(I14<_xlfn.QUARTILE.INC($I$10:$I$30,1)-1.5*(_xlfn.QUARTILE.INC($I$10:I34,3)-_xlfn.QUARTILE.INC($I$10:$I$30,1)),I14>_xlfn.QUARTILE.INC($I$10:$I$30,3)+1.5*(_xlfn.QUARTILE.INC($I$10:$I$30,3)-_xlfn.QUARTILE.INC($I$10:$I$30,1))),\"Não\",\"Sim\"),\"\")","v":""},{"$f":"$M$14","v":""},"","","","",null,null,{"$f":"S19","v":"Por critério do(a) analista"}]
[{"$nulls":8},{"$f":"IF(ISBLANK(E15),\"\",E15*(1+(INDEX('índice de atualização'!B:B,MATCH(G15,'índice de atualização'!B:B,0)+COUNTA('índice de atualização'!B:B)-1)-INDEX('índice de atualização'!B:B,MATCH(TEXT(F15,\"MM/AAAA\"),'índice de atualização'!A:A,0)))/INDEX('índice de atualização'!B:B,MATCH(TEXT(F15,\"MM/AAAA\"),'índice de atualização'!A:A,0))))","v":""},"",null,null,{"$f":"IF(ISNUMBER(I15),IF(OR(I15<_xlfn.QUARTILE.INC($I$10:$I$30,1)-1.5*(_xlfn.QUARTILE.INC($I$10:I35,3)-_xlfn.QUARTILE.INC($I$10:$I$30,1)),I15>_xlfn.QUARTILE.INC($I$10:$I$30,3)+1.5*(_xlfn.QUARTILE.INC($I$10:$I$30,3)-_xlfn.QUARTILE.INC($I$10:$I$30,1))),\"Não\",\"Sim\"),\"\")","v":""},"","","","",""]
[{"$nulls":8},{"$f":"IF(ISBLANK(E16),\"\",E16*(1+(INDEX('índice de atualização'!B:B,MATCH(G16,'índice de atualização'!B:B,0)+COUNTA('índice de atualização'!B:B)-1)-INDEX('índice de atualização'!B:B,MATCH(TEXT(F16,\"MM/AAAA\"),'índice de atualização'!A:A,0)))/INDEX('índice de atualização'!B:B,MATCH(TEXT(F16,\"MM/AAAA\"),'índice de atualização'!A:A,0))))","v":""},"",null,null,{"$f":"IF(ISNUMBER(I16),IF(OR(I16<_xlfn.QUARTILE.INC($I$10:$I$30,1)-1.5*(_xlfn.QUARTILE.INC($I$10:I37,3)-_xlfn.QUARTILE.INC($I$10:$I$30,1)),I16>_xlfn.QUARTILE.INC($I$10:$I$30,3)+1.5*(_xlfn.QUARTILE.INC($I$10:$I$30,3)-_xlfn.QUARTILE.INC($I$10:$I$30,1))),\"Não\",\"Sim\"),\"\")","v":""},{"$f":"$M$16","v":""},{"$f":"$M$16","v":""},{"$f":"$M$16","v":""},{"$f":"$M$16","v":""},{"$f":"$M$16","v":""}]
[{"$nulls":8},{"$f":"IF(ISBLANK(E17),\"\",E17*(1+(INDEX('índice de atualização'!B:B,MATCH(G17,'índice de atualização'!B:B,0)+COUNTA('índice de atualização'!B:B)-1)-INDEX('índice de atualização'!B:B,MATCH(TEXT(F17,\"MM/AAAA\"),'índice de atualização'!A:A,0)))/INDEX('índice de atualização'!B:B,MATCH(TEXT(F17,\"MM/AAAA\"),'índice de atualização'!A:A,0))))","v":""},"",null,null,{"$f":"IF(ISNUMBER(I17),IF(OR(I17<_xlfn.QUARTILE.INC($I$10:$I$30,1)-1.5*(_xlfn.QUARTILE.INC($I$10:I40,3)-_xlfn.QUARTILE.INC($I$10:$I$30,1)),I17>_xlfn.QUARTILE.INC($I$10:$I$30,3)+1.5*(_xlfn.QUARTILE.INC($I$10:$I$30,3)-_xlfn.QUARTILE.INC($I$10:$I$30,1))),\"Não\",\"Sim\"),\"\")","v":""},{"$f":"$M$17","v":""},{"$f":"$M$17","v":""},{"$f":"$M$17","v":""},{"$f":"$M$17","v":""},{"$f":"$M$17","v":""}]
[null,"COTAÇÕES DE MERCADO",{"$nulls":10},"Cotações"]
[null,"Empresa",{"$nulls":5},"Data","Preço Unitário","Utilizar? (Sim/Não)",null,null,"Outliers","Grupos - Todos","Grupos - Sem o maior","Grupos - Sem o menor","Grupos - Sem o maior e sem o menor","Grupos - Sem os dois maiores","Por critério do(a) analista"]
[null,"Samaria Rações LTDA",{"$nulls":5},"2026-02-09",{"$f":"174/30","v":5.8},{"$f":"IF(ISNUMBER(I20),IF($J$34=$M$19,M20,IF($J$34=$N$19,N20,IF($J$34=$O$19,O20,IF($J$34=$P$19,P20,IF($J$34=$Q$19,Q20,IF($J$34=$R$19,R20,IF($J$34=$S$19,S20,\"\"))))))),\"\")","v":"Sim"},null,null,{"$f":"IF(ISNUMBER(I20),IF(OR(I20<_xlfn.QUARTILE.INC($I$10:$I$30,1)-1.5*(_xlfn.QUARTILE.INC($I$10:I41,3)-_xlfn.QUARTILE.INC($I$10:$I$30,1)),I20>_xlfn.QUARTILE.INC($I$10:$I$30,3)+1.5*(_xlfn.QUARTILE.INC($I$10:$I$30,3)-_xlfn.QUARTILE.INC($I$10:$I$30,1))),\"Não\",\"Sim\"),\"\")","v":"Sim"},{"$f":"IF(ISNUMBER(I20),\"Sim\",\"\")","v":"Sim"},{"$f":"IF(ISNUMBER(I20),IF(_xlfn.RANK.EQ(I20,$I$20:$I$30)=1,\"Não\",\"Sim\"),\"\")","v":"Sim"},{"$f":"IF(ISNUMBER(I20),IF(_xlfn.RANK.EQ(I20,$I$20:$I$30)=COUNT($I$20:$I$30),\"Não\",\"Sim\"),\"\")","v":"Não"},{"$f":"IF(O20=\"\",\"\",IF(AND(O20=\"Sim\",P20=\"Sim\"),\"Sim\",\"Não\"))","v":"Não"},{"$f":"IF(ISNUMBER(I20),IF(_xlfn.RANK.EQ(I20,$I$20:$I$30)<=2,\"Não\",\"Sim\"),\"\")","v":"Não"}]
[null,"Comercial do Carmo ME",{"$nulls":5},"2026-02-12",{"$f":"235/30","v":7.833333333333333},"Não",null,null,{"$f":"IF(ISNUMBER(I21),IF(OR(I21<_xlfn.QUARTILE.INC($I$10:$I$30,1)-1.5*(_xlfn.QUARTILE.INC($I$10:I41,3)-_xlfn.QUARTILE.INC($I$10:$I$30,1)),I21>_xlfn.QUARTILE.INC($I$10:$I$30,3)+1.5*(_xlfn.QUARTILE.INC($I$10:$I$30,3)-_xlfn.QUARTILE.INC($I$10:$I$30,1))),\"Não\",\"Sim\"),\"\")","v":"Sim"},"Sim","Não","Sim",{"$f":"IF(O21=\"\",\"\",IF(AND(O21=\"Sim\",P21=\"Sim\"),\"Sim\",\"Não\"))","v":"Não"},"Não"]
[{"$nulls":9},"",null,null,{"$f":"IF(ISNUMBER(I22),IF(OR(I22<_xlfn.QUARTILE.INC($I$10:$I$30,1)-1.5*(_xlfn.QUARTILE.INC($I$10:I41,3)-_xlfn.QUARTILE.INC($I$10:$I$30,1)),I22>_xlfn.QUARTILE.INC($I$10:$I$30,3)+1.5*(_xlfn.QUARTILE.INC($I$10:$I$30,3)-_xlfn.QUARTILE.INC($I$10:$I$30,1))),\"Não\",\"Sim\"),\"\")","v":""},"","","","",""]
[{"$nulls":9},"",null,null,{"$f":"IF(ISNUMBER(I23),IF(OR(I23<_xlfn.QUARTILE.INC($I$10:$I$30,1)-1.5*(_xlfn.QUARTILE.INC($I$10:I41,3)-_xlfn.QUARTILE.INC($I$10:$I$30,1)),I23>_xlfn.QUARTILE.INC($I$10:$I$30,3)+1.5*(_xlfn.QUARTILE.INC($I$10:$I$30,3)-_xlfn.QUARTILE.INC($I$10:$I$30,1))),\"Não\",\"Sim\"),\"\")","v":""},"","","","",""]
[{"$nulls":9},"",null,null,{"$f":"IF(ISNUMBER(I24),IF(OR(I24<_xlfn.QUARTILE.INC($I$10:$I$30,1)-1.5*(_xlfn.QUARTILE.INC($I$10:I42,3)-_xlfn.QUARTILE.INC($I$10:$I$30,1)),I24>_xlfn.QUARTILE.INC($I$10:$I$30,3)+1.5*(_xlfn.QUARTILE.INC($I$10:$I$30,3)-_xlfn.QUARTILE.INC($I$10:$I$30,1))),\"Não\",\"Sim\"),\"\")","v":""},"","","","",""]
[{"$nulls":9},"",null,null,{"$f":"IF(ISNUMBER(I25),IF(OR(I25<_xlfn.QUARTILE.INC($I$10:$I$30,1)-1.5*(_xlfn.QUARTILE.INC($I$10:I43,3)-_xlfn.QUARTILE.INC($I$10:$I$30,1)),I25>_xlfn.QUARTILE.INC($I$10:$I$30,3)+1.5*(_xlfn.QUARTILE.INC($I$10:$I$30,3)-_xlfn.QUARTILE.INC($I$10:$I$30,1))),\"Não\",\"Sim\"),\"\")","v":""},"","","","",""]
[{"$nulls":9},"",null,null,{"$f":"IF(ISNUMBER(I26),IF(OR(I26<_xlfn.QUARTILE.INC($I$10:$I$30,1)-1.5*(_xlfn.QUARTILE.INC($I$10:I41,3)-_xlfn.QUARTILE.INC($I$10:$I$30,1)),I26>_xlfn.QUARTILE.INC($I$10:$I$30,3)+1.5*(_xlfn.QUARTILE.INC($I$10:$I$30,3)-_xlfn.QUARTILE.INC($I$10:$I$30,1))),\"Não\",\"Sim\"),\"\")","v":""},"","","","",""]
[{"$nulls":9},"",null,null,{"$f":"IF(ISNUMBER(I27),IF(OR(I27<_xlfn.QUARTILE.INC($I$10:$I$30,1)-1.5*(_xlfn.QUARTILE.INC($I$10:I41,3)-_xlfn.QUARTILE.INC($I$10:$I$30,1)),I27>_xlfn.QUARTILE.INC($I$10:$I$30,3)+1.5*(_xlfn.QUARTILE.INC($I$10:$I$30,3)-_xlfn.QUARTILE.INC($I$10:$I$30,1))),\"Não\",\"Sim\"),\"\")","v":""},"","","","",""]
[{"$nulls":9},"",null,null,{"$f":"IF(ISNUMBER(I28),IF(OR(I28<_xlfn.QUARTILE.INC($I$10:$I$30,1)-1.5*(_xlfn.QUARTILE.INC($I$10:I41,3)-_xlfn.QUARTILE.INC($I$10:$I$30,1)),I28>_xlfn.QUARTILE.INC($I$10:$I$30,3)+1.5*(_xlfn.QUARTILE.INC($I$10:$I$30,3)-_xlfn.QUARTILE.INC($I$10:$I$30,1))),\"Não\",\"Sim\"),\"\")","v":""},"","","","",""]
[{"$nulls":9},"",null,null,{"$f":"IF(ISNUMBER(I29),IF(OR(I29<_xlfn.QUARTILE.INC($I$10:$I$30,1)-1.5*(_xlfn.QUARTILE.INC($I$10:I41,3)-_xlfn.QUARTILE.INC($I$10:$I$30,1)),I29>_xlfn.QUARTILE.INC($I$10:$I$30,3)+1.5*(_xlfn.QUARTILE.INC($I$10:$I$30,3)-_xlfn.QUARTILE.INC($I$10:$I$30,1))),\"Não\",\"Sim\"),\"\")","v":""},"","","","",""]
[{"$nulls":9},"",null,null,{"$f":"IF(ISNUMBER(I30),IF(OR(I30<_xlfn.QUARTILE.INC($I$10:$I$30,1)-1.5*(_xlfn.QUARTILE.INC($I$10:I41,3)-_xlfn.QUARTILE.INC($I$10:$I$30,1)),I30>_xlfn.QUARTILE.INC($I$10:$I$30,3)+1.5*(_xlfn.QUARTILE.INC($I$10:$I$30,3)-_xlfn.QUARTILE.INC($I$10:$I$30,1))),\"Não\",\"Sim\"),\"\")","v":""},"","","","",""]
[null,"Observações:",{"$nulls":6},"CV:",{"$f":"IF($J$34=\"\",\"Selecione metodologia para exclusão de preços\",IF(COUNTIF($J$10:$J$30,\"Sim\")<3,\"N/D (são necessários pelo menos 3 preços)\",_xlfn.STDEV.S(IF($J$10:$J$30=\"Sim\",$I$10:$I$30))/AVERAGE(IF($J$10:$J$30=\"Sim\",$I$10:$I$30))))","v":4.9103668905073714E-2},null,"Média (Cotações)",{"$f":"IF(COUNTIF(M20:M30,\"Sim\")<3,\"N/D (são necessários pelo menos 3 preços)\",AVERAGE(IF(M20:M30=\"Sim\",$I20:$I30)))","v":"N/D (são necessários pelo menos 3 preços)"},{"$f":"IF(COUNTIF(N20:N30,\"Sim\")<3,\"N/D (são necessários pelo menos 3 preços)\",AVERAGE(IF(N20:N30=\"Sim\",$I20:$I30)))","v":"N/D (são necessários pelo menos 3 preços)"},{"$f":"IF(COUNTIF(O20:O30,\"Sim\")<3,\"N/D (são necessários pelo menos 3 preços)\",AVERAGE(IF(O20:O30=\"Sim\",$I20:$I30)))","v":"N/D (são necessários pelo menos 3 preços)"},{"$f":"IF(COUNTIF(P20:P30,\"Sim\")<3,\"N/D (são necessários pelo menos 3 preços)\",AVERAGE(IF(P20:P30=\"Sim\",$I20:$I30)))","v":"N/D (são necessários pelo menos 3 preços)"},{"$f":"IF(COUNTIF(Q20:Q30,\"Sim\")<3,\"N/D (são necessários pelo menos 3 preços)\",AVERAGE(IF(Q20:Q30=\"Sim\",$I20:$I30)))","v":"N/D (são necessários pelo menos 3 preços)"},{"$f":"IF(COUNTIF(R20:R30,\"Sim\")<3,\"N/D (são necessários pelo menos 3 preços)\",AVERAGE(IF(R20:R30=\"Sim\",$I20:$I30)))","v":"N/D (são necessários pelo menos 3 preços)"},{"$f":"IF(COUNTIF(S20:S30,\"Sim\")<3,\"N/D (são necessários pelo menos 3 preços)\",AVERAGE(IF(S20:S30=\"Sim\",$I20:$I30)))","v":"N/D (são necessários pelo menos 3 preços)"}]
[{"$nulls":8},"Média:",{"$f":"IF($J$34=\"\",\"Selecione metodologia para exclusão de preços\",AVERAGE(IF($J$10:$J$30=\"Sim\",$I$10:$I$30)))","v":6.0162665507427304},null,"Mediana (Cotações)",{"$f":"IF(COUNTIF(M20:M30,\"Sim\")<3,\"N/D (são necessários pelo menos 3 preços)\",MEDIAN(IF(M20:M30=\"Sim\",$I20:$I30)))","v":"N/D (são necessários pelo menos 3 preços)"},{"$f":"IF(COUNTIF(N20:N30,\"Sim\")<3,\"N/D (são necessários pelo menos 3 preços)\",MEDIAN(IF(N20:N30=\"Sim\",$I20:$I30)))","v":"N/D (são necessários pelo menos 3 preços)"},{"$f":"IF(COUNTIF(O20:O30,\"Sim\")<3,\"N/D (são necessários pelo menos 3 preços)\",MEDIAN(IF(O20:O30=\"Sim\",$I20:$I30)))","v":"N/D (são necessários pelo menos 3 preços)"},{"$f":"IF(COUNTIF(P20:P30,\"Sim\")<3,\"N/D (são necessários pelo menos 3 preços)\",MEDIAN(IF(P20:P30=\"Sim\",$I20:$I30)))","v":"N/D (são necessários pelo menos 3 preços)"},{"$f":"IF(COUNTIF(Q20:Q30,\"Sim\")<3,\"N/D (são necessários pelo menos 3 preços)\",MEDIAN(IF(Q20:Q30=\"Sim\",$I20:$I30)))","v":"N/D (são necessários pelo menos 3 preços)"},{"$f":"IF(COUNTIF(R20:R30,\"Sim\")<3,\"N/D (são necessários pelo menos 3 preços)\",MEDIAN(IF(R20:R30=\"Sim\",$I20:$I30)))","v":"N/D (são necessários pelo menos 3 preços)"},{"$f":"IF(COUNTIF(S20:S30,\"Sim\")<3,\"N/D (são necessários pelo menos 3 preços)\",MEDIAN(IF(S20:S30=\"Sim\",$I20:$I30)))","v":"N/D (são necessários pelo menos 3 preços)"}]
[{"$nulls":8},"Mediana:",{"$f":"IF($J$34=\"\",\"Selecione metodologia para exclusão de preços\",MEDIAN(IF($J$10:$J$30=\"Sim\",$I$10:$I$30)))","v":5.8959375531763669},null,"CV (Cotações)",{"$f":"IF(COUNTIF(M20:M30,\"Sim\")<3,\"N/D (são necessários pelo menos 3 preços)\",_xlfn.STDEV.S(IF(M20:M30=\"Sim\",$I20:$I30))/AVERAGE(IF(M20:M30=\"Sim\",$I20:$I30)))","v":"N/D (são necessários pelo menos 3 preços)"},{"$f":"IF(COUNTIF(N20:N30,\"Sim\")<3,\"N/D (são necessários pelo menos 3 preços)\",_xlfn.STDEV.S(IF(N20:N30=\"Sim\",$I20:$I30))/AVERAGE(IF(N20:N30=\"Sim\",$I20:$I30)))","v":"N/D (são necessários pelo menos 3 preços)"},{"$f":"IF(COUNTIF(O20:O30,\"Sim\")<3,\"N/D (são necessários pelo menos 3 preços)\",_xlfn.STDEV.S(IF(O20:O30=\"Sim\",$I20:$I30))/AVERAGE(IF(O20:O30=\"Sim\",$I20:$I30)))","v":"N/D (são necessários pelo menos 3 preços)"},{"$f":"IF(COUNTIF(P20:P30,\"Sim\")<3,\"N/D (são necessários pelo menos 3 preços)\",_xlfn.STDEV.S(IF(P20:P30=\"Sim\",$I20:$I30))/AVERAGE(IF(P20:P30=\"Sim\",$I20:$I30)))","v":"N/D (são necessários pelo menos 3 preços)"},{"$f":"IF(COUNTIF(Q20:Q30,\"Sim\")<3,\"N/D (são necessários pelo menos 3 preços)\",_xlfn.STDEV.S(IF(Q20:Q30=\"Sim\",$I20:$I30))/AVERAGE(IF(Q20:Q30=\"Sim\",$I20:$I30)))","v":"N/D (são necessários pelo menos 3 preços)"},{"$f":"IF(COUNTIF(R20:R30,\"Sim\")<3,\"N/D (são necessários pelo menos 3 preços)\",_xlfn.STDEV.S(IF(R20:R30=\"Sim\",$I20:$I30))/AVERAGE(IF(R20:R30=\"Sim\",$I20:$I30)))","v":"N/D (são necessários pelo menos 3 preços)"},{"$f":"IF(COUNTIF(S20:S30,\"Sim\")<3,\"N/D (são necessários pelo menos 3 preços)\",_xlfn.STDEV.S(IF(S20:S30=\"Sim\",$I20:$I30))/AVERAGE(IF(S20:S30=\"Sim\",$I20:$I30)))","v":"N/D (são necessários pelo menos 3 preços)"}]
[null,"Metodologia de exclusão de preços adotada:",{"$nulls":7},{"$f":"IF(M39=\"\",INDEX(M19:S19,MATCH(MIN(M36:S36),M36:S36,0)),M39)","v":"Grupos - Sem o maior"},null,"Média",{"$f":"IF(SUM(COUNTIF($M$10:$M$17,\"Sim\")) + SUM(COUNTIF(M20:M30,\"Sim\")) < 3,\n   \"N/D (são necessários pelo menos 3 preços)\",\n   IFERROR(AVERAGE(_xlfn._xlws.FILTER($I$10:$I$17,$M$10:$M$17=\"Sim\"), _xlfn._xlws.FILTER($I$20:$I$30,M20:M30=\"Sim\")),M31))","v":6.4705332463903806},{"$f":"IF(SUM(COUNTIF($M$10:$M$17,\"Sim\")) + SUM(COUNTIF(N20:N30,\"Sim\")) < 3,\n   \"N/D (são necessários pelo menos 3 preços)\",\n   IFERROR(AVERAGE(_xlfn._xlws.FILTER($I$10:$I$17,$M$10:$M$17=\"Sim\"), _xlfn._xlws.FILTER($I$20:$I$30,N20:N30=\"Sim\")),N31))","v":6.4705332463903806},{"$f":"IF(SUM(COUNTIF($M$10:$M$17,\"Sim\")) + SUM(COUNTIF(O20:O30,\"Sim\")) < 3,\n   \"N/D (são necessários pelo menos 3 preços)\",\n   IFERROR(AVERAGE(_xlfn._xlws.FILTER($I$10:$I$17,$M$10:$M$17=\"Sim\"), _xlfn._xlws.FILTER($I$20:$I$30,O20:O30=\"Sim\")),O31))","v":6.0162665507427304},{"$f":"IF(SUM(COUNTIF($M$10:$M$17,\"Sim\")) + SUM(COUNTIF(P20:P30,\"Sim\")) < 3,\n   \"N/D (são necessários pelo menos 3 preços)\",\n   IFERROR(AVERAGE(_xlfn._xlws.FILTER($I$10:$I$17,$M$10:$M$17=\"Sim\"), _xlfn._xlws.FILTER($I$20:$I$30,P20:P30=\"Sim\")),P31))","v":6.6940443285205085},{"$f":"IF(SUM(COUNTIF($M$10:$M$17,\"Sim\")) + SUM(COUNTIF(Q20:Q30,\"Sim\")) < 3,\n   \"N/D (são necessários pelo menos 3 preços)\",\n   IFERROR(AVERAGE(_xlfn._xlws.FILTER($I$10:$I$17,$M$10:$M$17=\"Sim\"), _xlfn._xlws.FILTER($I$20:$I$30,Q20:Q30=\"Sim\")),Q31))","v":"N/D (são necessários pelo menos 3 preços)"},{"$f":"IF(SUM(COUNTIF($M$10:$M$17,\"Sim\")) + SUM(COUNTIF(R20:R30,\"Sim\")) < 3,\n   \"N/D (são necessários pelo menos 3 preços)\",\n   IFERROR(AVERAGE(_xlfn._xlws.FILTER($I$10:$I$17,$M$10:$M$17=\"Sim\"), _xlfn._xlws.FILTER($I$20:$I$30,R20:R30=\"Sim\")),R31))","v":"N/D (são necessários pelo menos 3 preços)"},{"$f":"IF(SUM(COUNTIF($S$10:$S$17,\"Sim\")) + SUM(COUNTIF(S20:S30,\"Sim\")) < 3,\n   \"N/D (são necessários pelo menos 3 preços)\",\n   IFERROR(AVERAGE(_xlfn._xlws.FILTER($I$10:$I$17,$S$10:$S$17=\"Sim\"), _xlfn._xlws.FILTER($I$20:$I$30,S20:S30=\"Sim\")),S31))","v":"N/D (são necessários pelo menos 3 preços)"}]
[{"$nulls":11},"Mediana",{"$f":"IF(SUM(COUNTIF($M$10:$M$17,\"Sim\")) + SUM(COUNTIF(M20:M30,\"Sim\")) < 3,\n   \"N/D (são necessários pelo menos 3 preços)\",\n   IFERROR(MEDIAN(_xlfn._xlws.FILTER($I$10:$I$17,$M$10:$M$17=\"Sim\"), _xlfn._xlws.FILTER($I$20:$I$30,M20:M30=\"Sim\")),M31))","v":6.1243998261140957},{"$f":"IF(SUM(COUNTIF($M$10:$M$17,\"Sim\")) + SUM(COUNTIF(N20:N30,\"Sim\")) < 3,\n   \"N/D (são necessários pelo menos 3 preços)\",\n   IFERROR(MEDIAN(_xlfn._xlws.FILTER($I$10:$I$17,$M$10:$M$17=\"Sim\"), _xlfn._xlws.FILTER($I$20:$I$30,N20:N30=\"Sim\")),N31))","v":6.1243998261140957},{"$f":"IF(SUM(COUNTIF($M$10:$M$17,\"Sim\")) + SUM(COUNTIF(O20:O30,\"Sim\")) < 3,\n   \"N/D (são necessários pelo menos 3 preços)\",\n   IFERROR(MEDIAN(_xlfn._xlws.FILTER($I$10:$I$17,$M$10:$M$17=\"Sim\"), _xlfn._xlws.FILTER($I$20:$I$30,O20:O30=\"Sim\")),O31))","v":5.8959375531763669},{"$f":"IF(SUM(COUNTIF($M$10:$M$17,\"Sim\")) + SUM(COUNTIF(P20:P30,\"Sim\")) < 3,\n   \"N/D (são necessários pelo menos 3 preços)\",\n   IFERROR(MEDIAN(_xlfn._xlws.FILTER($I$10:$I$17,$M$10:$M$17=\"Sim\"), _xlfn._xlws.FILTER($I$20:$I$30,P20:P30=\"Sim\")),P31))","v":6.3528620990518245},{"$f":"IF(SUM(COUNTIF($M$10:$M$17,\"Sim\")) + SUM(COUNTIF(Q20:Q30,\"Sim\")) < 3,\n   \"N/D (são necessários pelo menos 3 preços)\",\n   IFERROR(MEDIAN(_xlfn._xlws.FILTER($I$10:$I$17,$M$10:$M$17=\"Sim\"), _xlfn._xlws.FILTER($I$20:$I$30,Q20:Q30=\"Sim\")),Q31))","v":"N/D (são necessários pelo menos 3 preços)"},{"$f":"IF(SUM(COUNTIF($M$10:$M$17,\"Sim\")) + SUM(COUNTIF(R20:R30,\"Sim\")) < 3,\n   \"N/D (são necessários pelo menos 3 preços)\",\n   IFERROR(MEDIAN(_xlfn._xlws.FILTER($I$10:$I$17,$M$10:$M$17=\"Sim\"), _xlfn._xlws.FILTER($I$20:$I$30,R20:R30=\"Sim\")),R31))","v":"N/D (são necessários pelo menos 3 preços)"},{"$f":"IF(SUM(COUNTIF($S$10:$S$17,\"Sim\")) + SUM(COUNTIF(S20:S30,\"Sim\")) < 3,\n   \"N/D (são necessários pelo menos 3 preços)\",\n   IFERROR(MEDIAN(_xlfn._xlws.FILTER($I$10:$I$17,$S$10:$S$17=\"Sim\"), _xlfn._xlws.FILTER($I$20:$I$30,S20:S30=\"Sim\")),S31))","v":"N/D (são necessários pelo menos 3 preços)"}]
[{"$nulls":11},"CV",{"$f":"IF(SUM(COUNTIF($M$10:$M$17,\"Sim\")) + SUM(COUNTIF(M20:M30,\"Sim\")) < 3,\n   \"N/D (são necessários pelo menos 3 preços)\",\n   IFERROR(ROUND(_xlfn.STDEV.S(_xlfn._xlws.FILTER($I$10:$I$17,$M$10:$M$17=\"Sim\"), _xlfn._xlws.FILTER($I$20:$I$30,M20:M30=\"Sim\")) /\n   AVERAGE(_xlfn._xlws.FILTER($I$10:$I$17,$M$10:$M$17=\"Sim\"), _xlfn._xlws.FILTER($I$20:$I$30,M20:M30=\"Sim\")),4),M33)\n)","v":0.14530000000000001},{"$f":"IF(SUM(COUNTIF($M$10:$M$17,\"Sim\")) + SUM(COUNTIF(N20:N30,\"Sim\")) < 3,\n   \"N/D (são necessários pelo menos 3 preços)\",\n   IFERROR(ROUND(_xlfn.STDEV.S(_xlfn._xlws.FILTER($I$10:$I$17,$M$10:$M$17=\"Sim\"), _xlfn._xlws.FILTER($I$20:$I$30,N20:N30=\"Sim\")) /\n   AVERAGE(_xlfn._xlws.FILTER($I$10:$I$17,$M$10:$M$17=\"Sim\"), _xlfn._xlws.FILTER($I$20:$I$30,N20:N30=\"Sim\")),4),N33)\n)","v":0.14530000000000001},{"$f":"IF(SUM(COUNTIF($M$10:$M$17,\"Sim\")) + SUM(COUNTIF(O20:O30,\"Sim\")) < 3,\n   \"N/D (são necessários pelo menos 3 preços)\",\n   IFERROR(ROUND(_xlfn.STDEV.S(_xlfn._xlws.FILTER($I$10:$I$17,$M$10:$M$17=\"Sim\"), _xlfn._xlws.FILTER($I$20:$I$30,O20:O30=\"Sim\")) /\n   AVERAGE(_xlfn._xlws.FILTER($I$10:$I$17,$M$10:$M$17=\"Sim\"), _xlfn._xlws.FILTER($I$20:$I$30,O20:O30=\"Sim\")),4),O33)\n)","v":4.9099999999999998E-2},{"$f":"IF(SUM(COUNTIF($M$10:$M$17,\"Sim\")) + SUM(COUNTIF(P20:P30,\"Sim\")) < 3,\n   \"N/D (são necessários pelo menos 3 preços)\",\n   IFERROR(ROUND(_xlfn.STDEV.S(_xlfn._xlws.FILTER($I$10:$I$17,$M$10:$M$17=\"Sim\"), _xlfn._xlws.FILTER($I$20:$I$30,P20:P30=\"Sim\")) /\n   AVERAGE(_xlfn._xlws.FILTER($I$10:$I$17,$M$10:$M$17=\"Sim\"), _xlfn._xlws.FILTER($I$20:$I$30,P20:P30=\"Sim\")),4),P33)\n)","v":0.15129999999999999},{"$f":"IF(SUM(COUNTIF($M$10:$M$17,\"Sim\")) + SUM(COUNTIF(Q20:Q30,\"Sim\")) < 3,\n   \"N/D (são necessários pelo menos 3 preços)\",\n   IFERROR(ROUND(_xlfn.STDEV.S(_xlfn._xlws.FILTER($I$10:$I$17,$M$10:$M$17=\"Sim\"), _xlfn._xlws.FILTER($I$20:$I$30,Q20:Q30=\"Sim\")) /\n   AVERAGE(_xlfn._xlws.FILTER($I$10:$I$17,$M$10:$M$17=\"Sim\"), _xlfn._xlws.FILTER($I$20:$I$30,Q20:Q30=\"Sim\")),4),Q33)\n)","v":"N/D (são necessários pelo menos 3 preços)"},{"$f":"IF(SUM(COUNTIF($M$10:$M$17,\"Sim\")) + SUM(COUNTIF(R20:R30,\"Sim\")) < 3,\n   \"N/D (são necessários pelo menos 3 preços)\",\n   IFERROR(ROUND(_xlfn.STDEV.S(_xlfn._xlws.FILTER($I$10:$I$17,$M$10:$M$17=\"Sim\"), _xlfn._xlws.FILTER($I$20:$I$30,R20:R30=\"Sim\")) /\n   AVERAGE(_xlfn._xlws.FILTER($I$10:$I$17,$M$10:$M$17=\"Sim\"), _xlfn._xlws.FILTER($I$20:$I$30,R20:R30=\"Sim\")),4),R33)\n)","v":"N/D (são necessários pelo menos 3 preços)"},{"$f":"IF(SUM(COUNTIF($S$10:$S$17,\"Sim\")) + SUM(COUNTIF(S20:S30,\"Sim\")) < 3,\n   \"N/D (são necessários pelo menos 3 preços)\",\n   IFERROR(_xlfn.STDEV.S(_xlfn._xlws.FILTER($I$10:$I$17,$S$10:$S$17=\"Sim\"), _xlfn._xlws.FILTER($I$20:$I$30,S20:S30=\"Sim\")) /\n   AVERAGE(_xlfn._xlws.FILTER($I$10:$I$17,$S$10:$S$17=\"Sim\"), _xlfn._xlws.FILTER($I$20:$I$30,S20:S30=\"Sim\")),S33)\n)","v":"N/D (são necessários pelo menos 3 preços)"}]
[null,"PREÇO UNITÁRIO ESTIMADO ADOTADO:",{"$nulls":7},{"$f":"IF($J$34=\"\",\"Selecione metodologia para exclusão de preços\",MIN(J32:J33))","v":5.8959375531763669},null,"Metodologia sugerida:",{"$f":"IF($M$36=MIN($M$36,$N$36:$R$36),M8,\"Grupos - \"&INDEX({\"Todos\";\"Sem o maior\";\"Sem o menor\";\"Sem o maior e Sem o menor\";\"Sem os dois maiores\"},MATCH(MIN($N$36:$R$36),$N$36:$R$36,0)))","v":"Grupos - Sem o maior"}]
[{"$nulls":11},"Preço estimado sugerido:",{"$f":"IF($M$37=M8,SMALL($M$34:$M$35,1),MIN(INDEX($N$35:$R$35, MATCH(MIN($N$36:$R$36), $N$36:$R$36, 0)),INDEX($N$34:$R$34, MATCH(MIN($N$36:$R$36), $N$36:$R$36, 0))))","v":5.8959375531763669}]
[{"$nulls":11},"Metodologia a adotar:",{"$f":"IF(INDEX(L19:S19,N39)=0,\"\",INDEX(L19:S19,N39))","v":""},1]

{"sheet":"Camarão 40% 900 a 1300","index":9,"n_rows":39,"n_cols":21,"rows_kept":39,"cut":false,"hidden":false,"merged":[[15,12,15,17],[6,2,6,5],[6,12,6,18],[7,1,7,9],[7,12,7,18],[8,12,8,17],[9,12,9,17],[10,12,10,17],[11,12,11,17],[12,12,12,17],[13,12,13,17],[14,12,14,17],[26,1,26,6],[16,12,16,17],[17,1,17,9],[17,12,17,18],[18,1,18,6],[19,1,19,6],[20,1,20,6],[21,1,21,6],[22,1,22,6],[23,1,23,6],[24,1,24,6],[25,1,25,6],[36,1,38,8],[36,9,38,9],[36,12,36,18],[37,12,37,18],[27,1,27,6],[28,1,28,6],[29,1,29,6],[30,1,32,7],[33,1,35,8],[33,9,35,9]]}
[]
[null,"Processo",{"$f":"'Peixe 50% PB Farelo'!C2","v":"59511.000102/2026-55"}]
[null,"Responsável",{"$f":"'Peixe 50% PB Farelo'!C3","v":"JHONES DE LIMA VIEIRA"}]
[null,"Área de Origem",{"$f":"'Peixe 50% PB Farelo'!C4","v":"14ª GTR"}]
[null,"Data da pesquisa",{"$f":"'Peixe 50% PB Farelo'!C5","v":"Janeiro/2026 - Fevereiro/2026"}]
[]
[null,"ITEM:","Ração micro extrusada para camarão 40% PB – Proteína Bruta Mín.: 40%, 900 a 1300 micras. Data de validade não inferior a 3 meses.",null,null,null,"UNIDADE DE MEDIDA:","Kg","QUANTIDADE:",105000,null,null,"Tabela auxiliar de metodologias para exclusão de preços",{"$nulls":7},"Automática (menor CV)"]
[null,"LICITAÇÕES ANTERIORES",{"$nulls":10},"Licitações Anteriores - Outliers",{"$nulls":7},{"$f":"M19","v":"Outliers"}]
[null,"Órgão","Edital/Ano - Nº do Lote / Item","Quantidade","Valor Unitário","Data","índice de atualização (nome)","Variação acumulada do índice (%)","Preço unitário atualizado","Utilizar?  (Sim/Não)",null,null,"Utilizar?",{"$nulls":5},"Por critério do(a) analista",null,{"$f":"N19","v":"Grupos - Todos"}]
[null,"14ª SR - Fortaleza/CE","Edital 90007/2024 - Item 18",49260,5.51,"2025-01-02","IPA-EP-DI Suprimentos agropecuários",{"$f":"(I10/E10)-1","v":1.6540957444201254E-2},{"$f":"IF(ISBLANK(E10),\"\",E10*(1+(INDEX('índice de atualização'!B:B,MATCH(G10,'índice de atualização'!B:B,0)+COUNTA('índice de atualização'!B:B)-1)-INDEX('índice de atualização'!B:B,MATCH(TEXT(F10,\"MM/AAAA\"),'índice de atualização'!A:A,0)))/INDEX('índice de atualização'!B:B,MATCH(TEXT(F10,\"MM/AAAA\"),'índice de atualização'!A:A,0))))","v":5.6011406755175486},{"$f":"IF(ISNUMBER(I10),IF($J$34<>$S$9,M10,S10),\"\")","v":"Sim"},null,null,{"$f":"IF(ISNUMBER(I10),IF(OR(I10<_xlfn.QUARTILE.INC($I$10:$I$30,1)-1.5*(_xlfn.QUARTILE.INC($I$10:I30,3)-_xlfn.QUARTILE.INC($I$10:$I$30,1)),I10>_xlfn.QUARTILE.INC($I$10:$I$30,3)+1.5*(_xlfn.QUARTILE.INC($I$10:$I$30,3)-_xlfn.QUARTILE.INC($I$10:$I$30,1))),\"Não\",\"Sim\"),\"\")","v":"Sim"},{"$nulls":7},{"$f":"O19","v":"Grupos - Sem o maior"}]
[null,"14ª SR - Fortaleza/CE","Edital 90007/2024 - Item 21",2040,6.35,"2025-02-18","IPA-EP-DI Suprimentos agropecuários",{"$f":"(I11/E11)-1","v":4.5072426012993105E-4},{"$f":"IF(ISBLANK(E11),\"\",E11*(1+(INDEX('índice de atualização'!B:B,MATCH(G11,'índice de atualização'!B:B,0)+COUNTA('índice de atualização'!B:B)-1)-INDEX('índice de atualização'!B:B,MATCH(TEXT(F11,\"MM/AAAA\"),'índice de atualização'!A:A,0)))/INDEX('índice de atualização'!B:B,MATCH(TEXT(F11,\"MM/AAAA\"),'índice de atualização'!A:A,0))))","v":6.3528620990518245},{"$f":"IF(ISNUMBER(I11),IF($J$34<>$S$8,M11,S11),\"\")","v":"Sim"},null,null,{"$f":"IF(ISNUMBER(I11),IF(OR(I11<_xlfn.QUARTILE.INC($I$10:$I$30,1)-1.5*(_xlfn.QUARTILE.INC($I$10:I31,3)-_xlfn.QUARTILE.INC($I$10:$I$30,1)),I11>_xlfn.QUARTILE.INC($I$10:$I$30,3)+1.5*(_xlfn.QUARTILE.INC($I$10:$I$30,3)-_xlfn.QUARTILE.INC($I$10:$I$30,1))),\"Não\",\"Sim\"),\"\")","v":"Sim"},{"$nulls":7},{"$f":"P19","v":"Grupos - Sem o menor"}]
[{"$nulls":8},{"$f":"IF(ISBLANK(E12),\"\",E12*(1+(INDEX('índice de atualização'!B:B,MATCH(G12,'índice de atualização'!B:B,0)+COUNTA('índice de atualização'!B:B)-1)-INDEX('índice de atualização'!B:B,MATCH(TEXT(F12,\"MM/AAAA\"),'índice de atualização'!A:A,0)))/INDEX('índice de atualização'!B:B,MATCH(TEXT(F12,\"MM/AAAA\"),'índice de atualização'!A:A,0))))","v":""},"",null,null,{"$f":"IF(ISNUMBER(I12),IF(OR(I12<_xlfn.QUARTILE.INC($I$10:$I$30,1)-1.5*(_xlfn.QUARTILE.INC($I$10:I32,3)-_xlfn.QUARTILE.INC($I$10:$I$30,1)),I12>_xlfn.QUARTILE.INC($I$10:$I$30,3)+1.5*(_xlfn.QUARTILE.INC($I$10:$I$30,3)-_xlfn.QUARTILE.INC($I$10:$I$30,1))),\"Não\",\"Sim\"),\"\")","v":""},{"$f":"$M$12","v":""},{"$f":"$M$12","v":""},{"$f":"$M$12","v":""},{"$f":"$M$12","v":""},{"$f":"$M$12","v":""},null,null,{"$f":"Q19","v":"Grupos - Sem o maior e sem o menor"}]
[{"$nulls":8},{"$f":"IF(ISBLANK(E13),\"\",E13*(1+(INDEX('índice de atualização'!B:B,MATCH(G13,'índice de atualização'!B:B,0)+COUNTA('índice de atualização'!B:B)-1)-INDEX('índice de atualização'!B:B,MATCH(TEXT(F13,\"MM/AAAA\"),'índice de atualização'!A:A,0)))/INDEX('índice de atualização'!B:B,MATCH(TEXT(F13,\"MM/AAAA\"),'índice de atualização'!A:A,0))))","v":""},"",null,null,{"$f":"IF(ISNUMBER(I13),IF(OR(I13<_xlfn.QUARTILE.INC($I$10:$I$30,1)-1.5*(_xlfn.QUARTILE.INC($I$10:I33,3)-_xlfn.QUARTILE.INC($I$10:$I$30,1)),I13>_xlfn.QUARTILE.INC($I$10:$I$30,3)+1.5*(_xlfn.QUARTILE.INC($I$10:$I$30,3)-_xlfn.QUARTILE.INC($I$10:$I$30,1))),\"Não\",\"Sim\"),\"\")","v":""},{"$f":"$M$13","v":""},{"$f":"$M$13","v":""},{"$f":"$M$13","v":""},{"$f":"$M$13","v":""},{"$f":"$M$13","v":""},null,null,{"$f":"R19","v":"Grupos - Sem os dois maiores"}]
[{"$nulls":8},{"$f":"IF(ISBLANK(E14),\"\",E14*(1+(INDEX('índice de atualização'!B:B,MATCH(G14,'índice de atualização'!B:B,0)+COUNTA('índice de atualização'!B:B)-1)-INDEX('índice de atualização'!B:B,MATCH(TEXT(F14,\"MM/AAAA\"),'índice de atualização'!A:A,0)))/INDEX('índice de atualização'!B:B,MATCH(TEXT(F14,\"MM/AAAA\"),'índice de atualização'!A:A,0))))","v":""},"",null,null,{"$f":"IF(ISNUMBER(I14),IF(OR(I14<_xlfn.QUARTILE.INC($I$10:$I$30,1)-1.5*(_xlfn.QUARTILE.INC($I$10:I34,3)-_xlfn.QUARTILE.INC($I$10:$I$30,1)),I14>_xlfn.QUARTILE.INC($I$10:$I$30,3)+1.5*(_xlfn.QUARTILE.INC($I$10:$I$30,3)-_xlfn.QUARTILE.INC($I$10:$I$30,1))),\"Não\",\"Sim\"),\"\")","v":""},{"$f":"$M$14","v":""},"","","","",null,null,{"$f":"S19","v":"Por critério do(a) analista"}]
[{"$nulls":8},{"$f":"IF(ISBLANK(E15),\"\",E15*(1+(INDEX('índice de atualização'!B:B,MATCH(G15,'índice de atualização'!B:B,0)+COUNTA('índice de atualização'!B:B)-1)-INDEX('índice de atualização'!B:B,MATCH(TEXT(F15,\"MM/AAAA\"),'índice de atualização'!A:A,0)))/INDEX('índice de atualização'!B:B,MATCH(TEXT(F15,\"MM/AAAA\"),'índice de atualização'!A:A,0))))","v":""},"",null,null,{"$f":"IF(ISNUMBER(I15),IF(OR(I15<_xlfn.QUARTILE.INC($I$10:$I$30,1)-1.5*(_xlfn.QUARTILE.INC($I$10:I35,3)-_xlfn.QUARTILE.INC($I$10:$I$30,1)),I15>_xlfn.QUARTILE.INC($I$10:$I$30,3)+1.5*(_xlfn.QUARTILE.INC($I$10:$I$30,3)-_xlfn.QUARTILE.INC($I$10:$I$30,1))),\"Não\",\"Sim\"),\"\")","v":""},"","","","",""]
[{"$nulls":8},{"$f":"IF(ISBLANK(E16),\"\",E16*(1+(INDEX('índice de atualização'!B:B,MATCH(G16,'índice de atualização'!B:B,0)+COUNTA('índice de atualização'!B:B)-1)-INDEX('índice de atualização'!B:B,MATCH(TEXT(F16,\"MM/AAAA\"),'índice de atualização'!A:A,0)))/INDEX('índice de atualização'!B:B,MATCH(TEXT(F16,\"MM/AAAA\"),'índice de atualização'!A:A,0))))","v":""},"",null,null,{"$f":"IF(ISNUMBER(I16),IF(OR(I16<_xlfn.QUARTILE.INC($I$10:$I$30,1)-1.5*(_xlfn.QUARTILE.INC($I$10:I37,3)-_xlfn.QUARTILE.INC($I$10:$I$30,1)),I16>_xlfn.QUARTILE.INC($I$10:$I$30,3)+1.5*(_xlfn.QUARTILE.INC($I$10:$I$30,3)-_xlfn.QUARTILE.INC($I$10:$I$30,1))),\"Não\",\"Sim\"),\"\")","v":""},{"$f":"$M$16","v":""},{"$f":"$M$16","v":""},{"$f":"$M$16","v":""},{"$f":"$M$16","v":""},{"$f":"$M$16","v":""}]
[{"$nulls":8},{"$f":"IF(ISBLANK(E17),\"\",E17*(1+(INDEX('índice de atualização'!B:B,MATCH(G17,'índice de atualização'!B:B,0)+COUNTA('índice de atualização'!B:B)-1)-INDEX('índice de atualização'!B:B,MATCH(TEXT(F17,\"MM/AAAA\"),'índice de atualização'!A:A,0)))/INDEX('índice de atualização'!B:B,MATCH(TEXT(F17,\"MM/AAAA\"),'índice de atualização'!A:A,0))))","v":""},"",null,null,{"$f":"IF(ISNUMBER(I17),IF(OR(I17<_xlfn.QUARTILE.INC($I$10:$I$30,1)-1.5*(_xlfn.QUARTILE.INC($I$10:I40,3)-_xlfn.QUARTILE.INC($I$10:$I$30,1)),I17>_xlfn.QUARTILE.INC($I$10:$I$30,3)+1.5*(_xlfn.QUARTILE.INC($I$10:$I$30,3)-_xlfn.QUARTILE.INC($I$10:$I$30,1))),\"Não\",\"Sim\"),\"\")","v":""},{"$f":"$M$17","v":""},{"$f":"$M$17","v":""},{"$f":"$M$17","v":""},{"$f":"$M$17","v":""},{"$f":"$M$17","v":""}]
[null,"COTAÇÕES DE MERCADO",{"$nulls":10},"Cotações"]
[null,"Empresa",{"$nulls":5},"Data","Preço Unitário","Utilizar? (Sim/Não)",null,null,"Outliers","Grupos - Todos","Grupos - Sem o maior","Grupos - Sem o menor","Grupos - Sem o maior e sem o menor","Grupos - Sem os dois maiores","Por critério do(a) analista"]
[null,"Samaria Rações LTDA",{"$nulls":5},"2026-02-09",{"$f":"165.3/30","v":5.5100000000000007},{"$f":"IF(ISNUMBER(I20),IF($J$34=$M$19,M20,IF($J$34=$N$19,N20,IF($J$34=$O$19,O20,IF($J$34=$P$19,P20,IF($J$34=$Q$19,Q20,IF($J$34=$R$19,R20,IF($J$34=$S$19,S20,\"\"))))))),\"\")","v":"Sim"},null,null,{"$f":"IF(ISNUMBER(I20),IF(OR(I20<_xlfn.QUARTILE.INC($I$10:$I$30,1)-1.5*(_xlfn.QUARTILE.INC($I$10:I41,3)-_xlfn.QUARTILE.INC($I$10:$I$30,1)),I20>_xlfn.QUARTILE.INC($I$10:$I$30,3)+1.5*(_xlfn.QUARTILE.INC($I$10:$I$30,3)-_xlfn.QUARTILE.INC($I$10:$I$30,1))),\"Não\",\"Sim\"),\"\")","v":"Sim"},{"$f":"IF(ISNUMBER(I20),\"Sim\",\"\")","v":"Sim"},{"$f":"IF(ISNUMBER(I20),IF(_xlfn.RANK.EQ(I20,$I$20:$I$30)=1,\"Não\",\"Sim\"),\"\")","v":"Sim"},{"$f":"IF(ISNUMBER(I20),IF(_xlfn.RANK.EQ(I20,$I$20:$I$30)=COUNT($I$20:$I$30),\"Não\",\"Sim\"),\"\")","v":"Não"},{"$f":"IF(O20=\"\",\"\",IF(AND(O20=\"Sim\",P20=\"Sim\"),\"Sim\",\"Não\"))","v":"Não"},{"$f":"IF(ISNUMBER(I20),IF(_xlfn.RANK.EQ(I20,$I$20:$I$30)<=2,\"Não\",\"Sim\"),\"\")","v":"Não"}]
[null,"Comercial do Carmo ME",{"$nulls":5},"2026-02-12",{"$f":"223/30","v":7.4333333333333336},"Não",null,null,{"$f":"IF(ISNUMBER(I21),IF(OR(I21<_xlfn.QUARTILE.INC($I$10:$I$30,1)-1.5*(_xlfn.QUARTILE.INC($I$10:I41,3)-_xlfn.QUARTILE.INC($I$10:$I$30,1)),I21>_xlfn.QUARTILE.INC($I$10:$I$30,3)+1.5*(_xlfn.QUARTILE.INC($I$10:$I$30,3)-_xlfn.QUARTILE.INC($I$10:$I$30,1))),\"Não\",\"Sim\"),\"\")","v":"Sim"},{"$f":"IF(ISNUMBER(I21),\"Sim\",\"\")","v":"Sim"},"Não","Sim",{"$f":"IF(O21=\"\",\"\",IF(AND(O21=\"Sim\",P21=\"Sim\"),\"Sim\",\"Não\"))","v":"Não"},"Não"]
[{"$nulls":9},"",null,null,{"$f":"IF(ISNUMBER(I22),IF(OR(I22<_xlfn.QUARTILE.INC($I$10:$I$30,1)-1.5*(_xlfn.QUARTILE.INC($I$10:I41,3)-_xlfn.QUARTILE.INC($I$10:$I$30,1)),I22>_xlfn.QUARTILE.INC($I$10:$I$30,3)+1.5*(_xlfn.QUARTILE.INC($I$10:$I$30,3)-_xlfn.QUARTILE.INC($I$10:$I$30,1))),\"Não\",\"Sim\"),\"\")","v":""},"","","","",""]
[{"$nulls":9},"",null,null,{"$f":"IF(ISNUMBER(I23),IF(OR(I23<_xlfn.QUARTILE.INC($I$10:$I$30,1)-1.5*(_xlfn.QUARTILE.INC($I$10:I41,3)-_xlfn.QUARTILE.INC($I$10:$I$30,1)),I23>_xlfn.QUARTILE.INC($I$10:$I$30,3)+1.5*(_xlfn.QUARTILE.INC($I$10:$I$30,3)-_xlfn.QUARTILE.INC($I$10:$I$30,1))),\"Não\",\"Sim\"),\"\")","v":""},"","","","",""]
[{"$nulls":9},"",null,null,{"$f":"IF(ISNUMBER(I24),IF(OR(I24<_xlfn.QUARTILE.INC($I$10:$I$30,1)-1.5*(_xlfn.QUARTILE.INC($I$10:I42,3)-_xlfn.QUARTILE.INC($I$10:$I$30,1)),I24>_xlfn.QUARTILE.INC($I$10:$I$30,3)+1.5*(_xlfn.QUARTILE.INC($I$10:$I$30,3)-_xlfn.QUARTILE.INC($I$10:$I$30,1))),\"Não\",\"Sim\"),\"\")","v":""},"","","","",""]
[{"$nulls":9},"",null,null,{"$f":"IF(ISNUMBER(I25),IF(OR(I25<_xlfn.QUARTILE.INC($I$10:$I$30,1)-1.5*(_xlfn.QUARTILE.INC($I$10:I43,3)-_xlfn.QUARTILE.INC($I$10:$I$30,1)),I25>_xlfn.QUARTILE.INC($I$10:$I$30,3)+1.5*(_xlfn.QUARTILE.INC($I$10:$I$30,3)-_xlfn.QUARTILE.INC($I$10:$I$30,1))),\"Não\",\"Sim\"),\"\")","v":""},"","","","",""]
[{"$nulls":9},"",null,null,{"$f":"IF(ISNUMBER(I26),IF(OR(I26<_xlfn.QUARTILE.INC($I$10:$I$30,1)-1.5*(_xlfn.QUARTILE.INC($I$10:I41,3)-_xlfn.QUARTILE.INC($I$10:$I$30,1)),I26>_xlfn.QUARTILE.INC($I$10:$I$30,3)+1.5*(_xlfn.QUARTILE.INC($I$10:$I$30,3)-_xlfn.QUARTILE.INC($I$10:$I$30,1))),\"Não\",\"Sim\"),\"\")","v":""},"","","","",""]
[{"$nulls":9},"",null,null,{"$f":"IF(ISNUMBER(I27),IF(OR(I27<_xlfn.QUARTILE.INC($I$10:$I$30,1)-1.5*(_xlfn.QUARTILE.INC($I$10:I41,3)-_xlfn.QUARTILE.INC($I$10:$I$30,1)),I27>_xlfn.QUARTILE.INC($I$10:$I$30,3)+1.5*(_xlfn.QUARTILE.INC($I$10:$I$30,3)-_xlfn.QUARTILE.INC($I$10:$I$30,1))),\"Não\",\"Sim\"),\"\")","v":""},"","","","",""]
[{"$nulls":9},"",null,null,{"$f":"IF(ISNUMBER(I28),IF(OR(I28<_xlfn.QUARTILE.INC($I$10:$I$30,1)-1.5*(_xlfn.QUARTILE.INC($I$10:I41,3)-_xlfn.QUARTILE.INC($I$10:$I$30,1)),I28>_xlfn.QUARTILE.INC($I$10:$I$30,3)+1.5*(_xlfn.QUARTILE.INC($I$10:$I$30,3)-_xlfn.QUARTILE.INC($I$10:$I$30,1))),\"Não\",\"Sim\"),\"\")","v":""},"","","","",""]
[{"$nulls":9},"",null,null,{"$f":"IF(ISNUMBER(I29),IF(OR(I29<_xlfn.QUARTILE.INC($I$10:$I$30,1)-1.5*(_xlfn.QUARTILE.INC($I$10:I41,3)-_xlfn.QUARTILE.INC($I$10:$I$30,1)),I29>_xlfn.QUARTILE.INC($I$10:$I$30,3)+1.5*(_xlfn.QUARTILE.INC($I$10:$I$30,3)-_xlfn.QUARTILE.INC($I$10:$I$30,1))),\"Não\",\"Sim\"),\"\")","v":""},"","","","",""]
[{"$nulls":9},"",null,null,{"$f":"IF(ISNUMBER(I30),IF(OR(I30<_xlfn.QUARTILE.INC($I$10:$I$30,1)-1.5*(_xlfn.QUARTILE.INC($I$10:I41,3)-_xlfn.QUARTILE.INC($I$10:$I$30,1)),I30>_xlfn.QUARTILE.INC($I$10:$I$30,3)+1.5*(_xlfn.QUARTILE.INC($I$10:$I$30,3)-_xlfn.QUARTILE.INC($I$10:$I$30,1))),\"Não\",\"Sim\"),\"\")","v":""},"","","","",""]
[null,"Observações:",{"$nulls":6},"CV:",{"$f":"IF($J$34=\"\",\"Selecione metodologia para exclusão de preços\",IF(COUNTIF($J$10:$J$30,\"Sim\")<3,\"N/D (são necessários pelo menos 3 preços)\",_xlfn.STDEV.S(IF($J$10:$J$30=\"Sim\",$I$10:$I$30))/AVERAGE(IF($J$10:$J$30=\"Sim\",$I$10:$I$30))))","v":7.9460614103921426E-2},null,"Média (Cotações)",{"$f":"IF(COUNTIF(M20:M30,\"Sim\")<3,\"N/D (são necessários pelo menos 3 preços)\",AVERAGE(IF(M20:M30=\"Sim\",$I20:$I30)))","v":"N/D (são necessários pelo menos 3 preços)"},{"$f":"IF(COUNTIF(N20:N30,\"Sim\")<3,\"N/D (são necessários pelo menos 3 preços)\",AVERAGE(IF(N20:N30=\"Sim\",$I20:$I30)))","v":"N/D (são necessários pelo menos 3 preços)"},{"$f":"IF(COUNTIF(O20:O30,\"Sim\")<3,\"N/D (são necessários pelo menos 3 preços)\",AVERAGE(IF(O20:O30=\"Sim\",$I20:$I30)))","v":"N/D (são necessários pelo menos 3 preços)"},{"$f":"IF(COUNTIF(P20:P30,\"Sim\")<3,\"N/D (são necessários pelo menos 3 preços)\",AVERAGE(IF(P20:P30=\"Sim\",$I20:$I30)))","v":"N/D (são necessários pelo menos 3 preços)"},{"$f":"IF(COUNTIF(Q20:Q30,\"Sim\")<3,\"N/D (são necessários pelo menos 3 preços)\",AVERAGE(IF(Q20:Q30=\"Sim\",$I20:$I30)))","v":"N/D (são necessários pelo menos 3 preços)"},{"$f":"IF(COUNTIF(R20:R30,\"Sim\")<3,\"N/D (são necessários pelo menos 3 preços)\",AVERAGE(IF(R20:R30=\"Sim\",$I20:$I30)))","v":"N/D (são necessários pelo menos 3 preços)"},{"$f":"IF(COUNTIF(S20:S30,\"Sim\")<3,\"N/D (são necessários pelo menos 3 preços)\",AVERAGE(IF(S20:S30=\"Sim\",$I20:$I30)))","v":"N/D (são necessários pelo menos 3 preços)"}]
[{"$nulls":8},"Média:",{"$f":"IF($J$34=\"\",\"Selecione metodologia para exclusão de preços\",AVERAGE(IF($J$10:$J$30=\"Sim\",$I$10:$I$30)))","v":5.8213342581897907},null,"Mediana (Cotações)",{"$f":"IF(COUNTIF(M20:M30,\"Sim\")<3,\"N/D (são necessários pelo menos 3 preços)\",MEDIAN(IF(M20:M30=\"Sim\",$I20:$I30)))","v":"N/D (são necessários pelo menos 3 preços)"},{"$f":"IF(COUNTIF(N20:N30,\"Sim\")<3,\"N/D (são necessários pelo menos 3 preços)\",MEDIAN(IF(N20:N30=\"Sim\",$I20:$I30)))","v":"N/D (são necessários pelo menos 3 preços)"},{"$f":"IF(COUNTIF(O20:O30,\"Sim\")<3,\"N/D (são necessários pelo menos 3 preços)\",MEDIAN(IF(O20:O30=\"Sim\",$I20:$I30)))","v":"N/D (são necessários pelo menos 3 preços)"},{"$f":"IF(COUNTIF(P20:P30,\"Sim\")<3,\"N/D (são necessários pelo menos 3 preços)\",MEDIAN(IF(P20:P30=\"Sim\",$I20:$I30)))","v":"N/D (são necessários pelo menos 3 preços)"},{"$f":"IF(COUNTIF(Q20:Q30,\"Sim\")<3,\"N/D (são necessários pelo menos 3 preços)\",MEDIAN(IF(Q20:Q30=\"Sim\",$I20:$I30)))","v":"N/D (são necessários pelo menos 3 preços)"},{"$f":"IF(COUNTIF(R20:R30,\"Sim\")<3,\"N/D (são necessários pelo menos 3 preços)\",MEDIAN(IF(R20:R30=\"Sim\",$I20:$I30)))","v":"N/D (são necessários pelo menos 3 preços)"},{"$f":"IF(COUNTIF(S20:S30,\"Sim\")<3,\"N/D (são necessários pelo menos 3 preços)\",MEDIAN(IF(S20:S30=\"Sim\",$I20:$I30)))","v":"N/D (são necessários pelo menos 3 preços)"}]
[{"$nulls":8},"Mediana:",{"$f":"IF($J$34=\"\",\"Selecione metodologia para exclusão de preços\",MEDIAN(IF($J$10:$J$30=\"Sim\",$I$10:$I$30)))","v":5.6011406755175486},null,"CV (Cotações)",{"$f":"IF(COUNTIF(M20:M30,\"Sim\")<3,\"N/D (são necessários pelo menos 3 preços)\",_xlfn.STDEV.S(IF(M20:M30=\"Sim\",$I20:$I30))/AVERAGE(IF(M20:M30=\"Sim\",$I20:$I30)))","v":"N/D (são necessários pelo menos 3 preços)"},{"$f":"IF(COUNTIF(N20:N30,\"Sim\")<3,\"N/D (são necessários pelo menos 3 preços)\",_xlfn.STDEV.S(IF(N20:N30=\"Sim\",$I20:$I30))/AVERAGE(IF(N20:N30=\"Sim\",$I20:$I30)))","v":"N/D (são necessários pelo menos 3 preços)"},{"$f":"IF(COUNTIF(O20:O30,\"Sim\")<3,\"N/D (são necessários pelo menos 3 preços)\",_xlfn.STDEV.S(IF(O20:O30=\"Sim\",$I20:$I30))/AVERAGE(IF(O20:O30=\"Sim\",$I20:$I30)))","v":"N/D (são necessários pelo menos 3 preços)"},{"$f":"IF(COUNTIF(P20:P30,\"Sim\")<3,\"N/D (são necessários pelo menos 3 preços)\",_xlfn.STDEV.S(IF(P20:P30=\"Sim\",$I20:$I30))/AVERAGE(IF(P20:P30=\"Sim\",$I20:$I30)))","v":"N/D (são necessários pelo menos 3 preços)"},{"$f":"IF(COUNTIF(Q20:Q30,\"Sim\")<3,\"N/D (são necessários pelo menos 3 preços)\",_xlfn.STDEV.S(IF(Q20:Q30=\"Sim\",$I20:$I30))/AVERAGE(IF(Q20:Q30=\"Sim\",$I20:$I30)))","v":"N/D (são necessários pelo menos 3 preços)"},{"$f":"IF(COUNTIF(R20:R30,\"Sim\")<3,\"N/D (são necessários pelo menos 3 preços)\",_xlfn.STDEV.S(IF(R20:R30=\"Sim\",$I20:$I30))/AVERAGE(IF(R20:R30=\"Sim\",$I20:$I30)))","v":"N/D (são necessários pelo menos 3 preços)"},{"$f":"IF(COUNTIF(S20:S30,\"Sim\")<3,\"N/D (são necessários pelo menos 3 preços)\",_xlfn.STDEV.S(IF(S20:S30=\"Sim\",$I20:$I30))/AVERAGE(IF(S20:S30=\"Sim\",$I20:$I30)))","v":"N/D (são necessários pelo menos 3 preços)"}]
[null,"Metodologia de exclusão de preços adotada:",{"$nulls":7},{"$f":"IF(M39=\"\",INDEX(M19:S19,MATCH(MIN(M36:S36),M36:S36,0)),M39)","v":"Grupos - Sem o maior"},null,"Média",{"$f":"IF(SUM(COUNTIF($M$10:$M$17,\"Sim\")) + SUM(COUNTIF(M20:M30,\"Sim\")) < 3,\n   \"N/D (são necessários pelo menos 3 preços)\",\n   IFERROR(AVERAGE(_xlfn._xlws.FILTER($I$10:$I$17,$M$10:$M$17=\"Sim\"), _xlfn._xlws.FILTER($I$20:$I$30,M20:M30=\"Sim\")),M31))","v":6.2243340269756766},{"$f":"IF(SUM(COUNTIF($M$10:$M$17,\"Sim\")) + SUM(COUNTIF(N20:N30,\"Sim\")) < 3,\n   \"N/D (são necessários pelo menos 3 preços)\",\n   IFERROR(AVERAGE(_xlfn._xlws.FILTER($I$10:$I$17,$M$10:$M$17=\"Sim\"), _xlfn._xlws.FILTER($I$20:$I$30,N20:N30=\"Sim\")),N31))","v":6.2243340269756766},{"$f":"IF(SUM(COUNTIF($M$10:$M$17,\"Sim\")) + SUM(COUNTIF(O20:O30,\"Sim\")) < 3,\n   \"N/D (são necessários pelo menos 3 preços)\",\n   IFERROR(AVERAGE(_xlfn._xlws.FILTER($I$10:$I$17,$M$10:$M$17=\"Sim\"), _xlfn._xlws.FILTER($I$20:$I$30,O20:O30=\"Sim\")),O31))","v":5.8213342581897907},{"$f":"IF(SUM(COUNTIF($M$10:$M$17,\"Sim\")) + SUM(COUNTIF(P20:P30,\"Sim\")) < 3,\n   \"N/D (são necessários pelo menos 3 preços)\",\n   IFERROR(AVERAGE(_xlfn._xlws.FILTER($I$10:$I$17,$M$10:$M$17=\"Sim\"), _xlfn._xlws.FILTER($I$20:$I$30,P20:P30=\"Sim\")),P31))","v":6.4624453693009016},{"$f":"IF(SUM(COUNTIF($M$10:$M$17,\"Sim\")) + SUM(COUNTIF(Q20:Q30,\"Sim\")) < 3,\n   \"N/D (são necessários pelo menos 3 preços)\",\n   IFERROR(AVERAGE(_xlfn._xlws.FILTER($I$10:$I$17,$M$10:$M$17=\"Sim\"), _xlfn._xlws.FILTER($I$20:$I$30,Q20:Q30=\"Sim\")),Q31))","v":"N/D (são necessários pelo menos 3 preços)"},{"$f":"IF(SUM(COUNTIF($M$10:$M$17,\"Sim\")) + SUM(COUNTIF(R20:R30,\"Sim\")) < 3,\n   \"N/D (são necessários pelo menos 3 preços)\",\n   IFERROR(AVERAGE(_xlfn._xlws.FILTER($I$10:$I$17,$M$10:$M$17=\"Sim\"), _xlfn._xlws.FILTER($I$20:$I$30,R20:R30=\"Sim\")),R31))","v":"N/D (são necessários pelo menos 3 preços)"},{"$f":"IF(SUM(COUNTIF($S$10:$S$17,\"Sim\")) + SUM(COUNTIF(S20:S30,\"Sim\")) < 3,\n   \"N/D (são necessários pelo menos 3 preços)\",\n   IFERROR(AVERAGE(_xlfn._xlws.FILTER($I$10:$I$17,$S$10:$S$17=\"Sim\"), _xlfn._xlws.FILTER($I$20:$I$30,S20:S30=\"Sim\")),S31))","v":"N/D (são necessários pelo menos 3 preços)"}]
[{"$nulls":11},"Mediana",{"$f":"IF(SUM(COUNTIF($M$10:$M$17,\"Sim\")) + SUM(COUNTIF(M20:M30,\"Sim\")) < 3,\n   \"N/D (são necessários pelo menos 3 preços)\",\n   IFERROR(MEDIAN(_xlfn._xlws.FILTER($I$10:$I$17,$M$10:$M$17=\"Sim\"), _xlfn._xlws.FILTER($I$20:$I$30,M20:M30=\"Sim\")),M31))","v":5.9770013872846866},{"$f":"IF(SUM(COUNTIF($M$10:$M$17,\"Sim\")) + SUM(COUNTIF(N20:N30,\"Sim\")) < 3,\n   \"N/D (são necessários pelo menos 3 preços)\",\n   IFERROR(MEDIAN(_xlfn._xlws.FILTER($I$10:$I$17,$M$10:$M$17=\"Sim\"), _xlfn._xlws.FILTER($I$20:$I$30,N20:N30=\"Sim\")),N31))","v":5.9770013872846866},{"$f":"IF(SUM(COUNTIF($M$10:$M$17,\"Sim\")) + SUM(COUNTIF(O20:O30,\"Sim\")) < 3,\n   \"N/D (são necessários pelo menos 3 preços)\",\n   IFERROR(MEDIAN(_xlfn._xlws.FILTER($I$10:$I$17,$M$10:$M$17=\"Sim\"), _xlfn._xlws.FILTER($I$20:$I$30,O20:O30=\"Sim\")),O31))","v":5.6011406755175486},{"$f":"IF(SUM(COUNTIF($M$10:$M$17,\"Sim\")) + SUM(COUNTIF(P20:P30,\"Sim\")) < 3,\n   \"N/D (são necessários pelo menos 3 preços)\",\n   IFERROR(MEDIAN(_xlfn._xlws.FILTER($I$10:$I$17,$M$10:$M$17=\"Sim\"), _xlfn._xlws.FILTER($I$20:$I$30,P20:P30=\"Sim\")),P31))","v":6.3528620990518245},{"$f":"IF(SUM(COUNTIF($M$10:$M$17,\"Sim\")) + SUM(COUNTIF(Q20:Q30,\"Sim\")) < 3,\n   \"N/D (são necessários pelo menos 3 preços)\",\n   IFERROR(MEDIAN(_xlfn._xlws.FILTER($I$10:$I$17,$M$10:$M$17=\"Sim\"), _xlfn._xlws.FILTER($I$20:$I$30,Q20:Q30=\"Sim\")),Q31))","v":"N/D (são necessários pelo menos 3 preços)"},{"$f":"IF(SUM(COUNTIF($M$10:$M$17,\"Sim\")) + SUM(COUNTIF(R20:R30,\"Sim\")) < 3,\n   \"N/D (são necessários pelo menos 3 preços)\",\n   IFERROR(MEDIAN(_xlfn._xlws.FILTER($I$10:$I$17,$M$10:$M$17=\"Sim\"), _xlfn._xlws.FILTER($I$20:$I$30,R20:R30=\"Sim\")),R31))","v":"N/D (são necessários pelo menos 3 preços)"},{"$f":"IF(SUM(COUNTIF($S$10:$S$17,\"Sim\")) + SUM(COUNTIF(S20:S30,\"Sim\")) < 3,\n   \"N/D (são necessários pelo menos 3 preços)\",\n   IFERROR(MEDIAN(_xlfn._xlws.FILTER($I$10:$I$17,$S$10:$S$17=\"Sim\"), _xlfn._xlws.FILTER($I$20:$I$30,S20:S30=\"Sim\")),S31))","v":"N/D (são necessários pelo menos 3 preços)"}]
[{"$nulls":11},"CV",{"$f":"IF(SUM(COUNTIF($M$10:$M$17,\"Sim\")) + SUM(COUNTIF(M20:M30,\"Sim\")) < 3,\n   \"N/D (são necessários pelo menos 3 preços)\",\n   IFERROR(ROUND(_xlfn.STDEV.S(_xlfn._xlws.FILTER($I$10:$I$17,$M$10:$M$17=\"Sim\"), _xlfn._xlws.FILTER($I$20:$I$30,M20:M30=\"Sim\")) /\n   AVERAGE(_xlfn._xlws.FILTER($I$10:$I$17,$M$10:$M$17=\"Sim\"), _xlfn._xlws.FILTER($I$20:$I$30,M20:M30=\"Sim\")),4),M33)\n)","v":0.14299999999999999},{"$f":"IF(SUM(COUNTIF($M$10:$M$17,\"Sim\")) + SUM(COUNTIF(N20:N30,\"Sim\")) < 3,\n   \"N/D (são necessários pelo menos 3 preços)\",\n   IFERROR(ROUND(_xlfn.STDEV.S(_xlfn._xlws.FILTER($I$10:$I$17,$M$10:$M$17=\"Sim\"), _xlfn._xlws.FILTER($I$20:$I$30,N20:N30=\"Sim\")) /\n   AVERAGE(_xlfn._xlws.FILTER($I$10:$I$17,$M$10:$M$17=\"Sim\"), _xlfn._xlws.FILTER($I$20:$I$30,N20:N30=\"Sim\")),4),N33)\n)","v":0.14299999999999999},{"$f":"IF(SUM(COUNTIF($M$10:$M$17,\"Sim\")) + SUM(COUNTIF(O20:O30,\"Sim\")) < 3,\n   \"N/D (são necessários pelo menos 3 preços)\",\n   IFERROR(ROUND(_xlfn.STDEV.S(_xlfn._xlws.FILTER($I$10:$I$17,$M$10:$M$17=\"Sim\"), _xlfn._xlws.FILTER($I$20:$I$30,O20:O30=\"Sim\")) /\n   AVERAGE(_xlfn._xlws.FILTER($I$10:$I$17,$M$10:$M$17=\"Sim\"), _xlfn._xlws.FILTER($I$20:$I$30,O20:O30=\"Sim\")),4),O33)\n)","v":7.9500000000000001E-2},{"$f":"IF(SUM(COUNTIF($M$10:$M$17,\"Sim\")) + SUM(COUNTIF(P20:P30,\"Sim\")) < 3,\n   \"N/D (são necessários pelo menos 3 preços)\",\n   IFERROR(ROUND(_xlfn.STDEV.S(_xlfn._xlws.FILTER($I$10:$I$17,$M$10:$M$17=\"Sim\"), _xlfn._xlws.FILTER($I$20:$I$30,P20:P30=\"Sim\")) /\n   AVERAGE(_xlfn._xlws.FILTER($I$10:$I$17,$M$10:$M$17=\"Sim\"), _xlfn._xlws.FILTER($I$20:$I$30,P20:P30=\"Sim\")),4),P33)\n)","v":0.14249999999999999},{"$f":"IF(SUM(COUNTIF($M$10:$M$17,\"Sim\")) + SUM(COUNTIF(Q20:Q30,\"Sim\")) < 3,\n   \"N/D (são necessários pelo menos 3 preços)\",\n   IFERROR(ROUND(_xlfn.STDEV.S(_xlfn._xlws.FILTER($I$10:$I$17,$M$10:$M$17=\"Sim\"), _xlfn._xlws.FILTER($I$20:$I$30,Q20:Q30=\"Sim\")) /\n   AVERAGE(_xlfn._xlws.FILTER($I$10:$I$17,$M$10:$M$17=\"Sim\"), _xlfn._xlws.FILTER($I$20:$I$30,Q20:Q30=\"Sim\")),4),Q33)\n)","v":"N/D (são necessários pelo menos 3 preços)"},{"$f":"IF(SUM(COUNTIF($M$10:$M$17,\"Sim\")) + SUM(COUNTIF(R20:R30,\"Sim\")) < 3,\n   \"N/D (são necessários pelo menos 3 preços)\",\n   IFERROR(ROUND(_xlfn.STDEV.S(_xlfn._xlws.FILTER($I$10:$I$17,$M$10:$M$17=\"Sim\"), _xlfn._xlws.FILTER($I$20:$I$30,R20:R30=\"Sim\")) /\n   AVERAGE(_xlfn._xlws.FILTER($I$10:$I$17,$M$10:$M$17=\"Sim\"), _xlfn._xlws.FILTER($I$20:$I$30,R20:R30=\"Sim\")),4),R33)\n)","v":"N/D (são necessários pelo menos 3 preços)"},{"$f":"IF(SUM(COUNTIF($S$10:$S$17,\"Sim\")) + SUM(COUNTIF(S20:S30,\"Sim\")) < 3,\n   \"N/D (são necessários pelo menos 3 preços)\",\n   IFERROR(_xlfn.STDEV.S(_xlfn._xlws.FILTER($I$10:$I$17,$S$10:$S$17=\"Sim\"), _xlfn._xlws.FILTER($I$20:$I$30,S20:S30=\"Sim\")) /\n   AVERAGE(_xlfn._xlws.FILTER($I$10:$I$17,$S$10:$S$17=\"Sim\"), _xlfn._xlws.FILTER($I$20:$I$30,S20:S30=\"Sim\")),S33)\n)","v":"N/D (são necessários pelo menos 3 preços)"}]
[null,"PREÇO UNITÁRIO ESTIMADO ADOTADO:",{"$nulls":7},{"$f":"IF($J$34=\"\",\"Selecione metodologia para exclusão de preços\",MIN(J32:J33))","v":5.6011406755175486},null,"Metodologia sugerida:",{"$f":"IF($M$36=MIN($M$36,$N$36:$R$36),M8,\"Grupos - \"&INDEX({\"Todos\";\"Sem o maior\";\"Sem o menor\";\"Sem o maior e Sem o menor\";\"Sem os dois maiores\"},MATCH(MIN($N$36:$R$36),$N$36:$R$36,0)))","v":"Grupos - Sem o maior"}]
[{"$nulls":11},"Preço estimado sugerido:",{"$f":"IF($M$37=M8,SMALL($M$34:$M$35,1),MIN(INDEX($N$35:$R$35, MATCH(MIN($N$36:$R$36), $N$36:$R$36, 0)),INDEX($N$34:$R$34, MATCH(MIN($N$36:$R$36), $N$36:$R$36, 0))))","v":5.6011406755175486}]
[{"$nulls":11},"Metodologia a adotar:",{"$f":"IF(INDEX(L19:S19,N39)=0,\"\",INDEX(L19:S19,N39))","v":""},1]

{"sheet":"Camarão 35% 1,8 mm","index":10,"n_rows":39,"n_cols":21,"rows_kept":39,"cut":false,"hidden":false,"merged":[[15,12,15,17],[6,2,6,5],[6,12,6,18],[7,1,7,9],[7,12,7,18],[8,12,8,17],[9,12,9,17],[10,12,10,17],[11,12,11,17],[12,12,12,17],[13,12,13,17],[14,12,14,17],[26,1,26,6],[16,12,16,17],[17,1,17,9],[17,12,17,18],[18,1,18,6],[19,1,19,6],[20,1,20,6],[21,1,21,6],[22,1,22,6],[23,1,23,6],[24,1,24,6],[25,1,25,6],[36,1,38,8],[36,9,38,9],[36,12,36,18],[37,12,37,18],[27,1,27,6],[28,1,28,6],[29,1,29,6],[30,1,32,7],[33,1,35,8],[33,9,35,9]]}
[]
[null,"Processo",{"$f":"'Peixe 50% PB Farelo'!C2","v":"59511.000102/2026-55"}]
[null,"Responsável",{"$f":"'Peixe 50% PB Farelo'!C3","v":"JHONES DE LIMA VIEIRA"}]
[null,"Área de Origem",{"$f":"'Peixe 50% PB Farelo'!C4","v":"14ª GTR"}]
[null,"Data da pesquisa",{"$f":"'Peixe 50% PB Farelo'!C5","v":"Janeiro/2026 - Fevereiro/2026"}]
[]
[null,"ITEM:","Ração peletizada adicionadas de sais para camarão 35% PB – Proteína Bruta Mín.: 35%, 1.8 mm, Data de validade não inferior a 3 meses.",null,null,null,"UNIDADE DE MEDIDA:","Kg","QUANTIDADE:",567000,null,null,"Tabela auxiliar de metodologias para exclusão de preços",{"$nulls":7},"Automática (menor CV)"]
[null,"LICITAÇÕES ANTERIORES",{"$nulls":10},"Licitações Anteriores - Outliers",{"$nulls":7},{"$f":"M19","v":"Outliers"}]
[null,"Órgão","Edital/Ano - Nº do Lote / Item","Quantidade","Valor Unitário","Data","índice de atualização (nome)","Variação acumulada do índice (%)","Preço unitário atualizado","Utilizar?  (Sim/Não)",null,null,"Utilizar?",{"$nulls":5},"Por critério do(a) analista",null,{"$f":"N19","v":"Grupos - Todos"}]
[null,"14ª SR - Fortaleza/CE","Edital 90007/2024 - Item 19",145710,4.0999999999999996,"2025-01-02","IPA-EP-DI Suprimentos agropecuários",{"$f":"(I10/E10)-1","v":1.6540957444201254E-2},{"$f":"IF(ISBLANK(E10),\"\",E10*(1+(INDEX('índice de atualização'!B:B,MATCH(G10,'índice de atualização'!B:B,0)+COUNTA('índice de atualização'!B:B)-1)-INDEX('índice de atualização'!B:B,MATCH(TEXT(F10,\"MM/AAAA\"),'índice de atualização'!A:A,0)))/INDEX('índice de atualização'!B:B,MATCH(TEXT(F10,\"MM/AAAA\"),'índice de atualização'!A:A,0))))","v":4.1678179255212244},{"$f":"IF(ISNUMBER(I10),IF($J$34<>$S$9,M10,S10),\"\")","v":"Sim"},null,null,{"$f":"IF(ISNUMBER(I10),IF(OR(I10<_xlfn.QUARTILE.INC($I$10:$I$30,1)-1.5*(_xlfn.QUARTILE.INC($I$10:I30,3)-_xlfn.QUARTILE.INC($I$10:$I$30,1)),I10>_xlfn.QUARTILE.INC($I$10:$I$30,3)+1.5*(_xlfn.QUARTILE.INC($I$10:$I$30,3)-_xlfn.QUARTILE.INC($I$10:$I$30,1))),\"Não\",\"Sim\"),\"\")","v":"Sim"},{"$nulls":7},{"$f":"O19","v":"Grupos - Sem o maior"}]
[null,"14ª SR - Fortaleza/CE","Edital 90007/2024 - Item 22",97110,4.29,"2025-02-18","IPA-EP-DI Suprimentos agropecuários",{"$f":"(I11/E11)-1","v":4.5072426012993105E-4},{"$f":"IF(ISBLANK(E11),\"\",E11*(1+(INDEX('índice de atualização'!B:B,MATCH(G11,'índice de atualização'!B:B,0)+COUNTA('índice de atualização'!B:B)-1)-INDEX('índice de atualização'!B:B,MATCH(TEXT(F11,\"MM/AAAA\"),'índice de atualização'!A:A,0)))/INDEX('índice de atualização'!B:B,MATCH(TEXT(F11,\"MM/AAAA\"),'índice de atualização'!A:A,0))))","v":4.2919336070759577},{"$f":"IF(ISNUMBER(I11),IF($J$34<>$S$8,M11,S11),\"\")","v":"Sim"},null,null,{"$f":"IF(ISNUMBER(I11),IF(OR(I11<_xlfn.QUARTILE.INC($I$10:$I$30,1)-1.5*(_xlfn.QUARTILE.INC($I$10:I31,3)-_xlfn.QUARTILE.INC($I$10:$I$30,1)),I11>_xlfn.QUARTILE.INC($I$10:$I$30,3)+1.5*(_xlfn.QUARTILE.INC($I$10:$I$30,3)-_xlfn.QUARTILE.INC($I$10:$I$30,1))),\"Não\",\"Sim\"),\"\")","v":"Sim"},{"$nulls":7},{"$f":"P19","v":"Grupos - Sem o menor"}]
[{"$nulls":8},{"$f":"IF(ISBLANK(E12),\"\",E12*(1+(INDEX('índice de atualização'!B:B,MATCH(G12,'índice de atualização'!B:B,0)+COUNTA('índice de atualização'!B:B)-1)-INDEX('índice de atualização'!B:B,MATCH(TEXT(F12,\"MM/AAAA\"),'índice de atualização'!A:A,0)))/INDEX('índice de atualização'!B:B,MATCH(TEXT(F12,\"MM/AAAA\"),'índice de atualização'!A:A,0))))","v":""},"",null,null,{"$f":"IF(ISNUMBER(I12),IF(OR(I12<_xlfn.QUARTILE.INC($I$10:$I$30,1)-1.5*(_xlfn.QUARTILE.INC($I$10:I32,3)-_xlfn.QUARTILE.INC($I$10:$I$30,1)),I12>_xlfn.QUARTILE.INC($I$10:$I$30,3)+1.5*(_xlfn.QUARTILE.INC($I$10:$I$30,3)-_xlfn.QUARTILE.INC($I$10:$I$30,1))),\"Não\",\"Sim\"),\"\")","v":""},{"$f":"$M$12","v":""},{"$f":"$M$12","v":""},{"$f":"$M$12","v":""},{"$f":"$M$12","v":""},{"$f":"$M$12","v":""},null,null,{"$f":"Q19","v":"Grupos - Sem o maior e sem o menor"}]
[{"$nulls":8},{"$f":"IF(ISBLANK(E13),\"\",E13*(1+(INDEX('índice de atualização'!B:B,MATCH(G13,'índice de atualização'!B:B,0)+COUNTA('índice de atualização'!B:B)-1)-INDEX('índice de atualização'!B:B,MATCH(TEXT(F13,\"MM/AAAA\"),'índice de atualização'!A:A,0)))/INDEX('índice de atualização'!B:B,MATCH(TEXT(F13,\"MM/AAAA\"),'índice de atualização'!A:A,0))))","v":""},"",null,null,{"$f":"IF(ISNUMBER(I13),IF(OR(I13<_xlfn.QUARTILE.INC($I$10:$I$30,1)-1.5*(_xlfn.QUARTILE.INC($I$10:I33,3)-_xlfn.QUARTILE.INC($I$10:$I$30,1)),I13>_xlfn.QUARTILE.INC($I$10:$I$30,3)+1.5*(_xlfn.QUARTILE.INC($I$10:$I$30,3)-_xlfn.QUARTILE.INC($I$10:$I$30,1))),\"Não\",\"Sim\"),\"\")","v":""},{"$f":"$M$13","v":""},{"$f":"$M$13","v":""},{"$f":"$M$13","v":""},{"$f":"$M$13","v":""},{"$f":"$M$13","v":""},null,null,{"$f":"R19","v":"Grupos - Sem os dois maiores"}]
[{"$nulls":8},{"$f":"IF(ISBLANK(E14),\"\",E14*(1+(INDEX('índice de atualização'!B:B,MATCH(G14,'índice de atualização'!B:B,0)+COUNTA('índice de atualização'!B:B)-1)-INDEX('índice de atualização'!B:B,MATCH(TEXT(F14,\"MM/AAAA\"),'índice de atualização'!A:A,0)))/INDEX('índice de atualização'!B:B,MATCH(TEXT(F14,\"MM/AAAA\"),'índice de atualização'!A:A,0))))","v":""},"",null,null,{"$f":"IF(ISNUMBER(I14),IF(OR(I14<_xlfn.QUARTILE.INC($I$10:$I$30,1)-1.5*(_xlfn.QUARTILE.INC($I$10:I34,3)-_xlfn.QUARTILE.INC($I$10:$I$30,1)),I14>_xlfn.QUARTILE.INC($I$10:$I$30,3)+1.5*(_xlfn.QUARTILE.INC($I$10:$I$30,3)-_xlfn.QUARTILE.INC($I$10:$I$30,1))),\"Não\",\"Sim\"),\"\")","v":""},{"$f":"$M$14","v":""},"","","","",null,null,{"$f":"S19","v":"Por critério do(a) analista"}]
[{"$nulls":8},{"$f":"IF(ISBLANK(E15),\"\",E15*(1+(INDEX('índice de atualização'!B:B,MATCH(G15,'índice de atualização'!B:B,0)+COUNTA('índice de atualização'!B:B)-1)-INDEX('índice de atualização'!B:B,MATCH(TEXT(F15,\"MM/AAAA\"),'índice de atualização'!A:A,0)))/INDEX('índice de atualização'!B:B,MATCH(TEXT(F15,\"MM/AAAA\"),'índice de atualização'!A:A,0))))","v":""},"",null,null,{"$f":"IF(ISNUMBER(I15),IF(OR(I15<_xlfn.QUARTILE.INC($I$10:$I$30,1)-1.5*(_xlfn.QUARTILE.INC($I$10:I35,3)-_xlfn.QUARTILE.INC($I$10:$I$30,1)),I15>_xlfn.QUARTILE.INC($I$10:$I$30,3)+1.5*(_xlfn.QUARTILE.INC($I$10:$I$30,3)-_xlfn.QUARTILE.INC($I$10:$I$30,1))),\"Não\",\"Sim\"),\"\")","v":""},"","","","",""]
[{"$nulls":8},{"$f":"IF(ISBLANK(E16),\"\",E16*(1+(INDEX('índice de atualização'!B:B,MATCH(G16,'índice de atualização'!B:B,0)+COUNTA('índice de atualização'!B:B)-1)-INDEX('índice de atualização'!B:B,MATCH(TEXT(F16,\"MM/AAAA\"),'índice de atualização'!A:A,0)))/INDEX('índice de atualização'!B:B,MATCH(TEXT(F16,\"MM/AAAA\"),'índice de atualização'!A:A,0))))","v":""},"",null,null,{"$f":"IF(ISNUMBER(I16),IF(OR(I16<_xlfn.QUARTILE.INC($I$10:$I$30,1)-1.5*(_xlfn.QUARTILE.INC($I$10:I37,3)-_xlfn.QUARTILE.INC($I$10:$I$30,1)),I16>_xlfn.QUARTILE.INC($I$10:$I$30,3)+1.5*(_xlfn.QUARTILE.INC($I$10:$I$30,3)-_xlfn.QUARTILE.INC($I$10:$I$30,1))),\"Não\",\"Sim\"),\"\")","v":""},{"$f":"$M$16","v":""},{"$f":"$M$16","v":""},{"$f":"$M$16","v":""},{"$f":"$M$16","v":""},{"$f":"$M$16","v":""}]
[{"$nulls":8},{"$f":"IF(ISBLANK(E17),\"\",E17*(1+(INDEX('índice de atualização'!B:B,MATCH(G17,'índice de atualização'!B:B,0)+COUNTA('índice de atualização'!B:B)-1)-INDEX('índice de atualização'!B:B,MATCH(TEXT(F17,\"MM/AAAA\"),'índice de atualização'!A:A,0)))/INDEX('índice de atualização'!B:B,MATCH(TEXT(F17,\"MM/AAAA\"),'índice de atualização'!A:A,0))))","v":""},"",null,null,{"$f":"IF(ISNUMBER(I17),IF(OR(I17<_xlfn.QUARTILE.INC($I$10:$I$30,1)-1.5*(_xlfn.QUARTILE.INC($I$10:I40,3)-_xlfn.QUARTILE.INC($I$10:$I$30,1)),I17>_xlfn.QUARTILE.INC($I$10:$I$30,3)+1.5*(_xlfn.QUARTILE.INC($I$10:$I$30,3)-_xlfn.QUARTILE.INC($I$10:$I$30,1))),\"Não\",\"Sim\"),\"\")","v":""},{"$f":"$M$17","v":""},{"$f":"$M$17","v":""},{"$f":"$M$17","v":""},{"$f":"$M$17","v":""},{"$f":"$M$17","v":""}]
[null,"COTAÇÕES DE MERCADO",{"$nulls":10},"Cotações"]
[null,"Empresa",{"$nulls":5},"Data","Preço Unitário","Utilizar? (Sim/Não)",null,null,"Outliers","Grupos - Todos","Grupos - Sem o maior","Grupos - Sem o menor","Grupos - Sem o maior e sem o menor","Grupos - Sem os dois maiores","Por critério do(a) analista"]
[null,"Samaria Rações LTDA",{"$nulls":5},"2026-02-09",{"$f":"123/30","v":4.0999999999999996},{"$f":"IF(ISNUMBER(I20),IF($J$34=$M$19,M20,IF($J$34=$N$19,N20,IF($J$34=$O$19,O20,IF($J$34=$P$19,P20,IF($J$34=$Q$19,Q20,IF($J$34=$R$19,R20,IF($J$34=$S$19,S20,\"\"))))))),\"\")","v":"Não"},null,null,{"$f":"IF(ISNUMBER(I20),IF(OR(I20<_xlfn.QUARTILE.INC($I$10:$I$30,1)-1.5*(_xlfn.QUARTILE.INC($I$10:I41,3)-_xlfn.QUARTILE.INC($I$10:$I$30,1)),I20>_xlfn.QUARTILE.INC($I$10:$I$30,3)+1.5*(_xlfn.QUARTILE.INC($I$10:$I$30,3)-_xlfn.QUARTILE.INC($I$10:$I$30,1))),\"Não\",\"Sim\"),\"\")","v":"Sim"},{"$f":"IF(ISNUMBER(I20),\"Sim\",\"\")","v":"Sim"},{"$f":"IF(ISNUMBER(I20),IF(_xlfn.RANK.EQ(I20,$I$20:$I$30)=1,\"Não\",\"Sim\"),\"\")","v":"Sim"},{"$f":"IF(ISNUMBER(I20),IF(_xlfn.RANK.EQ(I20,$I$20:$I$30)=COUNT($I$20:$I$30),\"Não\",\"Sim\"),\"\")","v":"Não"},{"$f":"IF(O20=\"\",\"\",IF(AND(O20=\"Sim\",P20=\"Sim\"),\"Sim\",\"Não\"))","v":"Não"},{"$f":"IF(ISNUMBER(I20),IF(_xlfn.RANK.EQ(I20,$I$20:$I$30)<=2,\"Não\",\"Sim\"),\"\")","v":"Sim"}]
[null,"Integral Mix Agroindustria",{"$nulls":5},"2026-02-07",{"$f":"124.48/30","v":4.1493333333333338},{"$f":"IF(ISNUMBER(I21),IF($J$34=$M$19,M21,IF($J$34=$N$19,N21,IF($J$34=$O$19,O21,IF($J$34=$P$19,P21,IF($J$34=$Q$19,Q21,IF($J$34=$R$19,R21,IF($J$34=$S$19,S21,\"\"))))))),\"\")","v":"Sim"},null,null,{"$f":"IF(ISNUMBER(I21),IF(OR(I21<_xlfn.QUARTILE.INC($I$10:$I$30,1)-1.5*(_xlfn.QUARTILE.INC($I$10:I41,3)-_xlfn.QUARTILE.INC($I$10:$I$30,1)),I21>_xlfn.QUARTILE.INC($I$10:$I$30,3)+1.5*(_xlfn.QUARTILE.INC($I$10:$I$30,3)-_xlfn.QUARTILE.INC($I$10:$I$30,1))),\"Não\",\"Sim\"),\"\")","v":"Sim"},{"$f":"IF(ISNUMBER(I21),\"Sim\",\"\")","v":"Sim"},{"$f":"IF(ISNUMBER(I21),IF(_xlfn.RANK.EQ(I21,$I$20:$I$30)=1,\"Não\",\"Sim\"),\"\")","v":"Sim"},{"$f":"IF(ISNUMBER(I21),IF(_xlfn.RANK.EQ(I21,$I$20:$I$30)=COUNT($I$20:$I$30),\"Não\",\"Sim\"),\"\")","v":"Sim"},{"$f":"IF(O21=\"\",\"\",IF(AND(O21=\"Sim\",P21=\"Sim\"),\"Sim\",\"Não\"))","v":"Sim"},{"$f":"IF(ISNUMBER(I21),IF(_xlfn.RANK.EQ(I21,$I$20:$I$30)<=2,\"Não\",\"Sim\"),\"\")","v":"Não"}]
[null,"Comercial do Carmo ME",{"$nulls":5},"2026-02-12",{"$f":"167/30","v":5.5666666666666664},"Não",null,null,{"$f":"IF(ISNUMBER(I22),IF(OR(I22<_xlfn.QUARTILE.INC($I$10:$I$30,1)-1.5*(_xlfn.QUARTILE.INC($I$10:I41,3)-_xlfn.QUARTILE.INC($I$10:$I$30,1)),I22>_xlfn.QUARTILE.INC($I$10:$I$30,3)+1.5*(_xlfn.QUARTILE.INC($I$10:$I$30,3)-_xlfn.QUARTILE.INC($I$10:$I$30,1))),\"Não\",\"Sim\"),\"\")","v":"Não"},{"$f":"IF(ISNUMBER(I22),\"Sim\",\"\")","v":"Sim"},"Não","Sim","Não","Não"]
[{"$nulls":9},"",null,null,{"$f":"IF(ISNUMBER(I23),IF(OR(I23<_xlfn.QUARTILE.INC($I$10:$I$30,1)-1.5*(_xlfn.QUARTILE.INC($I$10:I41,3)-_xlfn.QUARTILE.INC($I$10:$I$30,1)),I23>_xlfn.QUARTILE.INC($I$10:$I$30,3)+1.5*(_xlfn.QUARTILE.INC($I$10:$I$30,3)-_xlfn.QUARTILE.INC($I$10:$I$30,1))),\"Não\",\"Sim\"),\"\")","v":""},"","","","",""]
[{"$nulls":9},"",null,null,{"$f":"IF(ISNUMBER(I24),IF(OR(I24<_xlfn.QUARTILE.INC($I$10:$I$30,1)-1.5*(_xlfn.QUARTILE.INC($I$10:I42,3)-_xlfn.QUARTILE.INC($I$10:$I$30,1)),I24>_xlfn.QUARTILE.INC($I$10:$I$30,3)+1.5*(_xlfn.QUARTILE.INC($I$10:$I$30,3)-_xlfn.QUARTILE.INC($I$10:$I$30,1))),\"Não\",\"Sim\"),\"\")","v":""},"","","","",""]
[{"$nulls":9},"",null,null,{"$f":"IF(ISNUMBER(I25),IF(OR(I25<_xlfn.QUARTILE.INC($I$10:$I$30,1)-1.5*(_xlfn.QUARTILE.INC($I$10:I43,3)-_xlfn.QUARTILE.INC($I$10:$I$30,1)),I25>_xlfn.QUARTILE.INC($I$10:$I$30,3)+1.5*(_xlfn.QUARTILE.INC($I$10:$I$30,3)-_xlfn.QUARTILE.INC($I$10:$I$30,1))),\"Não\",\"Sim\"),\"\")","v":""},"","","","",""]
[{"$nulls":9},"",null,null,{"$f":"IF(ISNUMBER(I26),IF(OR(I26<_xlfn.QUARTILE.INC($I$10:$I$30,1)-1.5*(_xlfn.QUARTILE.INC($I$10:I41,3)-_xlfn.QUARTILE.INC($I$10:$I$30,1)),I26>_xlfn.QUARTILE.INC($I$10:$I$30,3)+1.5*(_xlfn.QUARTILE.INC($I$10:$I$30,3)-_xlfn.QUARTILE.INC($I$10:$I$30,1))),\"Não\",\"Sim\"),\"\")","v":""},"","","","",""]
[{"$nulls":9},"",null,null,{"$f":"IF(ISNUMBER(I27),IF(OR(I27<_xlfn.QUARTILE.INC($I$10:$I$30,1)-1.5*(_xlfn.QUARTILE.INC($I$10:I41,3)-_xlfn.QUARTILE.INC($I$10:$I$30,1)),I27>_xlfn.QUARTILE.INC($I$10:$I$30,3)+1.5*(_xlfn.QUARTILE.INC($I$10:$I$30,3)-_xlfn.QUARTILE.INC($I$10:$I$30,1))),\"Não\",\"Sim\"),\"\")","v":""},"","","","",""]
[{"$nulls":9},"",null,null,{"$f":"IF(ISNUMBER(I28),IF(OR(I28<_xlfn.QUARTILE.INC($I$10:$I$30,1)-1.5*(_xlfn.QUARTILE.INC($I$10:I41,3)-_xlfn.QUARTILE.INC($I$10:$I$30,1)),I28>_xlfn.QUARTILE.INC($I$10:$I$30,3)+1.5*(_xlfn.QUARTILE.INC($I$10:$I$30,3)-_xlfn.QUARTILE.INC($I$10:$I$30,1))),\"Não\",\"Sim\"),\"\")","v":""},"","","","",""]
[{"$nulls":9},"",null,null,{"$f":"IF(ISNUMBER(I29),IF(OR(I29<_xlfn.QUARTILE.INC($I$10:$I$30,1)-1.5*(_xlfn.QUARTILE.INC($I$10:I41,3)-_xlfn.QUARTILE.INC($I$10:$I$30,1)),I29>_xlfn.QUARTILE.INC($I$10:$I$30,3)+1.5*(_xlfn.QUARTILE.INC($I$10:$I$30,3)-_xlfn.QUARTILE.INC($I$10:$I$30,1))),\"Não\",\"Sim\"),\"\")","v":""},"","","","",""]
[{"$nulls":9},"",null,null,{"$f":"IF(ISNUMBER(I30),IF(OR(I30<_xlfn.QUARTILE.INC($I$10:$I$30,1)-1.5*(_xlfn.QUARTILE.INC($I$10:I41,3)-_xlfn.QUARTILE.INC($I$10:$I$30,1)),I30>_xlfn.QUARTILE.INC($I$10:$I$30,3)+1.5*(_xlfn.QUARTILE.INC($I$10:$I$30,3)-_xlfn.QUARTILE.INC($I$10:$I$30,1))),\"Não\",\"Sim\"),\"\")","v":""},"","","","",""]
[null,"Observações:",{"$nulls":6},"CV:",{"$f":"IF($J$34=\"\",\"Selecione metodologia para exclusão de preços\",IF(COUNTIF($J$10:$J$30,\"Sim\")<3,\"N/D (são necessários pelo menos 3 preços)\",_xlfn.STDEV.S(IF($J$10:$J$30=\"Sim\",$I$10:$I$30))/AVERAGE(IF($J$10:$J$30=\"Sim\",$I$10:$I$30))))","v":1.8450267724149583E-2},null,"Média (Cotações)",{"$f":"IF(COUNTIF(M20:M30,\"Sim\")<3,\"N/D (são necessários pelo menos 3 preços)\",AVERAGE(IF(M20:M30=\"Sim\",$I20:$I30)))","v":"N/D (são necessários pelo menos 3 preços)"},{"$f":"IF(COUNTIF(N20:N30,\"Sim\")<3,\"N/D (são necessários pelo menos 3 preços)\",AVERAGE(IF(N20:N30=\"Sim\",$I20:$I30)))","v":4.6053333333333333},{"$f":"IF(COUNTIF(O20:O30,\"Sim\")<3,\"N/D (são necessários pelo menos 3 preços)\",AVERAGE(IF(O20:O30=\"Sim\",$I20:$I30)))","v":"N/D (são necessários pelo menos 3 preços)"},{"$f":"IF(COUNTIF(P20:P30,\"Sim\")<3,\"N/D (são necessários pelo menos 3 preços)\",AVERAGE(IF(P20:P30=\"Sim\",$I20:$I30)))","v":"N/D (são necessários pelo menos 3 preços)"},{"$f":"IF(COUNTIF(Q20:Q30,\"Sim\")<3,\"N/D (são necessários pelo menos 3 preços)\",AVERAGE(IF(Q20:Q30=\"Sim\",$I20:$I30)))","v":"N/D (são necessários pelo menos 3 preços)"},{"$f":"IF(COUNTIF(R20:R30,\"Sim\")<3,\"N/D (são necessários pelo menos 3 preços)\",AVERAGE(IF(R20:R30=\"Sim\",$I20:$I30)))","v":"N/D (são necessários pelo menos 3 preços)"},{"$f":"IF(COUNTIF(S20:S30,\"Sim\")<3,\"N/D (são necessários pelo menos 3 preços)\",AVERAGE(IF(S20:S30=\"Sim\",$I20:$I30)))","v":"N/D (são necessários pelo menos 3 preços)"}]
[{"$nulls":8},"Média:",{"$f":"IF($J$34=\"\",\"Selecione metodologia para exclusão de preços\",AVERAGE(IF($J$10:$J$30=\"Sim\",$I$10:$I$30)))","v":4.2030282886435053},null,"Mediana (Cotações)",{"$f":"IF(COUNTIF(M20:M30,\"Sim\")<3,\"N/D (são necessários pelo menos 3 preços)\",MEDIAN(IF(M20:M30=\"Sim\",$I20:$I30)))","v":"N/D (são necessários pelo menos 3 preços)"},{"$f":"IF(COUNTIF(N20:N30,\"Sim\")<3,\"N/D (são necessários pelo menos 3 preços)\",MEDIAN(IF(N20:N30=\"Sim\",$I20:$I30)))","v":4.1493333333333338},{"$f":"IF(COUNTIF(O20:O30,\"Sim\")<3,\"N/D (são necessários pelo menos 3 preços)\",MEDIAN(IF(O20:O30=\"Sim\",$I20:$I30)))","v":"N/D (são necessários pelo menos 3 preços)"},{"$f":"IF(COUNTIF(P20:P30,\"Sim\")<3,\"N/D (são necessários pelo menos 3 preços)\",MEDIAN(IF(P20:P30=\"Sim\",$I20:$I30)))","v":"N/D (são necessários pelo menos 3 preços)"},{"$f":"IF(COUNTIF(Q20:Q30,\"Sim\")<3,\"N/D (são necessários pelo menos 3 preços)\",MEDIAN(IF(Q20:Q30=\"Sim\",$I20:$I30)))","v":"N/D (são necessários pelo menos 3 preços)"},{"$f":"IF(COUNTIF(R20:R30,\"Sim\")<3,\"N/D (são necessários pelo menos 3 preços)\",MEDIAN(IF(R20:R30=\"Sim\",$I20:$I30)))","v":"N/D (são necessários pelo menos 3 preços)"},{"$f":"IF(COUNTIF(S20:S30,\"Sim\")<3,\"N/D (são necessários pelo menos 3 preços)\",MEDIAN(IF(S20:S30=\"Sim\",$I20:$I30)))","v":"N/D (são necessários pelo menos 3 preços)"}]
[{"$nulls":8},"Mediana:",{"$f":"IF($J$34=\"\",\"Selecione metodologia para exclusão de preços\",MEDIAN(IF($J$10:$J$30=\"Sim\",$I$10:$I$30)))","v":4.1678179255212244},null,"CV (Cotações)",{"$f":"IF(COUNTIF(M20:M30,\"Sim\")<3,\"N/D (são necessários pelo menos 3 preços)\",_xlfn.STDEV.S(IF(M20:M30=\"Sim\",$I20:$I30))/AVERAGE(IF(M20:M30=\"Sim\",$I20:$I30)))","v":"N/D (são necessários pelo menos 3 preços)"},{"$f":"IF(COUNTIF(N20:N30,\"Sim\")<3,\"N/D (são necessários pelo menos 3 preços)\",_xlfn.STDEV.S(IF(N20:N30=\"Sim\",$I20:$I30))/AVERAGE(IF(N20:N30=\"Sim\",$I20:$I30)))","v":0.18085649021892009},{"$f":"IF(COUNTIF(O20:O30,\"Sim\")<3,\"N/D (são necessários pelo menos 3 preços)\",_xlfn.STDEV.S(IF(O20:O30=\"Sim\",$I20:$I30))/AVERAGE(IF(O20:O30=\"Sim\",$I20:$I30)))","v":"N/D (são necessários pelo menos 3 preços)"},{"$f":"IF(COUNTIF(P20:P30,\"Sim\")<3,\"N/D (são necessários pelo menos 3 preços)\",_xlfn.STDEV.S(IF(P20:P30=\"Sim\",$I20:$I30))/AVERAGE(IF(P20:P30=\"Sim\",$I20:$I30)))","v":"N/D (são necessários pelo menos 3 preços)"},{"$f":"IF(COUNTIF(Q20:Q30,\"Sim\")<3,\"N/D (são necessários pelo menos 3 preços)\",_xlfn.STDEV.S(IF(Q20:Q30=\"Sim\",$I20:$I30))/AVERAGE(IF(Q20:Q30=\"Sim\",$I20:$I30)))","v":"N/D (são necessários pelo menos 3 preços)"},{"$f":"IF(COUNTIF(R20:R30,\"Sim\")<3,\"N/D (são necessários pelo menos 3 preços)\",_xlfn.STDEV.S(IF(R20:R30=\"Sim\",$I20:$I30))/AVERAGE(IF(R20:R30=\"Sim\",$I20:$I30)))","v":"N/D (são necessários pelo menos 3 preços)"},{"$f":"IF(COUNTIF(S20:S30,\"Sim\")<3,\"N/D (são necessários pelo menos 3 preços)\",_xlfn.STDEV.S(IF(S20:S30=\"Sim\",$I20:$I30))/AVERAGE(IF(S20:S30=\"Sim\",$I20:$I30)))","v":"N/D (são necessários pelo menos 3 preços)"}]
[null,"Metodologia de exclusão de preços adotada:",{"$nulls":7},{"$f":"IF(M39=\"\",INDEX(M19:S19,MATCH(MIN(M36:S36),M36:S36,0)),M39)","v":"Grupos - Sem o maior e sem o menor"},null,"Média",{"$f":"IF(SUM(COUNTIF($M$10:$M$17,\"Sim\")) + SUM(COUNTIF(M20:M30,\"Sim\")) < 3,\n   \"N/D (são necessários pelo menos 3 preços)\",\n   IFERROR(AVERAGE(_xlfn._xlws.FILTER($I$10:$I$17,$M$10:$M$17=\"Sim\"), _xlfn._xlws.FILTER($I$20:$I$30,M20:M30=\"Sim\")),M31))","v":4.1772712164826284},{"$f":"IF(SUM(COUNTIF($M$10:$M$17,\"Sim\")) + SUM(COUNTIF(N20:N30,\"Sim\")) < 3,\n   \"N/D (são necessários pelo menos 3 preços)\",\n   IFERROR(AVERAGE(_xlfn._xlws.FILTER($I$10:$I$17,$M$10:$M$17=\"Sim\"), _xlfn._xlws.FILTER($I$20:$I$30,N20:N30=\"Sim\")),N31))","v":4.4551503065194362},{"$f":"IF(SUM(COUNTIF($M$10:$M$17,\"Sim\")) + SUM(COUNTIF(O20:O30,\"Sim\")) < 3,\n   \"N/D (são necessários pelo menos 3 preços)\",\n   IFERROR(AVERAGE(_xlfn._xlws.FILTER($I$10:$I$17,$M$10:$M$17=\"Sim\"), _xlfn._xlws.FILTER($I$20:$I$30,O20:O30=\"Sim\")),O31))","v":4.1772712164826284},{"$f":"IF(SUM(COUNTIF($M$10:$M$17,\"Sim\")) + SUM(COUNTIF(P20:P30,\"Sim\")) < 3,\n   \"N/D (são necessários pelo menos 3 preços)\",\n   IFERROR(AVERAGE(_xlfn._xlws.FILTER($I$10:$I$17,$M$10:$M$17=\"Sim\"), _xlfn._xlws.FILTER($I$20:$I$30,P20:P30=\"Sim\")),P31))","v":4.5439378831492956},{"$f":"IF(SUM(COUNTIF($M$10:$M$17,\"Sim\")) + SUM(COUNTIF(Q20:Q30,\"Sim\")) < 3,\n   \"N/D (são necessários pelo menos 3 preços)\",\n   IFERROR(AVERAGE(_xlfn._xlws.FILTER($I$10:$I$17,$M$10:$M$17=\"Sim\"), _xlfn._xlws.FILTER($I$20:$I$30,Q20:Q30=\"Sim\")),Q31))","v":4.2030282886435053},{"$f":"IF(SUM(COUNTIF($M$10:$M$17,\"Sim\")) + SUM(COUNTIF(R20:R30,\"Sim\")) < 3,\n   \"N/D (são necessários pelo menos 3 preços)\",\n   IFERROR(AVERAGE(_xlfn._xlws.FILTER($I$10:$I$17,$M$10:$M$17=\"Sim\"), _xlfn._xlws.FILTER($I$20:$I$30,R20:R30=\"Sim\")),R31))","v":4.1865838441990606},{"$f":"IF(SUM(COUNTIF($S$10:$S$17,\"Sim\")) + SUM(COUNTIF(S20:S30,\"Sim\")) < 3,\n   \"N/D (são necessários pelo menos 3 preços)\",\n   IFERROR(AVERAGE(_xlfn._xlws.FILTER($I$10:$I$17,$S$10:$S$17=\"Sim\"), _xlfn._xlws.FILTER($I$20:$I$30,S20:S30=\"Sim\")),S31))","v":"N/D (são necessários pelo menos 3 preços)"}]
[{"$nulls":11},"Mediana",{"$f":"IF(SUM(COUNTIF($M$10:$M$17,\"Sim\")) + SUM(COUNTIF(M20:M30,\"Sim\")) < 3,\n   \"N/D (são necessários pelo menos 3 preços)\",\n   IFERROR(MEDIAN(_xlfn._xlws.FILTER($I$10:$I$17,$M$10:$M$17=\"Sim\"), _xlfn._xlws.FILTER($I$20:$I$30,M20:M30=\"Sim\")),M31))","v":4.1585756294272791},{"$f":"IF(SUM(COUNTIF($M$10:$M$17,\"Sim\")) + SUM(COUNTIF(N20:N30,\"Sim\")) < 3,\n   \"N/D (são necessários pelo menos 3 preços)\",\n   IFERROR(MEDIAN(_xlfn._xlws.FILTER($I$10:$I$17,$M$10:$M$17=\"Sim\"), _xlfn._xlws.FILTER($I$20:$I$30,N20:N30=\"Sim\")),N31))","v":4.1678179255212244},{"$f":"IF(SUM(COUNTIF($M$10:$M$17,\"Sim\")) + SUM(COUNTIF(O20:O30,\"Sim\")) < 3,\n   \"N/D (são necessários pelo menos 3 preços)\",\n   IFERROR(MEDIAN(_xlfn._xlws.FILTER($I$10:$I$17,$M$10:$M$17=\"Sim\"), _xlfn._xlws.FILTER($I$20:$I$30,O20:O30=\"Sim\")),O31))","v":4.1585756294272791},{"$f":"IF(SUM(COUNTIF($M$10:$M$17,\"Sim\")) + SUM(COUNTIF(P20:P30,\"Sim\")) < 3,\n   \"N/D (são necessários pelo menos 3 preços)\",\n   IFERROR(MEDIAN(_xlfn._xlws.FILTER($I$10:$I$17,$M$10:$M$17=\"Sim\"), _xlfn._xlws.FILTER($I$20:$I$30,P20:P30=\"Sim\")),P31))","v":4.2298757662985906},{"$f":"IF(SUM(COUNTIF($M$10:$M$17,\"Sim\")) + SUM(COUNTIF(Q20:Q30,\"Sim\")) < 3,\n   \"N/D (são necessários pelo menos 3 preços)\",\n   IFERROR(MEDIAN(_xlfn._xlws.FILTER($I$10:$I$17,$M$10:$M$17=\"Sim\"), _xlfn._xlws.FILTER($I$20:$I$30,Q20:Q30=\"Sim\")),Q31))","v":4.1678179255212244},{"$f":"IF(SUM(COUNTIF($M$10:$M$17,\"Sim\")) + SUM(COUNTIF(R20:R30,\"Sim\")) < 3,\n   \"N/D (são necessários pelo menos 3 preços)\",\n   IFERROR(MEDIAN(_xlfn._xlws.FILTER($I$10:$I$17,$M$10:$M$17=\"Sim\"), _xlfn._xlws.FILTER($I$20:$I$30,R20:R30=\"Sim\")),R31))","v":4.1678179255212244},{"$f":"IF(SUM(COUNTIF($S$10:$S$17,\"Sim\")) + SUM(COUNTIF(S20:S30,\"Sim\")) < 3,\n   \"N/D (são necessários pelo menos 3 preços)\",\n   IFERROR(MEDIAN(_xlfn._xlws.FILTER($I$10:$I$17,$S$10:$S$17=\"Sim\"), _xlfn._xlws.FILTER($I$20:$I$30,S20:S30=\"Sim\")),S31))","v":"N/D (são necessários pelo menos 3 preços)"}]
[{"$nulls":11},"CV",{"$f":"IF(SUM(COUNTIF($M$10:$M$17,\"Sim\")) + SUM(COUNTIF(M20:M30,\"Sim\")) < 3,\n   \"N/D (são necessários pelo menos 3 preços)\",\n   IFERROR(ROUND(_xlfn.STDEV.S(_xlfn._xlws.FILTER($I$10:$I$17,$M$10:$M$17=\"Sim\"), _xlfn._xlws.FILTER($I$20:$I$30,M20:M30=\"Sim\")) /\n   AVERAGE(_xlfn._xlws.FILTER($I$10:$I$17,$M$10:$M$17=\"Sim\"), _xlfn._xlws.FILTER($I$20:$I$30,M20:M30=\"Sim\")),4),M33)\n)","v":1.95E-2},{"$f":"IF(SUM(COUNTIF($M$10:$M$17,\"Sim\")) + SUM(COUNTIF(N20:N30,\"Sim\")) < 3,\n   \"N/D (são necessários pelo menos 3 preços)\",\n   IFERROR(ROUND(_xlfn.STDEV.S(_xlfn._xlws.FILTER($I$10:$I$17,$M$10:$M$17=\"Sim\"), _xlfn._xlws.FILTER($I$20:$I$30,N20:N30=\"Sim\")) /\n   AVERAGE(_xlfn._xlws.FILTER($I$10:$I$17,$M$10:$M$17=\"Sim\"), _xlfn._xlws.FILTER($I$20:$I$30,N20:N30=\"Sim\")),4),N33)\n)","v":0.1404},{"$f":"IF(SUM(COUNTIF($M$10:$M$17,\"Sim\")) + SUM(COUNTIF(O20:O30,\"Sim\")) < 3,\n   \"N/D (são necessários pelo menos 3 preços)\",\n   IFERROR(ROUND(_xlfn.STDEV.S(_xlfn._xlws.FILTER($I$10:$I$17,$M$10:$M$17=\"Sim\"), _xlfn._xlws.FILTER($I$20:$I$30,O20:O30=\"Sim\")) /\n   AVERAGE(_xlfn._xlws.FILTER($I$10:$I$17,$M$10:$M$17=\"Sim\"), _xlfn._xlws.FILTER($I$20:$I$30,O20:O30=\"Sim\")),4),O33)\n)","v":1.95E-2},{"$f":"IF(SUM(COUNTIF($M$10:$M$17,\"Sim\")) + SUM(COUNTIF(P20:P30,\"Sim\")) < 3,\n   \"N/D (são necessários pelo menos 3 preços)\",\n   IFERROR(ROUND(_xlfn.STDEV.S(_xlfn._xlws.FILTER($I$10:$I$17,$M$10:$M$17=\"Sim\"), _xlfn._xlws.FILTER($I$20:$I$30,P20:P30=\"Sim\")) /\n   AVERAGE(_xlfn._xlws.FILTER($I$10:$I$17,$M$10:$M$17=\"Sim\"), _xlfn._xlws.FILTER($I$20:$I$30,P20:P30=\"Sim\")),4),P33)\n)","v":0.1507},{"$f":"IF(SUM(COUNTIF($M$10:$M$17,\"Sim\")) + SUM(COUNTIF(Q20:Q30,\"Sim\")) < 3,\n   \"N/D (são necessários pelo menos 3 preços)\",\n   IFERROR(ROUND(_xlfn.STDEV.S(_xlfn._xlws.FILTER($I$10:$I$17,$M$10:$M$17=\"Sim\"), _xlfn._xlws.FILTER($I$20:$I$30,Q20:Q30=\"Sim\")) /\n   AVERAGE(_xlfn._xlws.FILTER($I$10:$I$17,$M$10:$M$17=\"Sim\"), _xlfn._xlws.FILTER($I$20:$I$30,Q20:Q30=\"Sim\")),4),Q33)\n)","v":1.8499999999999999E-2},{"$f":"IF(SUM(COUNTIF($M$10:$M$17,\"Sim\")) + SUM(COUNTIF(R20:R30,\"Sim\")) < 3,\n   \"N/D (são necessários pelo menos 3 preços)\",\n   IFERROR(ROUND(_xlfn.STDEV.S(_xlfn._xlws.FILTER($I$10:$I$17,$M$10:$M$17=\"Sim\"), _xlfn._xlws.FILTER($I$20:$I$30,R20:R30=\"Sim\")) /\n   AVERAGE(_xlfn._xlws.FILTER($I$10:$I$17,$M$10:$M$17=\"Sim\"), _xlfn._xlws.FILTER($I$20:$I$30,R20:R30=\"Sim\")),4),R33)\n)","v":2.3199999999999998E-2},{"$f":"IF(SUM(COUNTIF($S$10:$S$17,\"Sim\")) + SUM(COUNTIF(S20:S30,\"Sim\")) < 3,\n   \"N/D (são necessários pelo menos 3 preços)\",\n   IFERROR(_xlfn.STDEV.S(_xlfn._xlws.FILTER($I$10:$I$17,$S$10:$S$17=\"Sim\"), _xlfn._xlws.FILTER($I$20:$I$30,S20:S30=\"Sim\")) /\n   AVERAGE(_xlfn._xlws.FILTER($I$10:$I$17,$S$10:$S$17=\"Sim\"), _xlfn._xlws.FILTER($I$20:$I$30,S20:S30=\"Sim\")),S33)\n)","v":"N/D (são necessários pelo menos 3 preços)"}]
[null,"PREÇO UNITÁRIO ESTIMADO ADOTADO:",{"$nulls":7},{"$f":"IF($J$34=\"\",\"Selecione metodologia para exclusão de preços\",MIN(J32:J33))","v":4.1678179255212244},null,"Metodologia sugerida:",{"$f":"IF($M$36=MIN($M$36,$N$36:$R$36),M8,\"Grupos - \"&INDEX({\"Todos\";\"Sem o maior\";\"Sem o menor\";\"Sem o maior e Sem o menor\";\"Sem os dois maiores\"},MATCH(MIN($N$36:$R$36),$N$36:$R$36,0)))","v":"Grupos - Sem o maior e Sem o menor"}]
[{"$nulls":11},"Preço estimado sugerido:",{"$f":"IF($M$37=M8,SMALL($M$34:$M$35,1),MIN(INDEX($N$35:$R$35, MATCH(MIN($N$36:$R$36), $N$36:$R$36, 0)),INDEX($N$34:$R$34, MATCH(MIN($N$36:$R$36), $N$36:$R$36, 0))))","v":4.1678179255212244}]
[{"$nulls":11},"Metodologia a adotar:",{"$f":"IF(INDEX(L19:S19,N39)=0,\"\",INDEX(L19:S19,N39))","v":""},1]

{"sheet":"ORIENTAÇÕES E ADVERTÊNCIAS","index":11,"n_rows":28,"n_cols":3,"rows_kept":28,"cut":false,"hidden":false,"merged":[]}
["A Norma N-440 estabelece critérios objetivos para pesquisa e análise crítica de preços de referência para aquisição de bens e contratação de serviços em geral."]
[]
["Esta planilha possui caráter unicamente sugestivo e foi elaborada visando melhorar a transparência dos processos de pesquisa de preços efetivados no âmbito da Codevasf, em suporte à aplicação da Norma N-440."]
[]
["O uso desta planilha é responsabilidade exclusiva do(a) analista que efetuar a pesquisa de preços, que deve conferir os dados inseridos e cálculos realizados para a obtenção do preço estimado."]
[]
["A N-440 apresenta os parâmetros para a aplicação de metodologia(s) de exclusão de preços inexequíveis, inconsistentes ou excessivamente elevados."]
[]
["Etapas de preenchimento da planilha e orientações:"]
["Etapa","Células Referenciadas","Descrição"]
[1,"C2 a C5","Insira as informações de processo, responsável e data referentes à pesquisa de preços."]
[2,"C7","Insira a descrição do item submetido à pesquisa de preços."]
[3,"H7","Insira a unidade de medida do item (unidade, comprimento, volume, etc)."]
[4,"J7","Insira a quantidade pesquisada para contratação."]
[5,"B7 a I16","Insira as informações pertinentes às licitações e contratações realizadas pela Administração Pública, se houver."]
[6,"G10 a H16","Informe o índice de atualização de preços, se for o caso, e a variação acumulada."]
[7,"I10 a I16","Insira o preço unitário atualizado de licitações e contratações realizadas pela Administração Pública, se houver."]
[8,"B19 a I29","Insira as informações obtidas em pesquisa direta de mercado (cotações), se houver."]
[9,"M38","Selecione a opção \"Automática (menor CV)\"."]
[10,"J10 a J38","Automaticamente, com base nas metodologias de exclusão de preços exibidas na Tabela Auxiliar, será indicada a metodologia com o menor Coeficiente de Variação (CV) entre os preços informados e se cada um será utilizado ou não no cálculo do preço estimado."]
[11,"M38","O(a) analista deve avaliar se aplicará a metodologia e o preço estimado sugeridos automaticamente ou se modificará a metodologia manualmente na lista suspensa existente na célula M38."]
[12,"S10 a S29","Caso o(a) analista selecione a opção de metodologia de exclusão de preços \"Por critério do(a) analista\", deverá preencher manualmente com \"Sim\" ou \"Não\", nas células S10 a S29, quais preços serão utilizados no cálculo do preço estimado."]
[13,"J33","Automaticamente, a célula J33 informa qual foi a metodologia de exclusão de preços adotada pelo(a) analista."]
[14,"J38","Automaticamente, a célula J38 informa o preço estimado calculado com base nas informações e seleções efetivadas pelo(a) analista."]
[15,"L7 a S37","Contém a Tabela Auxiliar pertinente às metodologias de exclusão de preços inexequíveis, inconsistentes ou excessivamente elevados. Apenas as células S10 a S29 são passíveis de preenchimento e se aplicam caso seja selecionada a metodologia de exclusão de preços \"Por critério do(a) analista\"."]
[16,null,"Replique as etapas acima em planilhas/abas individuais para cada item pesquisado. Para isso, crie cópia(s) das planilhas/abas pré-existentes."]
[]
["Existem células bloqueadas na planilha, caso apresentem divergências contate a AG/GCT."]

{"sheet":"Classes e CVs de referência","index":12,"n_rows":0,"n_cols":0,"rows_kept":0,"cut":false,"hidden":false,"merged":[]}

{"sheet":"índice de atualização","index":13,"n_rows":197,"n_cols":3,"rows_kept":197,"cut":false,"hidden":false,"merged":[]}
["\\\\drive2\\Boletim_de_Indices\\"]
[]
[]
[null,"IPA-EP-DI Suprimentos agropecuários","IPA-EP-DI Máquinas, aparelhos e equipamentos - Nro. Índice"]
[null,1417005,1416650]
["Data","11","11"]
["02/2010",463.50099999999998,332.84399999999999]
["03/2010",461.82600000000002,332.69099999999997]
["04/2010",460.60399999999998,334.238]
["05/2010",460.173,335.238]
["06/2010",456.04500000000002,338.30099999999999]
["07/2010",457.02499999999998,338.41800000000001]
["08/2010",462.53300000000002,339.95600000000002]
["09/2010",467.07400000000001,339.887]
["10/2010",477.09699999999998,340.59300000000002]
["11/2010",488.92899999999997,340.78800000000001]
["12/2010",496.95299999999997,341.36900000000003]
["01/2011",503.99099999999999,343.22699999999998]
["02/2011",508.27100000000002,344.923]
["03/2011",512.76099999999997,346.23899999999998]
["04/2011",511.202,345.79]
["05/2011",506.77,346.50599999999997]
["06/2011",518.51300000000003,346.19499999999999]
["07/2011",531.69200000000001,346.21499999999997]
["08/2011",530.03099999999995,347.32]
["09/2011",543.98599999999999,346.74900000000002]
["10/2011",565.97500000000002,346.44799999999998]
["11/2011",562.18100000000004,346.75900000000001]
["12/2011",558.75800000000004,347.137]
["01/2012",544.12699999999995,348.03399999999999]
["02/2012",539.35299999999995,348.81200000000001]
["03/2012",544.27700000000004,348.291]
["04/2012",556.62,349.04300000000001]
["05/2012",579.24800000000005,349.904]
["06/2012",591.56200000000001,350.983]
["07/2012",589.23500000000001,352.24900000000002]
["08/2012",598.995,353.8]
["09/2012",607.53599999999994,355.01900000000001]
["10/2012",607.31399999999996,354.596]
["11/2012",605.72500000000002,355.68900000000002]
["12/2012",603.74900000000002,356.46100000000001]
["01/2013",596.41899999999998,359.40600000000001]
["02/2013",588.10799999999995,361.06200000000001]
["03/2013",587.31200000000001,362.93200000000002]
["04/2013",578.53200000000004,363.42]
["05/2013",575.23400000000004,364.3]
["06/2013",585.90899999999999,364.88499999999999]
["07/2013",594.86699999999996,367.62299999999999]
["08/2013",595.87,370.23500000000001]
["09/2013",592.08199999999999,371.30700000000002]
["10/2013",580.96100000000001,372.38200000000001]
["11/2013",579.40200000000004,374.55900000000003]
["12/2013",585.85,375.67099999999999]
["01/2014",593.12099999999998,379.78399999999999]
["02/2014",602.24599999999998,381.33600000000001]
["03/2014",605.19500000000005,382.90199999999999]
["04/2014",601.16099999999994,384.697]
["05/2014",594.25099999999998,385.21499999999997]
["06/2014",594.31799999999998,386.327]
["07/2014",598.59699999999998,387.35700000000003]
["08/2014",608.88699999999994,388.47300000000001]
["09/2014",610.88699999999994,389.49]
["10/2014",616.84799999999996,390.42500000000001]
["11/2014",627.39400000000001,392.00900000000001]
["12/2014",632.28,393.35899999999998]
["01/2015",637.45899999999995,398.09699999999998]
["02/2015",650.08299999999997,403.11700000000002]
["03/2015",681.66099999999994,405.78899999999999]
["04/2015",689.47699999999998,410.101]
["05/2015",686.27,414.34]
["06/2015",700.10599999999999,415.89]
["07/2015",710.529,419.70699999999999]
["08/2015",727.54300000000001,422.14]
["09/2015",758.66,427.28399999999999]
["10/2015",756.81100000000004,431.71]
["11/2015",759.36500000000001,432.995]
["12/2015",763.01800000000003,436.40600000000001]
["01/2016",768.00900000000001,441.48899999999998]
["02/2016",759.11300000000006,443.27199999999999]
["03/2016",757.27599999999995,444.56299999999999]
["04/2016",751.923,447.38799999999998]
["05/2016",747.03899999999999,446.24299999999999]
["06/2016",749.822,446.81900000000002]
["07/2016",751.71900000000005,449.04599999999999]
["08/2016",747.63099999999997,449.04]
["09/2016",746.93899999999996,449.697]
["10/2016",738.15700000000004,449.90100000000001]
["11/2016",752.72400000000005,450.892]
["12/2016",758.08900000000006,450.49599999999998]
["01/2017",755.29300000000001,453.40800000000002]
["02/2017",747.66800000000001,457.56599999999997]
["03/2017",742.88199999999995,459.78899999999999]
["04/2017",729.76700000000005,461.87400000000002]
["05/2017",726.07899999999995,462.80700000000002]
["06/2017",720.87400000000002,461.83300000000003]
["07/2017",711.66200000000003,462.92500000000001]
["08/2017",706.56600000000003,463.04300000000001]
["09/2017",706.50800000000004,464.04700000000003]
["10/2017",724.71,464.72800000000001]
["11/2017",733.79,464.375]
["12/2017",744.58100000000002,466.57600000000002]
["01/2018",760.995,470.92599999999999]
["02/2018",750.803,473.36]
["03/2018",754.24599999999998,475.14800000000002]
["04/2018",768.1,476.92500000000001]
["05/2018",800.97199999999998,480.435]
["06/2018",828.27300000000002,483.53699999999998]
["07/2018",859.99900000000002,486.99599999999998]
["08/2018",889.36900000000003,489.68099999999998]
["09/2018",919.59199999999998,495.76]
["10/2018",895.67,500.62900000000002]
["11/2018",883.899,505.09500000000003]
["12/2018",889.78499999999997,505.584]
["01/2019",888.03599999999994,510.68400000000003]
["02/2019",875.87400000000002,512.649]
["03/2019",876.10599999999999,514.67399999999998]
["04/2019",879.55200000000002,516.85799999999995]
["05/2019",890.63699999999994,518.52599999999995]
["06/2019",882.58500000000004,518.68100000000004]
["07/2019",873.49,518.21799999999996]
["08/2019",878.20100000000002,519.28599999999994]
["09/2019",881.04700000000003,521.22500000000002]
["10/2019",874.10599999999999,521.29300000000001]
["11/2019",867.87599999999998,524.09400000000005]
["12/2019",867.548,523.07299999999998]
["01/2020",851.35,525.93600000000004]
["02/2020",857.92100000000005,530.41200000000003]
["03/2020",898.55700000000002,535.32500000000005]
["04/2020",922.476,544.90599999999995]
["05/2020",936.92100000000005,550.78]
["06/2020",943.35299999999995,556.32299999999998]
["07/2020",946.24,560.9]
["08/2020",955.09500000000003,564.54399999999998]
["09/2020",978.827,573.71100000000001]
["10/2020",1008.6559999999999,585.38]
["11/2020",1022.901,598.00900000000001]
["12/2020",1025.8820000000001,603.18299999999999]
["01/2021",1065.74,621.25099999999998]
["02/2021",1165.155,642.76700000000005]
["03/2021",1227.7149999999999,659.80799999999999]
["04/2021",1256.0930000000001,671.70399999999995]
["05/2021",1265.8879999999999,686.15700000000004]
["06/2021",1329.7149999999999,700.00199999999995]
["07/2021",1429.4760000000001,709.42700000000002]
["08/2021",1483.4860000000001,718.52700000000004]
["09/2021",1528.7360000000001,728.04499999999996]
["10/2021",1632.133,736.66899999999998]
["11/2021",1720.0119999999999,749.65200000000004]
["12/2021",1725.99,752.90499999999997]
["01/2022",1800.18,763.29399999999998]
["02/2022",1746.4359999999999,776.90099999999995]
["03/2022",1860.5830000000001,783.93200000000002]
["04/2022",1901.4190000000001,792.14300000000003]
["05/2022",1955.3309999999999,802.96100000000001]
["06/2022",1903.5239999999999,810.92600000000004]
["07/2022",1900.192,819.779]
["08/2022",1867.569,823.76700000000005]
["09/2022",1857.6189999999999,827.42200000000003]
["10/2022",1764.277,830.90200000000004]
["11/2022",1694.635,830.75199999999995]
["12/2022",1646.527,830.60299999999995]
["01/2023",1587.3489999999999,834.798]
["02/2023",1564.473,836.41]
["03/2023",1524.019,836.40200000000004]
["04/2023",1496.835,837.80100000000004]
["05/2023",1421.002,842.52]
["06/2023",1378.1890000000001,844.54300000000001]
["07/2023",1373.905,844.08299999999997]
["08/2023",1355.202,842.76599999999996]
["09/2023",1367.078,844.89800000000002]
["10/2023",1359.2919999999999,845.10400000000004]
["11/2023",1362.9359999999999,844.32]
["12/2023",1359.386,848.14099999999996]
["01/2024",1313.654,851.53700000000003]
["02/2024",1313.0309999999999,854.12400000000002]
["03/2024",1329.768,855.995]
["04/2024",1322.297,856.51300000000003]
["05/2024",1326.4929999999999,857.98500000000001]
["06/2024",1353.2840000000001,860.19]
["07/2024",1378.021,864.23]
["08/2024",1386.4760000000001,867.37199999999996]
["09/2024",1399.42,869.08299999999997]
["10/2024",1389.3989999999999,871.58699999999999]
["11/2024",1404.5630000000001,874.6]
["12/2024",1426.838,878.596]
["01/2025",1428.0309999999999,887.95799999999997]
["02/2025",1450.998,887.56100000000004]
["03/2025",1462.347,889.00099999999998]
["04/2025",1494.0530000000001,891.56799999999998]
["05/2025",1511.9459999999999,891.94100000000003]
["06/2025",1501.5360000000001,893.85599999999999]
["07/2025",1484.866,899.40800000000002]
["08/2025",1474.08,901.39300000000003]
["09/2025",1455.2370000000001,899.65599999999995]
["10/2025",1453.569]
["11/2025",1447.104]
["12/2025",1451.652]